Ticket #46133: dcmtk.mountainlion.main.log

File dcmtk.mountainlion.main.log, 51.5 KB (added by ryandesign (Ryan Schmidt), 7 years ago)
Line 
1version:1
2:msg:main --->  Computing dependencies for dcmtk:info:main .:debug:main dcmtk has no conflicts
3:debug:main Searching for dependency: cmake
4:debug:main Found Dependency: receipt exists for cmake
5:debug:main Searching for dependency: zlib
6:debug:main Found Dependency: receipt exists for zlib
7:debug:main Searching for dependency: libiconv
8:debug:main Found Dependency: receipt exists for libiconv
9:debug:main Searching for dependency: tcp_wrappers
10:debug:main Found Dependency: receipt exists for tcp_wrappers
11:debug:main Searching for dependency: libpng
12:debug:main Found Dependency: receipt exists for libpng
13:debug:main Searching for dependency: openssl
14:debug:main Found Dependency: receipt exists for openssl
15:debug:main Searching for dependency: tiff
16:debug:main Found Dependency: receipt exists for tiff
17:debug:main Searching for dependency: libxml2
18:debug:main Found Dependency: receipt exists for libxml2
19:msg:main
20:debug:main Executing org.macports.main (dcmtk)
21:debug:main changing euid/egid - current euid: 0 - current egid: 0
22:debug:main egid changed to: 501
23:debug:main euid changed to: 502
24:debug:archivefetch archivefetch phase started at Fri Dec  5 04:01:22 CST 2014
25:debug:archivefetch Executing org.macports.archivefetch (dcmtk)
26:debug:archivefetch Privilege de-escalation not attempted as not running as root.
27:debug:fetch fetch phase started at Fri Dec  5 04:01:22 CST 2014
28:notice:fetch --->  Fetching distfiles for dcmtk
29:debug:fetch Executing org.macports.fetch (dcmtk)
30:debug:fetch Privilege de-escalation not attempted as not running as root.
31:debug:checksum checksum phase started at Fri Dec  5 04:01:22 CST 2014
32:notice:checksum --->  Verifying checksums for dcmtk
33:debug:checksum Executing org.macports.checksum (dcmtk)
34:info:checksum --->  Checksumming dcmtk-3.6.1_20140617.tar.gz
35:debug:checksum Calculated (rmd160) is cdd103fbf3bf526909ae29f854623f634fff6d66
36:debug:checksum Correct (rmd160) checksum for dcmtk-3.6.1_20140617.tar.gz
37:debug:checksum Calculated (sha256) is c0aab5a3809e20f8b4eae2f181c77a1668d0665e86a590821a59808f45656cdc
38:debug:checksum Correct (sha256) checksum for dcmtk-3.6.1_20140617.tar.gz
39:debug:checksum Privilege de-escalation not attempted as not running as root.
40:debug:extract extract phase started at Fri Dec  5 04:01:22 CST 2014
41:notice:extract --->  Extracting dcmtk
42:debug:extract Executing org.macports.extract (dcmtk)
43:info:extract --->  Extracting dcmtk-3.6.1_20140617.tar.gz
44:debug:extract setting option extract.args to '/Volumes/Data/macports/distfiles/dcmtk/dcmtk-3.6.1_20140617.tar.gz'
45:debug:extract Environment:
46CC_PRINT_OPTIONS='YES'
47CC_PRINT_OPTIONS_FILE='/Volumes/Data/macports/mountainlion/var/macports/build/_Volumes_Data_macports_dports_graphics_dcmtk/dcmtk/work/.CC_PRINT_OPTIONS'
48CPATH='/Volumes/Data/macports/mountainlion/include'
49LIBRARY_PATH='/Volumes/Data/macports/mountainlion/lib'
50MACOSX_DEPLOYMENT_TARGET='10.8'
51:debug:extract Assembled command: 'cd "/Volumes/Data/macports/mountainlion/var/macports/build/_Volumes_Data_macports_dports_graphics_dcmtk/dcmtk/work" && /usr/bin/gzip -dc '/Volumes/Data/macports/distfiles/dcmtk/dcmtk-3.6.1_20140617.tar.gz' | /usr/bin/gnutar --no-same-owner -xf -'
52:debug:extract Executing command line:  cd "/Volumes/Data/macports/mountainlion/var/macports/build/_Volumes_Data_macports_dports_graphics_dcmtk/dcmtk/work" && /usr/bin/gzip -dc '/Volumes/Data/macports/distfiles/dcmtk/dcmtk-3.6.1_20140617.tar.gz' | /usr/bin/gnutar --no-same-owner -xf -
53:debug:extract euid/egid changed to: 0/0
54:debug:extract chowned /Volumes/Data/macports/mountainlion/var/macports/build/_Volumes_Data_macports_dports_graphics_dcmtk/dcmtk/work to macports
55:debug:extract euid/egid changed to: 502/501
56:debug:extract Privilege de-escalation not attempted as not running as root.
57:debug:patch patch phase started at Fri Dec  5 04:01:24 CST 2014
58:debug:patch Executing org.macports.patch (dcmtk)
59:debug:patch Privilege de-escalation not attempted as not running as root.
60:debug:configure configure phase started at Fri Dec  5 04:01:24 CST 2014
61:notice:configure --->  Configuring dcmtk
62:debug:configure Using compiler 'Xcode Clang'
63:debug:configure Executing proc-pre-org.macports.configure-configure-0
64:debug:configure Executing org.macports.configure (dcmtk)
65:debug:configure Environment:
66CC='/usr/bin/clang'
67CC_PRINT_OPTIONS='YES'
68CC_PRINT_OPTIONS_FILE='/Volumes/Data/macports/mountainlion/var/macports/build/_Volumes_Data_macports_dports_graphics_dcmtk/dcmtk/work/.CC_PRINT_OPTIONS'
69CFLAGS='-pipe -Os -arch x86_64'
70CPATH='/Volumes/Data/macports/mountainlion/include'
71CPPFLAGS='-I/Volumes/Data/macports/mountainlion/include'
72CXX='/usr/bin/clang++'
73CXXFLAGS='-pipe -Os -arch x86_64 -stdlib=libstdc++'
74F77FLAGS='-m64'
75F90FLAGS='-pipe -Os -m64'
76FCFLAGS='-pipe -Os -m64'
77FFLAGS='-pipe -Os'
78INSTALL='/usr/bin/install -c'
79LDFLAGS='-L/Volumes/Data/macports/mountainlion/lib -Wl,-headerpad_max_install_names -arch x86_64'
80LIBRARY_PATH='/Volumes/Data/macports/mountainlion/lib'
81MACOSX_DEPLOYMENT_TARGET='10.8'
82OBJC='/usr/bin/clang'
83OBJCFLAGS='-pipe -Os -arch x86_64'
84OBJCXX='/usr/bin/clang++'
85OBJCXXFLAGS='-pipe -Os -arch x86_64 -stdlib=libstdc++'
86__CFPREFERENCES_AVOID_DAEMON='1'
87:debug:configure Assembled command: 'cd "/Volumes/Data/macports/mountainlion/var/macports/build/_Volumes_Data_macports_dports_graphics_dcmtk/dcmtk/work/dcmtk-3.6.1_20140617" && /Volumes/Data/macports/mountainlion/bin/cmake -DCMAKE_INSTALL_PREFIX=/Volumes/Data/macports/mountainlion -DCMAKE_VERBOSE_MAKEFILE=ON -DCMAKE_COLOR_MAKEFILE=ON -DCMAKE_BUILD_TYPE=Release -DCMAKE_BUILD_WITH_INSTALL_RPATH=ON -DCMAKE_INSTALL_RPATH=/Volumes/Data/macports/mountainlion/lib -DCMAKE_INSTALL_NAME_DIR=/Volumes/Data/macports/mountainlion/lib -DCMAKE_SYSTEM_PREFIX_PATH="/Volumes/Data/macports/mountainlion;/usr" -DCMAKE_MODULE_PATH=/Volumes/Data/macports/mountainlion/share/cmake/modules -DCMAKE_FIND_FRAMEWORK=LAST -Wno-dev -DDCMTK_WITH_ICONV=ON -DDCMTK_WITH_PRIVATE_TAGS=OFF -DDCMTK_WITH_DOXYGEN=OFF -DBUILD_SHARED_LIBS=ON -DDCMTK_WITH_SNDFILE=OFF -DDCMTK_WITH_WRAP=ON -DDCMTK_WITH_PNG=ON -DDCMTK_WITH_OPENSSL=ON -DDCMTK_WITH_TIFF=ON -DDCMTK_WITH_XML=ON -DCMAKE_C_FLAGS_RELEASE="-DNDEBUG" -DCMAKE_CXX_FLAGS_RELEASE="-DNDEBUG" -DCMAKE_OSX_ARCHITECTURES="x86_64" -DCMAKE_OSX_DEPLOYMENT_TARGET="10.8" -DCMAKE_OSX_SYSROOT="/"'
88:debug:configure Executing command line:  cd "/Volumes/Data/macports/mountainlion/var/macports/build/_Volumes_Data_macports_dports_graphics_dcmtk/dcmtk/work/dcmtk-3.6.1_20140617" && /Volumes/Data/macports/mountainlion/bin/cmake -DCMAKE_INSTALL_PREFIX=/Volumes/Data/macports/mountainlion -DCMAKE_VERBOSE_MAKEFILE=ON -DCMAKE_COLOR_MAKEFILE=ON -DCMAKE_BUILD_TYPE=Release -DCMAKE_BUILD_WITH_INSTALL_RPATH=ON -DCMAKE_INSTALL_RPATH=/Volumes/Data/macports/mountainlion/lib -DCMAKE_INSTALL_NAME_DIR=/Volumes/Data/macports/mountainlion/lib -DCMAKE_SYSTEM_PREFIX_PATH="/Volumes/Data/macports/mountainlion;/usr" -DCMAKE_MODULE_PATH=/Volumes/Data/macports/mountainlion/share/cmake/modules -DCMAKE_FIND_FRAMEWORK=LAST -Wno-dev -DDCMTK_WITH_ICONV=ON -DDCMTK_WITH_PRIVATE_TAGS=OFF -DDCMTK_WITH_DOXYGEN=OFF -DBUILD_SHARED_LIBS=ON -DDCMTK_WITH_SNDFILE=OFF -DDCMTK_WITH_WRAP=ON -DDCMTK_WITH_PNG=ON -DDCMTK_WITH_OPENSSL=ON -DDCMTK_WITH_TIFF=ON -DDCMTK_WITH_XML=ON -DCMAKE_C_FLAGS_RELEASE="-DNDEBUG" -DCMAKE_CXX_FLAGS_RELEASE="-DNDEBUG" -DCMAKE_OSX_ARCHITECTURES="x86_64" -DCMAKE_OSX_DEPLOYMENT_TARGET="10.8" -DCMAKE_OSX_SYSROOT="/"
89:info:configure -- The C compiler identification is AppleClang 4.1.0.4211166
90:info:configure -- The CXX compiler identification is AppleClang 4.1.0.4211166
91:info:configure -- Check for working C compiler: /usr/bin/clang
92:info:configure -- Check for working C compiler: /usr/bin/clang -- works
93:info:configure -- Detecting C compiler ABI info
94:info:configure -- Detecting C compiler ABI info - done
95:info:configure -- Check for working CXX compiler: /usr/bin/clang++
96:info:configure -- Check for working CXX compiler: /usr/bin/clang++ -- works
97:info:configure -- Detecting CXX compiler ABI info
98:info:configure -- Detecting CXX compiler ABI info - done
99:info:configure -- Performing Test GXX_SUPPORTS_VISIBILITY
100:info:configure -- Performing Test GXX_SUPPORTS_VISIBILITY - Success
101:info:configure -- Info: DCMTK TIFF support will be enabled
102:info:configure -- Info: DCMTK PNG support will be enabled
103:info:configure -- Info: DCMTK OPENSSL support will be enabled
104:info:configure -- Info: DCMTK XML support will be enabled
105:info:configure -- Info: DCMTK ZLIB support will be enabled
106:info:configure -- Found LIBICONV: /Volumes/Data/macports/mountainlion/lib/libiconv.dylib 
107:info:configure -- Found LIBCHARSET: /Volumes/Data/macports/mountainlion/lib/libcharset.dylib 
108:info:configure -- Info: DCMTK ICONV support will be enabled
109:info:configure -- Found WRAP: /Volumes/Data/macports/mountainlion/lib/libwrap.dylib 
110:info:configure -- Info: DCMTK WRAP support will be enabled
111:info:configure -- Performing Test LIBICONV_SECOND_ARGUMENT_CONST
112:info:configure -- Performing Test LIBICONV_SECOND_ARGUMENT_CONST - Failed
113:info:configure -- Info: DCMTK's builtin private dictionary support will be disabled
114:info:configure -- Info: Thread support will be enabled
115:info:configure -- Info: Wide char file I/O functions will be disabled
116:info:configure -- Info: Wide char main function for command line tools will be disabled
117:info:configure -- Looking for sys/types.h
118:info:configure -- Looking for sys/types.h - found
119:info:configure -- Looking for stdint.h
120:info:configure -- Looking for stdint.h - found
121:info:configure -- Looking for stddef.h
122:info:configure -- Looking for stddef.h - found
123:info:configure -- Check size of char
124:info:configure -- Check size of char - done
125:info:configure -- Check size of double
126:info:configure -- Check size of double - done
127:info:configure -- Check size of float
128:info:configure -- Check size of float - done
129:info:configure -- Check size of int
130:info:configure -- Check size of int - done
131:info:configure -- Check size of long
132:info:configure -- Check size of long - done
133:info:configure -- Check size of short
134:info:configure -- Check size of short - done
135:info:configure -- Check size of void*
136:info:configure -- Check size of void* - done
137:info:configure -- Looking for __FUNCTION__
138:info:configure -- Looking for __FUNCTION__ - found
139:info:configure -- Looking for __PRETTY_FUNCTION__
140:info:configure -- Looking for __PRETTY_FUNCTION__ - found
141:info:configure -- Looking for __func__
142:info:configure -- Looking for __func__ - found
143:info:configure -- Looking for C++ include errno.h
144:info:configure -- Looking for C++ include errno.h - found
145:info:configure -- Looking for C++ include dirent.h
146:info:configure -- Looking for C++ include dirent.h - found
147:info:configure -- Looking for C++ include fcntl.h
148:info:configure -- Looking for C++ include fcntl.h - found
149:info:configure -- Looking for C++ include fstream
150:info:configure -- Looking for C++ include fstream - found
151:info:configure -- Looking for C++ include fstream.h
152:info:configure -- Looking for C++ include fstream.h - found
153:info:configure -- Looking for C++ include fnmatch.h
154:info:configure -- Looking for C++ include fnmatch.h - found
155:info:configure -- Looking for C++ include float.h
156:info:configure -- Looking for C++ include float.h - found
157:info:configure -- Looking for C++ include grp.h
158:info:configure -- Looking for C++ include grp.h - found
159:info:configure -- Looking for C++ include malloc.h
160:info:configure -- Looking for C++ include malloc.h - not found
161:info:configure -- Looking for C++ include math.h
162:info:configure -- Looking for C++ include math.h - found
163:info:configure -- Looking for C++ include ieeefp.h
164:info:configure -- Looking for C++ include ieeefp.h - not found
165:info:configure -- Looking for C++ include inttypes.h
166:info:configure -- Looking for C++ include inttypes.h - found
167:info:configure -- Looking for C++ include iomanip
168:info:configure -- Looking for C++ include iomanip - found
169:info:configure -- Looking for C++ include iomanip.h
170:info:configure -- Looking for C++ include iomanip.h - found
171:info:configure -- Looking for C++ include iostream
172:info:configure -- Looking for C++ include iostream - found
173:info:configure -- Looking for C++ include iostream.h
174:info:configure -- Looking for C++ include iostream.h - found
175:info:configure -- Looking for C++ include io.h
176:info:configure -- Looking for C++ include io.h - not found
177:info:configure -- Looking for C++ include iso646.h
178:info:configure -- Looking for C++ include iso646.h - found
179:info:configure -- Looking for C++ include png.h
180:info:configure -- Looking for C++ include png.h - found
181:info:configure -- Looking for C++ include limits.h
182:info:configure -- Looking for C++ include limits.h - found
183:info:configure -- Looking for C++ include climits
184:info:configure -- Looking for C++ include climits - found
185:info:configure -- Looking for C++ include locale.h
186:info:configure -- Looking for C++ include locale.h - found
187:info:configure -- Looking for C++ include ndir.h
188:info:configure -- Looking for C++ include ndir.h - not found
189:info:configure -- Looking for C++ include netdb.h
190:info:configure -- Looking for C++ include netdb.h - found
191:info:configure -- Looking for C++ include new.h
192:info:configure -- Looking for C++ include new.h - found
193:info:configure -- Looking for C++ include pwd.h
194:info:configure -- Looking for C++ include pwd.h - found
195:info:configure -- Looking for C++ include semaphore.h
196:info:configure -- Looking for C++ include semaphore.h - found
197:info:configure -- Looking for C++ include setjmp.h
198:info:configure -- Looking for C++ include setjmp.h - found
199:info:configure -- Looking for C++ include sstream
200:info:configure -- Looking for C++ include sstream - found
201:info:configure -- Looking for C++ include sstream.h
202:info:configure -- Looking for C++ include sstream.h - not found
203:info:configure -- Looking for C++ include stat.h
204:info:configure -- Looking for C++ include stat.h - not found
205:info:configure -- Looking for C++ include stdbool.h
206:info:configure -- Looking for C++ include stdbool.h - found
207:info:configure -- Looking for C++ include cstddef
208:info:configure -- Looking for C++ include cstddef - found
209:info:configure -- Looking for C++ include cstdint
210:info:configure -- Looking for C++ include cstdint - not found
211:info:configure -- Looking for C++ include stdio.h
212:info:configure -- Looking for C++ include stdio.h - found
213:info:configure -- Looking for C++ include cstdio
214:info:configure -- Looking for C++ include cstdio - found
215:info:configure -- Looking for C++ include strings.h
216:info:configure -- Looking for C++ include strings.h - found
217:info:configure -- Looking for C++ include string.h
218:info:configure -- Looking for C++ include string.h - found
219:info:configure -- Looking for C++ include strstream.h
220:info:configure -- Looking for C++ include strstream.h - not found
221:info:configure -- Looking for C++ include strstream
222:info:configure -- Looking for C++ include strstream - found
223:info:configure -- Looking for C++ include strstrea.h
224:info:configure -- Looking for C++ include strstrea.h - not found
225:info:configure -- Looking for C++ include synch.h
226:info:configure -- Looking for C++ include synch.h - not found
227:info:configure -- Looking for C++ include syslog.h
228:info:configure -- Looking for C++ include syslog.h - found
229:info:configure -- Looking for C++ include sys/errno.h
230:info:configure -- Looking for C++ include sys/errno.h - found
231:info:configure -- Looking for C++ include sys/dir.h
232:info:configure -- Looking for C++ include sys/dir.h - found
233:info:configure -- Looking for C++ include sys/file.h
234:info:configure -- Looking for C++ include sys/file.h - found
235:info:configure -- Looking for C++ include sys/ndir.h
236:info:configure -- Looking for C++ include sys/ndir.h - not found
237:info:configure -- Looking for C++ include sys/param.h
238:info:configure -- Looking for C++ include sys/param.h - found
239:info:configure -- Looking for C++ include sys/resource.h
240:info:configure -- Looking for C++ include sys/resource.h - found
241:info:configure -- Looking for C++ include sys/select.h
242:info:configure -- Looking for C++ include sys/select.h - found
243:info:configure -- Looking for C++ include sys/syscall.h
244:info:configure -- Looking for C++ include sys/syscall.h - found
245:info:configure -- Looking for C++ include sys/time.h
246:info:configure -- Looking for C++ include sys/time.h - found
247:info:configure -- Looking for C++ include sys/timeb.h
248:info:configure -- Looking for C++ include sys/timeb.h - found
249:info:configure -- Looking for C++ include sys/utime.h
250:info:configure -- Looking for C++ include sys/utime.h - not found
251:info:configure -- Looking for C++ include sys/utsname.h
252:info:configure -- Looking for C++ include sys/utsname.h - found
253:info:configure -- Looking for C++ include sys/wait.h
254:info:configure -- Looking for C++ include sys/wait.h - found
255:info:configure -- Looking for C++ include sys/socket.h
256:info:configure -- Looking for C++ include sys/socket.h - found
257:info:configure -- Looking for C++ include thread.h
258:info:configure -- Looking for C++ include thread.h - not found
259:info:configure -- Looking for C++ include sys/stat.h
260:info:configure -- Looking for C++ include sys/stat.h - found
261:info:configure -- Looking for C++ include time.h
262:info:configure -- Looking for C++ include time.h - found
263:info:configure -- Looking for C++ include unistd.h
264:info:configure -- Looking for C++ include unistd.h - found
265:info:configure -- Looking for C++ include unix.h
266:info:configure -- Looking for C++ include unix.h - not found
267:info:configure -- Looking for C++ include utime.h
268:info:configure -- Looking for C++ include utime.h - found
269:info:configure -- Looking for C++ include wchar.h
270:info:configure -- Looking for C++ include wchar.h - found
271:info:configure -- Looking for C++ include wctype.h
272:info:configure -- Looking for C++ include wctype.h - found
273:info:configure -- Looking for C++ include alloca.h
274:info:configure -- Looking for C++ include alloca.h - found
275:info:configure -- Looking for C++ include arpa/inet.h
276:info:configure -- Looking for C++ include arpa/inet.h - found
277:info:configure -- Looking for C++ include ctype.h
278:info:configure -- Looking for C++ include ctype.h - found
279:info:configure -- Looking for C++ include memory.h
280:info:configure -- Looking for C++ include memory.h - found
281:info:configure -- Looking for C++ include pthread.h
282:info:configure -- Looking for C++ include pthread.h - found
283:info:configure -- Looking for C++ include libc.h
284:info:configure -- Looking for C++ include libc.h - found
285:info:configure -- Looking for C++ include stdlib.h
286:info:configure -- Looking for C++ include stdlib.h - found
287:info:configure -- Looking for C++ include stdarg.h
288:info:configure -- Looking for C++ include stdarg.h - found
289:info:configure -- Looking for C++ include cstdarg
290:info:configure -- Looking for C++ include cstdarg - found
291:info:configure -- Looking for C++ include signal.h
292:info:configure -- Looking for C++ include signal.h - found
293:info:configure -- Looking for include files sys/types.h, netinet/in_systm.h
294:info:configure -- Looking for include files sys/types.h, netinet/in_systm.h - found
295:info:configure -- Looking for 3 include files sys/types.h, ..., netinet/in.h
296:info:configure -- Looking for 3 include files sys/types.h, ..., netinet/in.h - found
297:info:configure -- Looking for 4 include files sys/types.h, ..., netinet/tcp.h
298:info:configure -- Looking for 4 include files sys/types.h, ..., netinet/tcp.h - found
299:info:configure -- Looking for connect
300:info:configure -- Looking for connect - found
301:info:configure -- Looking for accept
302:info:configure -- Looking for accept - found
303:info:configure -- Looking for access
304:info:configure -- Looking for access - found
305:info:configure -- Looking for bcmp
306:info:configure -- Looking for bcmp - found
307:info:configure -- Looking for bcopy
308:info:configure -- Looking for bcopy - found
309:info:configure -- Looking for bind
310:info:configure -- Looking for bind - found
311:info:configure -- Looking for bzero
312:info:configure -- Looking for bzero - found
313:info:configure -- Looking for cuserid
314:info:configure -- Looking for cuserid - not found
315:info:configure -- Looking for _doprnt
316:info:configure -- Looking for _doprnt - not found
317:info:configure -- Looking for finite
318:info:configure -- Looking for finite - found
319:info:configure -- Looking for flock
320:info:configure -- Looking for flock - found
321:info:configure -- Looking for fork
322:info:configure -- Looking for fork - found
323:info:configure -- Looking for fseeko
324:info:configure -- Looking for fseeko - found
325:info:configure -- Looking for ftime
326:info:configure -- Looking for ftime - found
327:info:configure -- Looking for getaddrinfo
328:info:configure -- Looking for getaddrinfo - found
329:info:configure -- Looking for getenv
330:info:configure -- Looking for getenv - found
331:info:configure -- Looking for geteuid
332:info:configure -- Looking for geteuid - found
333:info:configure -- Looking for getgrnam
334:info:configure -- Looking for getgrnam - found
335:info:configure -- Looking for gethostbyname
336:info:configure -- Looking for gethostbyname - found
337:info:configure -- Looking for gethostbyname_r
338:info:configure -- Looking for gethostbyname_r - not found
339:info:configure -- Looking for gethostbyaddr_r
340:info:configure -- Looking for gethostbyaddr_r - not found
341:info:configure -- Looking for getgrnam_r
342:info:configure -- Looking for getgrnam_r - found
343:info:configure -- Looking for getpwnam_r
344:info:configure -- Looking for getpwnam_r - found
345:info:configure -- Looking for gethostname
346:info:configure -- Looking for gethostname - found
347:info:configure -- Looking for gethostid
348:info:configure -- Looking for gethostid - found
349:info:configure -- Looking for getlogin
350:info:configure -- Looking for getlogin - found
351:info:configure -- Looking for getpid
352:info:configure -- Looking for getpid - found
353:info:configure -- Looking for getpwnam
354:info:configure -- Looking for getpwnam - found
355:info:configure -- Looking for getsockname
356:info:configure -- Looking for getsockname - found
357:info:configure -- Looking for getsockopt
358:info:configure -- Looking for getsockopt - found
359:info:configure -- Looking for getuid
360:info:configure -- Looking for getuid - found
361:info:configure -- Looking for gmtime_r
362:info:configure -- Looking for gmtime_r - found
363:info:configure -- Looking for index
364:info:configure -- Looking for index - found
365:info:configure -- Looking for isinf
366:info:configure -- Looking for isinf - found
367:info:configure -- Looking for isnan
368:info:configure -- Looking for isnan - found
369:info:configure -- Looking for itoa
370:info:configure -- Looking for itoa - not found
371:info:configure -- Looking for listen
372:info:configure -- Looking for listen - found
373:info:configure -- Looking for localtime_r
374:info:configure -- Looking for localtime_r - found
375:info:configure -- Looking for lockf
376:info:configure -- Looking for lockf - found
377:info:configure -- Looking for lstat
378:info:configure -- Looking for lstat - found
379:info:configure -- Looking for malloc_debug
380:info:configure -- Looking for malloc_debug - found
381:info:configure -- Looking for mbstowcs
382:info:configure -- Looking for mbstowcs - found
383:info:configure -- Looking for wcstombs
384:info:configure -- Looking for wcstombs - found
385:info:configure -- Looking for memcmp
386:info:configure -- Looking for memcmp - found
387:info:configure -- Looking for memcpy
388:info:configure -- Looking for memcpy - found
389:info:configure -- Looking for memmove
390:info:configure -- Looking for memmove - found
391:info:configure -- Looking for memset
392:info:configure -- Looking for memset - found
393:info:configure -- Looking for mkstemp
394:info:configure -- Looking for mkstemp - found
395:info:configure -- Looking for mktemp
396:info:configure -- Looking for mktemp - found
397:info:configure -- Looking for rindex
398:info:configure -- Looking for rindex - found
399:info:configure -- Looking for select
400:info:configure -- Looking for select - found
401:info:configure -- Looking for setsockopt
402:info:configure -- Looking for setsockopt - found
403:info:configure -- Looking for setuid
404:info:configure -- Looking for setuid - found
405:info:configure -- Looking for sleep
406:info:configure -- Looking for sleep - found
407:info:configure -- Looking for socket
408:info:configure -- Looking for socket - found
409:info:configure -- Looking for stat
410:info:configure -- Looking for stat - found
411:info:configure -- Looking for strchr
412:info:configure -- Looking for strchr - found
413:info:configure -- Looking for strdup
414:info:configure -- Looking for strdup - found
415:info:configure -- Looking for strerror
416:info:configure -- Looking for strerror - found
417:info:configure -- Looking for strlcat
418:info:configure -- Looking for strlcat - found
419:info:configure -- Looking for strlcpy
420:info:configure -- Looking for strlcpy - found
421:info:configure -- Looking for strstr
422:info:configure -- Looking for strstr - found
423:info:configure -- Looking for strtoul
424:info:configure -- Looking for strtoul - found
425:info:configure -- Looking for sysinfo
426:info:configure -- Looking for sysinfo - not found
427:info:configure -- Looking for tempnam
428:info:configure -- Looking for tempnam - found
429:info:configure -- Looking for tmpnam
430:info:configure -- Looking for tmpnam - found
431:info:configure -- Looking for uname
432:info:configure -- Looking for uname - found
433:info:configure -- Looking for usleep
434:info:configure -- Looking for usleep - found
435:info:configure -- Looking for _vsnprintf_s
436:info:configure -- Looking for _vsnprintf_s - not found
437:info:configure -- Looking for vfprintf_s
438:info:configure -- Looking for vfprintf_s - not found
439:info:configure -- Looking for vprintf
440:info:configure -- Looking for vprintf - found
441:info:configure -- Looking for vsnprintf
442:info:configure -- Looking for vsnprintf - found
443:info:configure -- Looking for vsprintf_s
444:info:configure -- Looking for vsprintf_s - not found
445:info:configure -- Looking for wait3
446:info:configure -- Looking for wait3 - found
447:info:configure -- Looking for waitpid
448:info:configure -- Looking for waitpid - found
449:info:configure -- Looking for _findfirst
450:info:configure -- Looking for _findfirst - not found
451:info:configure -- Looking for nanosleep
452:info:configure -- Looking for nanosleep - found
453:info:configure -- Looking for prototype of isinf
454:info:configure -- Looking for prototype of isinf - not found.
455:info:configure -- Looking for prototype of isnan
456:info:configure -- Looking for prototype of isnan - not found.
457:info:configure -- Looking for prototype of finite
458:info:configure -- Looking for prototype of finite - found
459:info:configure -- Looking for prototype of flock
460:info:configure -- Looking for prototype of flock - found
461:info:configure -- Looking for prototype of gethostbyname
462:info:configure -- Looking for prototype of gethostbyname - found
463:info:configure -- Looking for prototype of gethostbyname_r
464:info:configure -- Looking for prototype of gethostbyname_r - not found.
465:info:configure -- Looking for prototype of gethostid
466:info:configure -- Looking for prototype of gethostid - found
467:info:configure -- Looking for prototype of bzero
468:info:configure -- Looking for prototype of bzero - found
469:info:configure -- Looking for prototype of gethostname
470:info:configure -- Looking for prototype of gethostname - found
471:info:configure -- Looking for prototype of waitpid
472:info:configure -- Looking for prototype of waitpid - found
473:info:configure -- Looking for prototype of wait3
474:info:configure -- Looking for prototype of wait3 - found
475:info:configure -- Looking for prototype of usleep
476:info:configure -- Looking for prototype of usleep - found
477:info:configure -- Looking for prototype of accept
478:info:configure -- Looking for prototype of accept - found
479:info:configure -- Looking for prototype of bind
480:info:configure -- Looking for prototype of bind - found
481:info:configure -- Looking for prototype of getsockname
482:info:configure -- Looking for prototype of getsockname - found
483:info:configure -- Looking for prototype of getsockopt
484:info:configure -- Looking for prototype of getsockopt - found
485:info:configure -- Looking for prototype of setsockopt
486:info:configure -- Looking for prototype of setsockopt - found
487:info:configure -- Looking for prototype of socket
488:info:configure -- Looking for prototype of socket - found
489:info:configure -- Looking for prototype of listen
490:info:configure -- Looking for prototype of listen - found
491:info:configure -- Looking for prototype of std::vfprintf
492:info:configure -- Looking for prototype of std::vfprintf - found
493:info:configure -- Looking for prototype of std::vsnprintf
494:info:configure -- Looking for prototype of std::vsnprintf - found
495:info:configure -- Looking for prototype of _stricmp
496:info:configure -- Looking for prototype of _stricmp - not found.
497:info:configure -- Looking for prototype of socklen_t definition
498:info:configure -- Looking for prototype of socklen_t definition - found
499:info:configure -- Looking for prototype of gettimeofday
500:info:configure -- Looking for prototype of gettimeofday - found
501:info:configure -- Looking for prototype of connect
502:info:configure -- Looking for prototype of connect - found
503:info:configure -- Looking for prototype of mkstemp
504:info:configure -- Looking for prototype of mkstemp - found
505:info:configure -- Looking for prototype of mktemp
506:info:configure -- Looking for prototype of mktemp - found
507:info:configure -- Looking for prototype of select
508:info:configure -- Looking for prototype of select - found
509:info:configure -- Looking for prototype of strcasecmp
510:info:configure -- Looking for prototype of strcasecmp - found
511:info:configure -- Looking for prototype of strncasecmp
512:info:configure -- Looking for prototype of strncasecmp - found
513:info:configure -- Looking for prototype of strerror_r
514:info:configure -- Looking for prototype of strerror_r - found
515:info:configure -- Looking for prototype of std::ios_base::openmode definition
516:info:configure -- Looking for prototype of std::ios_base::openmode definition - found
517:info:configure -- Looking for prototype of pthread_rwlock_init
518:info:configure -- Looking for prototype of pthread_rwlock_init - found
519:info:configure -- Looking for prototype of __sync_add_and_fetch((int*)0,0)
520:info:configure -- Looking for prototype of __sync_add_and_fetch((int*)0,0) - found
521:info:configure -- Looking for prototype of __sync_sub_and_fetch((int*)0,0)
522:info:configure -- Looking for prototype of __sync_sub_and_fetch((int*)0,0) - found
523:info:configure -- Looking for prototype of InterlockedIncrement((long*)0)
524:info:configure -- Looking for prototype of InterlockedIncrement((long*)0) - not found.
525:info:configure -- Looking for prototype of InterlockedDecrement((long*)0)
526:info:configure -- Looking for prototype of InterlockedDecrement((long*)0) - not found.
527:info:configure -- Looking for prototype of nanosleep
528:info:configure -- Looking for prototype of nanosleep - found
529:info:configure -- Looking for prototype of uchar definition
530:info:configure -- Looking for prototype of uchar definition - not found.
531:info:configure -- Looking for prototype of ushort definition
532:info:configure -- Looking for prototype of ushort definition - found
533:info:configure -- Looking for prototype of uint definition
534:info:configure -- Looking for prototype of uint definition - found
535:info:configure -- Looking for prototype of ulong definition
536:info:configure -- Looking for prototype of ulong definition - not found.
537:info:configure -- Looking for prototype of longlong definition
538:info:configure -- Looking for prototype of longlong definition - not found.
539:info:configure -- Looking for prototype of ulonglong definition
540:info:configure -- Looking for prototype of ulonglong definition - not found.
541:info:configure -- Looking for prototype of long long definition
542:info:configure -- Looking for prototype of long long definition - found
543:info:configure -- Looking for prototype of unsigned long long definition
544:info:configure -- Looking for prototype of unsigned long long definition - found
545:info:configure -- Checking signedness of char
546:info:configure -- Checking signedness of char -- signed
547:info:configure -- Checking whether C++ type bool exists
548:info:configure -- Checking whether C++ type bool exists -- yes
549:info:configure -- Checking whether pthread_t is an integer type
550:info:configure -- Checking whether pthread_t is an integer type -- no
551:info:configure -- Checking whether typename works correctly
552:info:configure -- Checking whether typename works correctly -- yes
553:info:configure -- Checking whether ENAMETOOLONG is defined
554:info:configure -- Checking whether ENAMETOOLONG is defined -- yes
555:info:configure -- Checking whether strerror_r returns an int
556:info:configure -- Checking whether strerror_r returns an int -- yes
557:info:configure -- Checking whether variable length arrays are supported
558:info:configure -- Checking whether variable length arrays are supported -- yes
559:info:configure -- Checking whether std::ios::nocreate exists
560:info:configure -- Checking whether std::ios::nocreate exists -- no
561:info:configure -- Checking whether explicit large file support is available
562:info:configure -- Checking whether explicit large file support is available -- no
563:info:configure -- Checking whether socket functions accept an int* argument
564:info:configure -- Checking whether socket functions accept an int* argument -- no
565:info:configure -- Checking whether select() accepts an int* argument
566:info:configure -- Checking whether select() accepts an int* argument -- no
567:info:configure -- Looking for pthread_key_create in pthread
568:info:configure -- Looking for pthread_key_create in pthread - found
569:info:configure -- Looking for sem_init in rt
570:info:configure -- Looking for sem_init in rt - not found
571:info:configure -- Looking for CMake command CONFIGURE_PACKAGE_CONFIG_FILE
572:info:configure -- Looking for CMake command CONFIGURE_PACKAGE_CONFIG_FILE - found
573:info:configure -- Looking for CMake command WRITE_BASIC_PACKAGE_VERSION_FILE
574:info:configure -- Looking for CMake command WRITE_BASIC_PACKAGE_VERSION_FILE - found
575:info:configure -- Configuring done
576:info:configure -- Generating done
577:info:configure -- Build files have been written to: /Volumes/Data/macports/mountainlion/var/macports/build/_Volumes_Data_macports_dports_graphics_dcmtk/dcmtk/work/dcmtk-3.6.1_20140617
578:debug:configure Privilege de-escalation not attempted as not running as root.
579:debug:build build phase started at Fri Dec  5 04:02:56 CST 2014
580:notice:build --->  Building dcmtk
581:debug:build Executing org.macports.build (dcmtk)
582:debug:build Environment:
583CC_PRINT_OPTIONS='YES'
584CC_PRINT_OPTIONS_FILE='/Volumes/Data/macports/mountainlion/var/macports/build/_Volumes_Data_macports_dports_graphics_dcmtk/dcmtk/work/.CC_PRINT_OPTIONS'
585CPATH='/Volumes/Data/macports/mountainlion/include'
586LIBRARY_PATH='/Volumes/Data/macports/mountainlion/lib'
587MACOSX_DEPLOYMENT_TARGET='10.8'
588:debug:build Assembled command: 'cd "/Volumes/Data/macports/mountainlion/var/macports/build/_Volumes_Data_macports_dports_graphics_dcmtk/dcmtk/work/dcmtk-3.6.1_20140617" && /usr/bin/make -w all'
589:debug:build Executing command line:  cd "/Volumes/Data/macports/mountainlion/var/macports/build/_Volumes_Data_macports_dports_graphics_dcmtk/dcmtk/work/dcmtk-3.6.1_20140617" && /usr/bin/make -w all
590:info:build make: Entering directory `/Volumes/Data/macports/mountainlion/var/macports/build/_Volumes_Data_macports_dports_graphics_dcmtk/dcmtk/work/dcmtk-3.6.1_20140617'
591:info:build /Volumes/Data/macports/mountainlion/bin/cmake -H/Volumes/Data/macports/mountainlion/var/macports/build/_Volumes_Data_macports_dports_graphics_dcmtk/dcmtk/work/dcmtk-3.6.1_20140617 -B/Volumes/Data/macports/mountainlion/var/macports/build/_Volumes_Data_macports_dports_graphics_dcmtk/dcmtk/work/dcmtk-3.6.1_20140617 --check-build-system CMakeFiles/Makefile.cmake 0
592:info:build /Volumes/Data/macports/mountainlion/bin/cmake -E cmake_progress_start /Volumes/Data/macports/mountainlion/var/macports/build/_Volumes_Data_macports_dports_graphics_dcmtk/dcmtk/work/dcmtk-3.6.1_20140617/CMakeFiles /Volumes/Data/macports/mountainlion/var/macports/build/_Volumes_Data_macports_dports_graphics_dcmtk/dcmtk/work/dcmtk-3.6.1_20140617/CMakeFiles/progress.marks
593:info:build /usr/bin/make -f CMakeFiles/Makefile2 all
594:info:build make[1]: Entering directory `/Volumes/Data/macports/mountainlion/var/macports/build/_Volumes_Data_macports_dports_graphics_dcmtk/dcmtk/work/dcmtk-3.6.1_20140617'
595:info:build /usr/bin/make -f ofstd/libsrc/CMakeFiles/ofstd.dir/build.make ofstd/libsrc/CMakeFiles/ofstd.dir/depend
596:info:build make[2]: Entering directory `/Volumes/Data/macports/mountainlion/var/macports/build/_Volumes_Data_macports_dports_graphics_dcmtk/dcmtk/work/dcmtk-3.6.1_20140617'
597:info:build cd /Volumes/Data/macports/mountainlion/var/macports/build/_Volumes_Data_macports_dports_graphics_dcmtk/dcmtk/work/dcmtk-3.6.1_20140617 && /Volumes/Data/macports/mountainlion/bin/cmake -E cmake_depends "Unix Makefiles" /Volumes/Data/macports/mountainlion/var/macports/build/_Volumes_Data_macports_dports_graphics_dcmtk/dcmtk/work/dcmtk-3.6.1_20140617 /Volumes/Data/macports/mountainlion/var/macports/build/_Volumes_Data_macports_dports_graphics_dcmtk/dcmtk/work/dcmtk-3.6.1_20140617/ofstd/libsrc /Volumes/Data/macports/mountainlion/var/macports/build/_Volumes_Data_macports_dports_graphics_dcmtk/dcmtk/work/dcmtk-3.6.1_20140617 /Volumes/Data/macports/mountainlion/var/macports/build/_Volumes_Data_macports_dports_graphics_dcmtk/dcmtk/work/dcmtk-3.6.1_20140617/ofstd/libsrc /Volumes/Data/macports/mountainlion/var/macports/build/_Volumes_Data_macports_dports_graphics_dcmtk/dcmtk/work/dcmtk-3.6.1_20140617/ofstd/libsrc/CMakeFiles/ofstd.dir/DependInfo.cmake --color=
598:info:build Scanning dependencies of target ofstd
599:info:build make[2]: Leaving directory `/Volumes/Data/macports/mountainlion/var/macports/build/_Volumes_Data_macports_dports_graphics_dcmtk/dcmtk/work/dcmtk-3.6.1_20140617'
600:info:build /usr/bin/make -f ofstd/libsrc/CMakeFiles/ofstd.dir/build.make ofstd/libsrc/CMakeFiles/ofstd.dir/build
601:info:build make[2]: Entering directory `/Volumes/Data/macports/mountainlion/var/macports/build/_Volumes_Data_macports_dports_graphics_dcmtk/dcmtk/work/dcmtk-3.6.1_20140617'
602:info:build /Volumes/Data/macports/mountainlion/bin/cmake -E cmake_progress_report /Volumes/Data/macports/mountainlion/var/macports/build/_Volumes_Data_macports_dports_graphics_dcmtk/dcmtk/work/dcmtk-3.6.1_20140617/CMakeFiles
603:info:build [  0%] Building CXX object ofstd/libsrc/CMakeFiles/ofstd.dir/ofchrenc.cc.o
604:info:build cd /Volumes/Data/macports/mountainlion/var/macports/build/_Volumes_Data_macports_dports_graphics_dcmtk/dcmtk/work/dcmtk-3.6.1_20140617/ofstd/libsrc && /usr/bin/clang++   -DDCMTK_BUILD_IN_PROGRESS -DUSE_NULL_SAFE_OFSTRING -D_BSD_COMPAT -D_BSD_SOURCE -D_OSF_SOURCE -D_REENTRANT -D_XOPEN_SOURCE_EXTENDED -Dofstd_EXPORTS -pipe -Os -arch x86_64 -stdlib=libstdc++  -fvisibility=hidden -D_XOPEN_SOURCE_EXTENDED -D_BSD_SOURCE -D_BSD_COMPAT -D_OSF_SOURCE -D_DARWIN_C_SOURCE -DNDEBUG -arch x86_64 -mmacosx-version-min=10.8 -fPIC -I/Volumes/Data/macports/mountainlion/include -I/Volumes/Data/macports/mountainlion/include/libxml2 -I/Volumes/Data/macports/mountainlion/var/macports/build/_Volumes_Data_macports_dports_graphics_dcmtk/dcmtk/work/dcmtk-3.6.1_20140617/config/include -I/Volumes/Data/macports/mountainlion/var/macports/build/_Volumes_Data_macports_dports_graphics_dcmtk/dcmtk/work/dcmtk-3.6.1_20140617/ofstd/include -I/Volumes/Data/macports/mountainlion/var/macports/build/_Volumes_Data_macports_dports_graphics_dcmtk/dcmtk/work/dcmtk-3.6.1_20140617/oflog/include -I/Volumes/Data/macports/mountainlion/var/macports/build/_Volumes_Data_macports_dports_graphics_dcmtk/dcmtk/work/dcmtk-3.6.1_20140617/dcmdata/include -I/Volumes/Data/macports/mountainlion/var/macports/build/_Volumes_Data_macports_dports_graphics_dcmtk/dcmtk/work/dcmtk-3.6.1_20140617/dcmimgle/include -I/Volumes/Data/macports/mountainlion/var/macports/build/_Volumes_Data_macports_dports_graphics_dcmtk/dcmtk/work/dcmtk-3.6.1_20140617/dcmimage/include -I/Volumes/Data/macports/mountainlion/var/macports/build/_Volumes_Data_macports_dports_graphics_dcmtk/dcmtk/work/dcmtk-3.6.1_20140617/dcmjpeg/include -I/Volumes/Data/macports/mountainlion/var/macports/build/_Volumes_Data_macports_dports_graphics_dcmtk/dcmtk/work/dcmtk-3.6.1_20140617/dcmjpls/include -I/Volumes/Data/macports/mountainlion/var/macports/build/_Volumes_Data_macports_dports_graphics_dcmtk/dcmtk/work/dcmtk-3.6.1_20140617/dcmtls/include -I/Volumes/Data/macports/mountainlion/var/macports/build/_Volumes_Data_macports_dports_graphics_dcmtk/dcmtk/work/dcmtk-3.6.1_20140617/dcmnet/include -I/Volumes/Data/macports/mountainlion/var/macports/build/_Volumes_Data_macports_dports_graphics_dcmtk/dcmtk/work/dcmtk-3.6.1_20140617/dcmsr/include -I/Volumes/Data/macports/mountainlion/var/macports/build/_Volumes_Data_macports_dports_graphics_dcmtk/dcmtk/work/dcmtk-3.6.1_20140617/dcmsign/include -I/Volumes/Data/macports/mountainlion/var/macports/build/_Volumes_Data_macports_dports_graphics_dcmtk/dcmtk/work/dcmtk-3.6.1_20140617/dcmwlm/include -I/Volumes/Data/macports/mountainlion/var/macports/build/_Volumes_Data_macports_dports_graphics_dcmtk/dcmtk/work/dcmtk-3.6.1_20140617/dcmqrdb/include -I/Volumes/Data/macports/mountainlion/var/macports/build/_Volumes_Data_macports_dports_graphics_dcmtk/dcmtk/work/dcmtk-3.6.1_20140617/dcmpstat/include -I/Volumes/Data/macports/mountainlion/var/macports/build/_Volumes_Data_macports_dports_graphics_dcmtk/dcmtk/work/dcmtk-3.6.1_20140617/dcmrt/include    -DDCMTK_BUILD_DATE=\"2014-06-17\" -o CMakeFiles/ofstd.dir/ofchrenc.cc.o -c /Volumes/Data/macports/mountainlion/var/macports/build/_Volumes_Data_macports_dports_graphics_dcmtk/dcmtk/work/dcmtk-3.6.1_20140617/ofstd/libsrc/ofchrenc.cc
605:info:build In file included from /Volumes/Data/macports/mountainlion/var/macports/build/_Volumes_Data_macports_dports_graphics_dcmtk/dcmtk/work/dcmtk-3.6.1_20140617/ofstd/libsrc/ofchrenc.cc:25:
606:info:build In file included from /Volumes/Data/macports/mountainlion/var/macports/build/_Volumes_Data_macports_dports_graphics_dcmtk/dcmtk/work/dcmtk-3.6.1_20140617/ofstd/include/dcmtk/ofstd/ofchrenc.h:28:
607:info:build In file included from /Volumes/Data/macports/mountainlion/include/dcmtk/ofstd/ofcond.h:35:
608:info:build In file included from /Volumes/Data/macports/mountainlion/include/dcmtk/ofstd/ofstring.h:65:
609:info:build In file included from /Volumes/Data/macports/mountainlion/include/dcmtk/ofstd/ofstream.h:67:
610:info:build In file included from /usr/include/c++/4.2.1/backward/iostream.h:31:
611:info:build /usr/include/c++/4.2.1/backward/backward_warning.h:32:2: warning: This file includes at least one deprecated or antiquated header. Please consider using one of the 32 headers found in section 17.4.1.2 of the C++ standard. Examples include substituting the <X> header for the <X.h> header for C++ includes, or <iostream> instead of the deprecated header <iostream.h>. To disable this warning use -Wno-deprecated. [-W#warnings]
612:info:build #warning This file includes at least one deprecated or antiquated header. \
613:info:build  ^
614:info:build In file included from /Volumes/Data/macports/mountainlion/var/macports/build/_Volumes_Data_macports_dports_graphics_dcmtk/dcmtk/work/dcmtk-3.6.1_20140617/ofstd/libsrc/ofchrenc.cc:25:
615:info:build In file included from /Volumes/Data/macports/mountainlion/var/macports/build/_Volumes_Data_macports_dports_graphics_dcmtk/dcmtk/work/dcmtk-3.6.1_20140617/ofstd/include/dcmtk/ofstd/ofchrenc.h:28:
616:info:build In file included from /Volumes/Data/macports/mountainlion/include/dcmtk/ofstd/ofcond.h:35:
617:info:build In file included from /Volumes/Data/macports/mountainlion/include/dcmtk/ofstd/ofstring.h:65:
618:info:build /Volumes/Data/macports/mountainlion/include/dcmtk/ofstd/ofstream.h:80:2: error: DCMTK needs stringstream or strstream type
619:info:build #error DCMTK needs stringstream or strstream type
620:info:build  ^
621:info:build /Volumes/Data/macports/mountainlion/include/dcmtk/ofstd/ofstream.h:117:9: error: unknown type name 'strstream'
622:info:build typedef strstream OFStringStream;
623:info:build         ^
624:info:build /Volumes/Data/macports/mountainlion/include/dcmtk/ofstd/ofstream.h:118:9: error: unknown type name 'ostrstream'
625:info:build typedef ostrstream OFOStringStream;
626:info:build         ^
627:info:build /Volumes/Data/macports/mountainlion/include/dcmtk/ofstd/ofstream.h:119:9: error: unknown type name 'istrstream'
628:info:build typedef istrstream OFIStringStream;
629:info:build         ^
630:info:build In file included from /Volumes/Data/macports/mountainlion/var/macports/build/_Volumes_Data_macports_dports_graphics_dcmtk/dcmtk/work/dcmtk-3.6.1_20140617/ofstd/libsrc/ofchrenc.cc:25:
631:info:build In file included from /Volumes/Data/macports/mountainlion/var/macports/build/_Volumes_Data_macports_dports_graphics_dcmtk/dcmtk/work/dcmtk-3.6.1_20140617/ofstd/include/dcmtk/ofstd/ofchrenc.h:28:
632:info:build In file included from /Volumes/Data/macports/mountainlion/include/dcmtk/ofstd/ofcond.h:35:
633:info:build /Volumes/Data/macports/mountainlion/include/dcmtk/ofstd/ofstring.h:344:9: error: use of undeclared identifier 'assert'
634:info:build         OFSTRING_OUTOFRANGE (pos >= this->size());
635:info:build         ^
636:info:build /Volumes/Data/macports/mountainlion/include/dcmtk/ofstd/ofstring.h:71:35: note: expanded from macro 'OFSTRING_OUTOFRANGE'
637:info:build #define OFSTRING_OUTOFRANGE(cond) assert (!(cond))
638:info:build                                   ^
639:info:build /Volumes/Data/macports/mountainlion/include/dcmtk/ofstd/ofstring.h:356:9: error: use of undeclared identifier 'assert'
640:info:build         OFSTRING_OUTOFRANGE (pos >= this->size());
641:info:build         ^
642:info:build /Volumes/Data/macports/mountainlion/include/dcmtk/ofstd/ofstring.h:71:35: note: expanded from macro 'OFSTRING_OUTOFRANGE'
643:info:build #define OFSTRING_OUTOFRANGE(cond) assert (!(cond))
644:info:build                                   ^
645:info:build /Volumes/Data/macports/mountainlion/include/dcmtk/ofstd/ofstring.h:370:11: error: use of undeclared identifier 'assert'
646:info:build           OFSTRING_OUTOFRANGE (pos > this->size());
647:info:build           ^
648:info:build /Volumes/Data/macports/mountainlion/include/dcmtk/ofstd/ofstring.h:71:35: note: expanded from macro 'OFSTRING_OUTOFRANGE'
649:info:build #define OFSTRING_OUTOFRANGE(cond) assert (!(cond))
650:info:build                                   ^
651:info:build /Volumes/Data/macports/mountainlion/include/dcmtk/ofstd/ofstring.h:383:9: error: use of undeclared identifier 'assert'
652:info:build         OFSTRING_OUTOFRANGE (pos >= this->size());
653:info:build         ^
654:info:build /Volumes/Data/macports/mountainlion/include/dcmtk/ofstd/ofstring.h:71:35: note: expanded from macro 'OFSTRING_OUTOFRANGE'
655:info:build #define OFSTRING_OUTOFRANGE(cond) assert (!(cond))
656:info:build                                   ^
657:info:build In file included from /Volumes/Data/macports/mountainlion/var/macports/build/_Volumes_Data_macports_dports_graphics_dcmtk/dcmtk/work/dcmtk-3.6.1_20140617/ofstd/libsrc/ofchrenc.cc:25:
658:info:build In file included from /Volumes/Data/macports/mountainlion/var/macports/build/_Volumes_Data_macports_dports_graphics_dcmtk/dcmtk/work/dcmtk-3.6.1_20140617/ofstd/include/dcmtk/ofstd/ofchrenc.h:28:
659:info:build /Volumes/Data/macports/mountainlion/include/dcmtk/ofstd/ofcond.h:317:5: error: use of undeclared identifier 'assert'
660:info:build     assert(theCondition);
661:info:build     ^
662:info:build /Volumes/Data/macports/mountainlion/include/dcmtk/ofstd/ofcond.h:333:5: error: use of undeclared identifier 'assert'
663:info:build     assert(theCondition);
664:info:build     ^
665:info:build /Volumes/Data/macports/mountainlion/include/dcmtk/ofstd/ofcond.h:340:5: error: use of undeclared identifier 'assert'
666:info:build     assert(theCondition);
667:info:build     ^
668:info:build /Volumes/Data/macports/mountainlion/include/dcmtk/ofstd/ofcond.h:362:7: error: use of undeclared identifier 'assert'
669:info:build       assert(theCondition);
670:info:build       ^
671:info:build In file included from /Volumes/Data/macports/mountainlion/var/macports/build/_Volumes_Data_macports_dports_graphics_dcmtk/dcmtk/work/dcmtk-3.6.1_20140617/ofstd/libsrc/ofchrenc.cc:25:
672:info:build /Volumes/Data/macports/mountainlion/var/macports/build/_Volumes_Data_macports_dports_graphics_dcmtk/dcmtk/work/dcmtk-3.6.1_20140617/ofstd/include/dcmtk/ofstd/ofchrenc.h:39:26: error: variable has incomplete type 'class DCMTK_OFSTD_EXPORT'
673:info:build class DCMTK_OFSTD_EXPORT OFCharacterEncoding
674:info:build                          ^
675:info:build /Volumes/Data/macports/mountainlion/var/macports/build/_Volumes_Data_macports_dports_graphics_dcmtk/dcmtk/work/dcmtk-3.6.1_20140617/ofstd/include/dcmtk/ofstd/ofchrenc.h:39:7: note: forward declaration of 'DCMTK_OFSTD_EXPORT'
676:info:build class DCMTK_OFSTD_EXPORT OFCharacterEncoding
677:info:build       ^
678:info:build /Volumes/Data/macports/mountainlion/var/macports/build/_Volumes_Data_macports_dports_graphics_dcmtk/dcmtk/work/dcmtk-3.6.1_20140617/ofstd/include/dcmtk/ofstd/ofchrenc.h:39:45: error: expected ';' after top level declarator
679:info:build class DCMTK_OFSTD_EXPORT OFCharacterEncoding
680:info:build                                             ^
681:info:build                                             ;
682:info:build In file included from /Volumes/Data/macports/mountainlion/var/macports/build/_Volumes_Data_macports_dports_graphics_dcmtk/dcmtk/work/dcmtk-3.6.1_20140617/ofstd/libsrc/ofchrenc.cc:26:
683:info:build In file included from /Volumes/Data/macports/mountainlion/include/dcmtk/ofstd/ofstd.h:34:
684:info:build /Volumes/Data/macports/mountainlion/include/dcmtk/ofstd/oflist.h:53:2: error: Your C++ compiler cannot handle class templates:
685:info:build #error Your C++ compiler cannot handle class templates:
686:info:build  ^
687:info:build /Volumes/Data/macports/mountainlion/include/dcmtk/ofstd/oflist.h:223:9: error: use of undeclared identifier 'assert'
688:info:build         assert(!node->dummy);
689:info:build         ^
690:info:build /Volumes/Data/macports/mountainlion/include/dcmtk/ofstd/oflist.h:504:2: error: Your C++ Compiler is not capable of compiling this code
691:info:build #error Your C++ Compiler is not capable of compiling this code
692:info:build  ^
693:info:build /Volumes/Data/macports/mountainlion/var/macports/build/_Volumes_Data_macports_dports_graphics_dcmtk/dcmtk/work/dcmtk-3.6.1_20140617/ofstd/libsrc/ofchrenc.cc:68:1: error: expected a class or namespace
694:info:build OFCharacterEncoding::OFCharacterEncoding()
695:info:build ^
696:info:build /Volumes/Data/macports/mountainlion/var/macports/build/_Volumes_Data_macports_dports_graphics_dcmtk/dcmtk/work/dcmtk-3.6.1_20140617/ofstd/libsrc/ofchrenc.cc:68:22: error: C++ requires a type specifier for all declarations
697:info:build OFCharacterEncoding::OFCharacterEncoding()
698:info:build ~~~~~~~~~~~~~~~~~~~  ^
699:info:build fatal error: too many errors emitted, stopping now [-ferror-limit=]
700:info:build 1 warning and 20 errors generated.
701:info:build make[2]: *** [ofstd/libsrc/CMakeFiles/ofstd.dir/ofchrenc.cc.o] Error 1
702:info:build make[2]: Leaving directory `/Volumes/Data/macports/mountainlion/var/macports/build/_Volumes_Data_macports_dports_graphics_dcmtk/dcmtk/work/dcmtk-3.6.1_20140617'
703:info:build make[1]: *** [ofstd/libsrc/CMakeFiles/ofstd.dir/all] Error 2
704:info:build make[1]: Leaving directory `/Volumes/Data/macports/mountainlion/var/macports/build/_Volumes_Data_macports_dports_graphics_dcmtk/dcmtk/work/dcmtk-3.6.1_20140617'
705:info:build make: *** [all] Error 2
706:info:build make: Leaving directory `/Volumes/Data/macports/mountainlion/var/macports/build/_Volumes_Data_macports_dports_graphics_dcmtk/dcmtk/work/dcmtk-3.6.1_20140617'
707:info:build Command failed:  cd "/Volumes/Data/macports/mountainlion/var/macports/build/_Volumes_Data_macports_dports_graphics_dcmtk/dcmtk/work/dcmtk-3.6.1_20140617" && /usr/bin/make -w all
708:info:build Exit code: 2
709:error:build org.macports.build for port dcmtk returned: command execution failed
710:debug:build Error code: CHILDSTATUS 92185 2
711:debug:build Backtrace: command execution failed
712    while executing
713"system -nice 10 $fullcmdstring"
714    ("eval" body line 1)
715    invoked from within
716"eval system $notty $nice \$fullcmdstring"
717    invoked from within
718"command_exec build"
719    (procedure "portbuild::build_main" line 8)
720    invoked from within
721"portbuild::build_main org.macports.build"
722    ("eval" body line 1)
723    invoked from within
724"eval $procedure $targetname"
725:info:build Warning: targets not executed for dcmtk: org.macports.install org.macports.build org.macports.destroot
726:notice:build Please see the log file for port dcmtk for details:
727    /Volumes/Data/macports/mountainlion/var/macports/logs/_Volumes_Data_macports_dports_graphics_dcmtk/dcmtk/main.log