| 1 | version:1 |
|---|
| 2 | :msg:clean ---> Computing dependencies for mesa:info:clean .:debug:clean mesa has no conflicts |
|---|
| 3 | :debug:clean Searching for dependency: pkgconfig |
|---|
| 4 | :debug:clean Found Dependency: receipt exists for pkgconfig |
|---|
| 5 | :debug:clean Searching for dependency: flex |
|---|
| 6 | :debug:clean Found Dependency: receipt exists for flex |
|---|
| 7 | :debug:clean Searching for dependency: bison |
|---|
| 8 | :debug:clean Found Dependency: receipt exists for bison |
|---|
| 9 | :debug:clean Searching for dependency: autoconf |
|---|
| 10 | :debug:clean Found Dependency: receipt exists for autoconf |
|---|
| 11 | :debug:clean Searching for dependency: automake |
|---|
| 12 | :debug:clean Found Dependency: receipt exists for automake |
|---|
| 13 | :debug:clean Searching for dependency: libtool |
|---|
| 14 | :debug:clean Found Dependency: receipt exists for libtool |
|---|
| 15 | :debug:clean Searching for dependency: py27-libxml2 |
|---|
| 16 | :debug:clean Found Dependency: receipt exists for py27-libxml2 |
|---|
| 17 | :debug:clean Searching for dependency: xorg-glproto |
|---|
| 18 | :debug:clean Found Dependency: receipt exists for xorg-glproto |
|---|
| 19 | :debug:clean Searching for dependency: xorg-dri2proto |
|---|
| 20 | :debug:clean Found Dependency: receipt exists for xorg-dri2proto |
|---|
| 21 | :debug:clean Searching for dependency: xorg-libxcb |
|---|
| 22 | :debug:clean Found Dependency: receipt exists for xorg-libxcb |
|---|
| 23 | :debug:clean Searching for dependency: xorg-libX11 |
|---|
| 24 | :debug:clean Found Dependency: receipt exists for xorg-libX11 |
|---|
| 25 | :debug:clean Searching for dependency: xorg-libXext |
|---|
| 26 | :debug:clean Found Dependency: receipt exists for xorg-libXext |
|---|
| 27 | :debug:clean Searching for dependency: xorg-libXdamage |
|---|
| 28 | :debug:clean Found Dependency: receipt exists for xorg-libXdamage |
|---|
| 29 | :debug:clean Searching for dependency: xorg-libXfixes |
|---|
| 30 | :debug:clean Found Dependency: receipt exists for xorg-libXfixes |
|---|
| 31 | :debug:clean Searching for dependency: xorg-libXi |
|---|
| 32 | :debug:clean Found Dependency: receipt exists for xorg-libXi |
|---|
| 33 | :debug:clean Searching for dependency: xorg-libXmu |
|---|
| 34 | :debug:clean Found Dependency: receipt exists for xorg-libXmu |
|---|
| 35 | :msg:clean |
|---|
| 36 | :debug:main Executing org.macports.main (mesa) |
|---|
| 37 | :debug:main changing euid/egid - current euid: 0 - current egid: 0 |
|---|
| 38 | :debug:main egid changed to: 501 |
|---|
| 39 | :debug:main euid changed to: 502 |
|---|
| 40 | :debug:main Skipping completed org.macports.archivefetch (mesa) |
|---|
| 41 | :debug:main Privilege de-escalation not attempted as not running as root. |
|---|
| 42 | :debug:main Skipping completed org.macports.fetch (mesa) |
|---|
| 43 | :debug:main Privilege de-escalation not attempted as not running as root. |
|---|
| 44 | :debug:main Skipping completed org.macports.checksum (mesa) |
|---|
| 45 | :debug:main Privilege de-escalation not attempted as not running as root. |
|---|
| 46 | :debug:main Skipping completed org.macports.extract (mesa) |
|---|
| 47 | :debug:main Privilege de-escalation not attempted as not running as root. |
|---|
| 48 | :debug:main Skipping completed org.macports.patch (mesa) |
|---|
| 49 | :debug:main Privilege de-escalation not attempted as not running as root. |
|---|
| 50 | :debug:main Skipping completed org.macports.configure (mesa) |
|---|
| 51 | :debug:main Privilege de-escalation not attempted as not running as root. |
|---|
| 52 | :debug:build build phase started at Wed Mar 4 15:21:31 NZDT 2015 |
|---|
| 53 | :notice:build ---> Building mesa |
|---|
| 54 | :debug:build Executing org.macports.build (mesa) |
|---|
| 55 | :debug:build Environment: |
|---|
| 56 | CC_PRINT_OPTIONS='YES' |
|---|
| 57 | CC_PRINT_OPTIONS_FILE='/opt/local/var/macports/build/_opt_local_var_macports_sources_rsync.macports.org_release_tarballs_ports_x11_mesa/mesa/work/.CC_PRINT_OPTIONS' |
|---|
| 58 | CPATH='/opt/local/include' |
|---|
| 59 | LIBRARY_PATH='/opt/local/lib' |
|---|
| 60 | MACOSX_DEPLOYMENT_TARGET='10.7' |
|---|
| 61 | :debug:build Assembled command: 'cd "/opt/local/var/macports/build/_opt_local_var_macports_sources_rsync.macports.org_release_tarballs_ports_x11_mesa/mesa/work/Mesa-10.4.4" && /usr/bin/make -j16 -w all' |
|---|
| 62 | :debug:build Executing command line: cd "/opt/local/var/macports/build/_opt_local_var_macports_sources_rsync.macports.org_release_tarballs_ports_x11_mesa/mesa/work/Mesa-10.4.4" && /usr/bin/make -j16 -w all |
|---|
| 63 | :info:build make: Entering directory `/opt/local/var/macports/build/_opt_local_var_macports_sources_rsync.macports.org_release_tarballs_ports_x11_mesa/mesa/work/Mesa-10.4.4' |
|---|
| 64 | :info:build Making all in src |
|---|
| 65 | :info:build make[1]: Entering directory `/opt/local/var/macports/build/_opt_local_var_macports_sources_rsync.macports.org_release_tarballs_ports_x11_mesa/mesa/work/Mesa-10.4.4/src' |
|---|
| 66 | :info:build Making all in gtest |
|---|
| 67 | :info:build make[2]: Entering directory `/opt/local/var/macports/build/_opt_local_var_macports_sources_rsync.macports.org_release_tarballs_ports_x11_mesa/mesa/work/Mesa-10.4.4/src/gtest' |
|---|
| 68 | :info:build make[2]: Nothing to be done for `all'. |
|---|
| 69 | :info:build make[2]: Leaving directory `/opt/local/var/macports/build/_opt_local_var_macports_sources_rsync.macports.org_release_tarballs_ports_x11_mesa/mesa/work/Mesa-10.4.4/src/gtest' |
|---|
| 70 | :info:build Making all in util |
|---|
| 71 | :info:build make[2]: Entering directory `/opt/local/var/macports/build/_opt_local_var_macports_sources_rsync.macports.org_release_tarballs_ports_x11_mesa/mesa/work/Mesa-10.4.4/src/util' |
|---|
| 72 | :info:build /usr/bin/make all-recursive |
|---|
| 73 | :info:build make[3]: Entering directory `/opt/local/var/macports/build/_opt_local_var_macports_sources_rsync.macports.org_release_tarballs_ports_x11_mesa/mesa/work/Mesa-10.4.4/src/util' |
|---|
| 74 | :info:build Making all in . |
|---|
| 75 | :info:build make[4]: Entering directory `/opt/local/var/macports/build/_opt_local_var_macports_sources_rsync.macports.org_release_tarballs_ports_x11_mesa/mesa/work/Mesa-10.4.4/src/util' |
|---|
| 76 | :info:build make[4]: Nothing to be done for `all-am'. |
|---|
| 77 | :info:build make[4]: Leaving directory `/opt/local/var/macports/build/_opt_local_var_macports_sources_rsync.macports.org_release_tarballs_ports_x11_mesa/mesa/work/Mesa-10.4.4/src/util' |
|---|
| 78 | :info:build Making all in tests/hash_table |
|---|
| 79 | :info:build make[4]: Entering directory `/opt/local/var/macports/build/_opt_local_var_macports_sources_rsync.macports.org_release_tarballs_ports_x11_mesa/mesa/work/Mesa-10.4.4/src/util/tests/hash_table' |
|---|
| 80 | :info:build make[4]: Nothing to be done for `all'. |
|---|
| 81 | :info:build make[4]: Leaving directory `/opt/local/var/macports/build/_opt_local_var_macports_sources_rsync.macports.org_release_tarballs_ports_x11_mesa/mesa/work/Mesa-10.4.4/src/util/tests/hash_table' |
|---|
| 82 | :info:build make[3]: Leaving directory `/opt/local/var/macports/build/_opt_local_var_macports_sources_rsync.macports.org_release_tarballs_ports_x11_mesa/mesa/work/Mesa-10.4.4/src/util' |
|---|
| 83 | :info:build make[2]: Leaving directory `/opt/local/var/macports/build/_opt_local_var_macports_sources_rsync.macports.org_release_tarballs_ports_x11_mesa/mesa/work/Mesa-10.4.4/src/util' |
|---|
| 84 | :info:build Making all in mapi |
|---|
| 85 | :info:build make[2]: Entering directory `/opt/local/var/macports/build/_opt_local_var_macports_sources_rsync.macports.org_release_tarballs_ports_x11_mesa/mesa/work/Mesa-10.4.4/src/mapi' |
|---|
| 86 | :info:build /usr/bin/make all-recursive |
|---|
| 87 | :info:build make[3]: Entering directory `/opt/local/var/macports/build/_opt_local_var_macports_sources_rsync.macports.org_release_tarballs_ports_x11_mesa/mesa/work/Mesa-10.4.4/src/mapi' |
|---|
| 88 | :info:build Making all in glapi/gen |
|---|
| 89 | :info:build make[4]: Entering directory `/opt/local/var/macports/build/_opt_local_var_macports_sources_rsync.macports.org_release_tarballs_ports_x11_mesa/mesa/work/Mesa-10.4.4/src/mapi/glapi/gen' |
|---|
| 90 | :info:build /usr/bin/make all-am |
|---|
| 91 | :info:build make[5]: Entering directory `/opt/local/var/macports/build/_opt_local_var_macports_sources_rsync.macports.org_release_tarballs_ports_x11_mesa/mesa/work/Mesa-10.4.4/src/mapi/glapi/gen' |
|---|
| 92 | :info:build make[5]: Nothing to be done for `all-am'. |
|---|
| 93 | :info:build make[5]: Leaving directory `/opt/local/var/macports/build/_opt_local_var_macports_sources_rsync.macports.org_release_tarballs_ports_x11_mesa/mesa/work/Mesa-10.4.4/src/mapi/glapi/gen' |
|---|
| 94 | :info:build make[4]: Leaving directory `/opt/local/var/macports/build/_opt_local_var_macports_sources_rsync.macports.org_release_tarballs_ports_x11_mesa/mesa/work/Mesa-10.4.4/src/mapi/glapi/gen' |
|---|
| 95 | :info:build Making all in . |
|---|
| 96 | :info:build make[4]: Entering directory `/opt/local/var/macports/build/_opt_local_var_macports_sources_rsync.macports.org_release_tarballs_ports_x11_mesa/mesa/work/Mesa-10.4.4/src/mapi' |
|---|
| 97 | :info:build make[4]: Nothing to be done for `all-am'. |
|---|
| 98 | :info:build make[4]: Leaving directory `/opt/local/var/macports/build/_opt_local_var_macports_sources_rsync.macports.org_release_tarballs_ports_x11_mesa/mesa/work/Mesa-10.4.4/src/mapi' |
|---|
| 99 | :info:build make[3]: Leaving directory `/opt/local/var/macports/build/_opt_local_var_macports_sources_rsync.macports.org_release_tarballs_ports_x11_mesa/mesa/work/Mesa-10.4.4/src/mapi' |
|---|
| 100 | :info:build make[2]: Leaving directory `/opt/local/var/macports/build/_opt_local_var_macports_sources_rsync.macports.org_release_tarballs_ports_x11_mesa/mesa/work/Mesa-10.4.4/src/mapi' |
|---|
| 101 | :info:build Making all in glsl |
|---|
| 102 | :info:build make[2]: Entering directory `/opt/local/var/macports/build/_opt_local_var_macports_sources_rsync.macports.org_release_tarballs_ports_x11_mesa/mesa/work/Mesa-10.4.4/src/glsl' |
|---|
| 103 | :info:build /usr/bin/make all-am |
|---|
| 104 | :info:build make[3]: Entering directory `/opt/local/var/macports/build/_opt_local_var_macports_sources_rsync.macports.org_release_tarballs_ports_x11_mesa/mesa/work/Mesa-10.4.4/src/glsl' |
|---|
| 105 | :info:build make[3]: Nothing to be done for `all-am'. |
|---|
| 106 | :info:build make[3]: Leaving directory `/opt/local/var/macports/build/_opt_local_var_macports_sources_rsync.macports.org_release_tarballs_ports_x11_mesa/mesa/work/Mesa-10.4.4/src/glsl' |
|---|
| 107 | :info:build make[2]: Leaving directory `/opt/local/var/macports/build/_opt_local_var_macports_sources_rsync.macports.org_release_tarballs_ports_x11_mesa/mesa/work/Mesa-10.4.4/src/glsl' |
|---|
| 108 | :info:build Making all in mesa |
|---|
| 109 | :info:build make[2]: Entering directory `/opt/local/var/macports/build/_opt_local_var_macports_sources_rsync.macports.org_release_tarballs_ports_x11_mesa/mesa/work/Mesa-10.4.4/src/mesa' |
|---|
| 110 | :info:build updating main/git_sha1.h |
|---|
| 111 | :info:build /usr/bin/make all-recursive |
|---|
| 112 | :info:build make[3]: Entering directory `/opt/local/var/macports/build/_opt_local_var_macports_sources_rsync.macports.org_release_tarballs_ports_x11_mesa/mesa/work/Mesa-10.4.4/src/mesa' |
|---|
| 113 | :info:build Making all in . |
|---|
| 114 | :info:build make[4]: Entering directory `/opt/local/var/macports/build/_opt_local_var_macports_sources_rsync.macports.org_release_tarballs_ports_x11_mesa/mesa/work/Mesa-10.4.4/src/mesa' |
|---|
| 115 | :info:build updating main/git_sha1.h |
|---|
| 116 | :info:build make[4]: Leaving directory `/opt/local/var/macports/build/_opt_local_var_macports_sources_rsync.macports.org_release_tarballs_ports_x11_mesa/mesa/work/Mesa-10.4.4/src/mesa' |
|---|
| 117 | :info:build Making all in main/tests |
|---|
| 118 | :info:build make[4]: Entering directory `/opt/local/var/macports/build/_opt_local_var_macports_sources_rsync.macports.org_release_tarballs_ports_x11_mesa/mesa/work/Mesa-10.4.4/src/mesa/main/tests' |
|---|
| 119 | :info:build make[4]: Nothing to be done for `all'. |
|---|
| 120 | :info:build make[4]: Leaving directory `/opt/local/var/macports/build/_opt_local_var_macports_sources_rsync.macports.org_release_tarballs_ports_x11_mesa/mesa/work/Mesa-10.4.4/src/mesa/main/tests' |
|---|
| 121 | :info:build Making all in drivers/dri |
|---|
| 122 | :info:build make[4]: Entering directory `/opt/local/var/macports/build/_opt_local_var_macports_sources_rsync.macports.org_release_tarballs_ports_x11_mesa/mesa/work/Mesa-10.4.4/src/mesa/drivers/dri' |
|---|
| 123 | :info:build Making all in common |
|---|
| 124 | :info:build make[5]: Entering directory `/opt/local/var/macports/build/_opt_local_var_macports_sources_rsync.macports.org_release_tarballs_ports_x11_mesa/mesa/work/Mesa-10.4.4/src/mesa/drivers/dri/common' |
|---|
| 125 | :info:build Making all in xmlpool |
|---|
| 126 | :info:build make[6]: Entering directory `/opt/local/var/macports/build/_opt_local_var_macports_sources_rsync.macports.org_release_tarballs_ports_x11_mesa/mesa/work/Mesa-10.4.4/src/mesa/drivers/dri/common/xmlpool' |
|---|
| 127 | :info:build /usr/bin/make all-am |
|---|
| 128 | :info:build make[7]: Entering directory `/opt/local/var/macports/build/_opt_local_var_macports_sources_rsync.macports.org_release_tarballs_ports_x11_mesa/mesa/work/Mesa-10.4.4/src/mesa/drivers/dri/common/xmlpool' |
|---|
| 129 | :info:build make[7]: Nothing to be done for `all-am'. |
|---|
| 130 | :info:build make[7]: Leaving directory `/opt/local/var/macports/build/_opt_local_var_macports_sources_rsync.macports.org_release_tarballs_ports_x11_mesa/mesa/work/Mesa-10.4.4/src/mesa/drivers/dri/common/xmlpool' |
|---|
| 131 | :info:build make[6]: Leaving directory `/opt/local/var/macports/build/_opt_local_var_macports_sources_rsync.macports.org_release_tarballs_ports_x11_mesa/mesa/work/Mesa-10.4.4/src/mesa/drivers/dri/common/xmlpool' |
|---|
| 132 | :info:build make[6]: Entering directory `/opt/local/var/macports/build/_opt_local_var_macports_sources_rsync.macports.org_release_tarballs_ports_x11_mesa/mesa/work/Mesa-10.4.4/src/mesa/drivers/dri/common' |
|---|
| 133 | :info:build make[6]: Nothing to be done for `all-am'. |
|---|
| 134 | :info:build make[6]: Leaving directory `/opt/local/var/macports/build/_opt_local_var_macports_sources_rsync.macports.org_release_tarballs_ports_x11_mesa/mesa/work/Mesa-10.4.4/src/mesa/drivers/dri/common' |
|---|
| 135 | :info:build make[5]: Leaving directory `/opt/local/var/macports/build/_opt_local_var_macports_sources_rsync.macports.org_release_tarballs_ports_x11_mesa/mesa/work/Mesa-10.4.4/src/mesa/drivers/dri/common' |
|---|
| 136 | :info:build Making all in swrast |
|---|
| 137 | :info:build make[5]: Entering directory `/opt/local/var/macports/build/_opt_local_var_macports_sources_rsync.macports.org_release_tarballs_ports_x11_mesa/mesa/work/Mesa-10.4.4/src/mesa/drivers/dri/swrast' |
|---|
| 138 | :info:build make[5]: Nothing to be done for `all'. |
|---|
| 139 | :info:build make[5]: Leaving directory `/opt/local/var/macports/build/_opt_local_var_macports_sources_rsync.macports.org_release_tarballs_ports_x11_mesa/mesa/work/Mesa-10.4.4/src/mesa/drivers/dri/swrast' |
|---|
| 140 | :info:build make[5]: Entering directory `/opt/local/var/macports/build/_opt_local_var_macports_sources_rsync.macports.org_release_tarballs_ports_x11_mesa/mesa/work/Mesa-10.4.4/src/mesa/drivers/dri' |
|---|
| 141 | :info:build make[5]: Nothing to be done for `all-am'. |
|---|
| 142 | :info:build make[5]: Leaving directory `/opt/local/var/macports/build/_opt_local_var_macports_sources_rsync.macports.org_release_tarballs_ports_x11_mesa/mesa/work/Mesa-10.4.4/src/mesa/drivers/dri' |
|---|
| 143 | :info:build make[4]: Leaving directory `/opt/local/var/macports/build/_opt_local_var_macports_sources_rsync.macports.org_release_tarballs_ports_x11_mesa/mesa/work/Mesa-10.4.4/src/mesa/drivers/dri' |
|---|
| 144 | :info:build Making all in drivers/osmesa |
|---|
| 145 | :info:build make[4]: Entering directory `/opt/local/var/macports/build/_opt_local_var_macports_sources_rsync.macports.org_release_tarballs_ports_x11_mesa/mesa/work/Mesa-10.4.4/src/mesa/drivers/osmesa' |
|---|
| 146 | :info:build make[4]: Nothing to be done for `all'. |
|---|
| 147 | :info:build make[4]: Leaving directory `/opt/local/var/macports/build/_opt_local_var_macports_sources_rsync.macports.org_release_tarballs_ports_x11_mesa/mesa/work/Mesa-10.4.4/src/mesa/drivers/osmesa' |
|---|
| 148 | :info:build make[3]: Leaving directory `/opt/local/var/macports/build/_opt_local_var_macports_sources_rsync.macports.org_release_tarballs_ports_x11_mesa/mesa/work/Mesa-10.4.4/src/mesa' |
|---|
| 149 | :info:build make[2]: Leaving directory `/opt/local/var/macports/build/_opt_local_var_macports_sources_rsync.macports.org_release_tarballs_ports_x11_mesa/mesa/work/Mesa-10.4.4/src/mesa' |
|---|
| 150 | :info:build Making all in loader |
|---|
| 151 | :info:build make[2]: Entering directory `/opt/local/var/macports/build/_opt_local_var_macports_sources_rsync.macports.org_release_tarballs_ports_x11_mesa/mesa/work/Mesa-10.4.4/src/loader' |
|---|
| 152 | :info:build make[2]: Nothing to be done for `all'. |
|---|
| 153 | :info:build make[2]: Leaving directory `/opt/local/var/macports/build/_opt_local_var_macports_sources_rsync.macports.org_release_tarballs_ports_x11_mesa/mesa/work/Mesa-10.4.4/src/loader' |
|---|
| 154 | :info:build Making all in glx |
|---|
| 155 | :info:build make[2]: Entering directory `/opt/local/var/macports/build/_opt_local_var_macports_sources_rsync.macports.org_release_tarballs_ports_x11_mesa/mesa/work/Mesa-10.4.4/src/glx' |
|---|
| 156 | :info:build Making all in apple |
|---|
| 157 | :info:build make[3]: Entering directory `/opt/local/var/macports/build/_opt_local_var_macports_sources_rsync.macports.org_release_tarballs_ports_x11_mesa/mesa/work/Mesa-10.4.4/src/glx/apple' |
|---|
| 158 | :info:build make[3]: Nothing to be done for `all'. |
|---|
| 159 | :info:build make[3]: Leaving directory `/opt/local/var/macports/build/_opt_local_var_macports_sources_rsync.macports.org_release_tarballs_ports_x11_mesa/mesa/work/Mesa-10.4.4/src/glx/apple' |
|---|
| 160 | :info:build Making all in . |
|---|
| 161 | :info:build make[3]: Entering directory `/opt/local/var/macports/build/_opt_local_var_macports_sources_rsync.macports.org_release_tarballs_ports_x11_mesa/mesa/work/Mesa-10.4.4/src/glx' |
|---|
| 162 | :info:build /bin/sh ../../libtool --tag=CXX --mode=link /usr/bin/clang++ -pipe -Os -arch x86_64 -stdlib=libstdc++ -Wall -fno-strict-aliasing -fno-builtin-memcmp -Qunused-arguments -no-undefined -version-number 1:2 -L/opt/local/lib -Wl,-headerpad_max_install_names -arch x86_64 -o libGL.la -rpath /opt/local/lib libglx.la ../../src/mapi/glapi/libglapi.la ../../src/mapi/shared-glapi/libglapi.la -L/opt/local/lib -lXext -lXdamage -lXfixes -lX11-xcb -lX11 -lxcb-glx -lxcb -lXxf86vm -lm -lpthread |
|---|
| 163 | :info:build libtool: link: /usr/bin/clang++ -dynamiclib -o .libs/libGL.1.dylib -Wl,-force_load,./.libs/libglx.a -Wl,-force_load,../../src/mapi/glapi/.libs/libglapi.a -L/opt/local/lib /opt/local/lib/libexpat.dylib -lXplugin ../../src/mapi/shared-glapi/.libs/libglapi.dylib /opt/local/lib/libXext.dylib /opt/local/lib/libXdamage.dylib /opt/local/lib/libXfixes.dylib /opt/local/lib/libXau.dylib /opt/local/lib/libXdmcp.dylib /opt/local/lib/libX11-xcb.dylib /opt/local/lib/libX11.dylib /opt/local/lib/libxcb-glx.dylib /opt/local/lib/libxcb.dylib /opt/local/lib/libXxf86vm.dylib -lm -lpthread -Os -arch x86_64 -stdlib=libstdc++ -Wl,-headerpad_max_install_names -arch x86_64 -framework ApplicationServices -framework CoreFoundation -pthread -install_name /opt/local/lib/libGL.1.dylib -compatibility_version 4 -current_version 4.0 -Wl,-single_module |
|---|
| 164 | :info:build clang: warning: argument unused during compilation: '-pthread' |
|---|
| 165 | :info:build Undefined symbols for architecture x86_64: |
|---|
| 166 | :info:build "___indirect_get_proc_address", referenced from: |
|---|
| 167 | :info:build _glXGetProcAddressARB in libglx.a(glxcmds.o) |
|---|
| 168 | :info:build "___indirect_glWindowPos3f", referenced from: |
|---|
| 169 | :info:build ___indirect_glWindowPos2d in libglx.a(indirect_window_pos.o) |
|---|
| 170 | :info:build ___indirect_glWindowPos2i in libglx.a(indirect_window_pos.o) |
|---|
| 171 | :info:build ___indirect_glWindowPos2f in libglx.a(indirect_window_pos.o) |
|---|
| 172 | :info:build ___indirect_glWindowPos2s in libglx.a(indirect_window_pos.o) |
|---|
| 173 | :info:build ___indirect_glWindowPos2dv in libglx.a(indirect_window_pos.o) |
|---|
| 174 | :info:build ___indirect_glWindowPos2fv in libglx.a(indirect_window_pos.o) |
|---|
| 175 | :info:build ___indirect_glWindowPos2iv in libglx.a(indirect_window_pos.o) |
|---|
| 176 | :info:build ... |
|---|
| 177 | :info:build "___indirect_glLoadMatrixd", referenced from: |
|---|
| 178 | :info:build ___indirect_glLoadTransposeMatrixd in libglx.a(indirect_transpose_matrix.o) |
|---|
| 179 | :info:build "___indirect_glLoadMatrixf", referenced from: |
|---|
| 180 | :info:build ___indirect_glLoadTransposeMatrixf in libglx.a(indirect_transpose_matrix.o) |
|---|
| 181 | :info:build "___indirect_glMultMatrixd", referenced from: |
|---|
| 182 | :info:build ___indirect_glMultTransposeMatrixd in libglx.a(indirect_transpose_matrix.o) |
|---|
| 183 | :info:build "___indirect_glMultMatrixf", referenced from: |
|---|
| 184 | :info:build ___indirect_glMultTransposeMatrixf in libglx.a(indirect_transpose_matrix.o) |
|---|
| 185 | :info:build "___indirect_glGetProgramivARB", referenced from: |
|---|
| 186 | :info:build ___glXInitVertexArrayState in libglx.a(indirect_vertex_array.o) |
|---|
| 187 | :info:build "___glXSetupVendorRequest", referenced from: |
|---|
| 188 | :info:build _get_parameter in libglx.a(indirect_vertex_program.o) |
|---|
| 189 | :info:build ___indirect_glGetVertexAttribiv in libglx.a(indirect_vertex_program.o) |
|---|
| 190 | :info:build ___indirect_glGetVertexAttribfv in libglx.a(indirect_vertex_program.o) |
|---|
| 191 | :info:build ___indirect_glGetVertexAttribdv in libglx.a(indirect_vertex_program.o) |
|---|
| 192 | :info:build _glAreTexturesResidentEXT in libglx.a(single2.o) |
|---|
| 193 | :info:build _gl_dispatch_stub_359 in libglx.a(singlepix.o) |
|---|
| 194 | :info:build "___glXReadReply", referenced from: |
|---|
| 195 | :info:build _get_parameter in libglx.a(indirect_vertex_program.o) |
|---|
| 196 | :info:build _glAreTexturesResidentEXT in libglx.a(single2.o) |
|---|
| 197 | :info:build "___glXDefaultPixelStore", referenced from: |
|---|
| 198 | :info:build ___glFillImage in libglx.a(pixel.o) |
|---|
| 199 | :info:build ___glXSendLargeImage in libglx.a(renderpix.o) |
|---|
| 200 | :info:build ___indirect_glSeparableFilter2D in libglx.a(renderpix.o) |
|---|
| 201 | :info:build "___glXSetupSingleRequest", referenced from: |
|---|
| 202 | :info:build _send_PixelStore in libglx.a(pixelstore.o) |
|---|
| 203 | :info:build ld: symbol(s) not found for architecture x86_64 |
|---|
| 204 | :info:build clang: error: linker command failed with exit code 1 (use -v to see invocation) |
|---|
| 205 | :info:build make[3]: *** [libGL.la] Error 1 |
|---|
| 206 | :info:build make[3]: Leaving directory `/opt/local/var/macports/build/_opt_local_var_macports_sources_rsync.macports.org_release_tarballs_ports_x11_mesa/mesa/work/Mesa-10.4.4/src/glx' |
|---|
| 207 | :info:build make[2]: *** [all-recursive] Error 1 |
|---|
| 208 | :info:build make[2]: Leaving directory `/opt/local/var/macports/build/_opt_local_var_macports_sources_rsync.macports.org_release_tarballs_ports_x11_mesa/mesa/work/Mesa-10.4.4/src/glx' |
|---|
| 209 | :info:build make[1]: *** [all-recursive] Error 1 |
|---|
| 210 | :info:build make[1]: Leaving directory `/opt/local/var/macports/build/_opt_local_var_macports_sources_rsync.macports.org_release_tarballs_ports_x11_mesa/mesa/work/Mesa-10.4.4/src' |
|---|
| 211 | :info:build make: *** [all-recursive] Error 1 |
|---|
| 212 | :info:build make: Leaving directory `/opt/local/var/macports/build/_opt_local_var_macports_sources_rsync.macports.org_release_tarballs_ports_x11_mesa/mesa/work/Mesa-10.4.4' |
|---|
| 213 | :info:build Command failed: cd "/opt/local/var/macports/build/_opt_local_var_macports_sources_rsync.macports.org_release_tarballs_ports_x11_mesa/mesa/work/Mesa-10.4.4" && /usr/bin/make -j16 -w all |
|---|
| 214 | :info:build Exit code: 2 |
|---|
| 215 | :error:build org.macports.build for port mesa returned: command execution failed |
|---|
| 216 | :debug:build Error code: CHILDSTATUS 42532 2 |
|---|
| 217 | :debug:build Backtrace: command execution failed |
|---|
| 218 | while executing |
|---|
| 219 | "system -nice 0 $fullcmdstring" |
|---|
| 220 | ("eval" body line 1) |
|---|
| 221 | invoked from within |
|---|
| 222 | "eval system $notty $nice \$fullcmdstring" |
|---|
| 223 | invoked from within |
|---|
| 224 | "command_exec build" |
|---|
| 225 | (procedure "portbuild::build_main" line 8) |
|---|
| 226 | invoked from within |
|---|
| 227 | "portbuild::build_main org.macports.build" |
|---|
| 228 | ("eval" body line 1) |
|---|
| 229 | invoked from within |
|---|
| 230 | "eval $procedure $targetname" |
|---|
| 231 | :info:build Warning: targets not executed for mesa: org.macports.install org.macports.build org.macports.destroot |
|---|
| 232 | :notice:build Please see the log file for port mesa for details: |
|---|
| 233 | /opt/local/var/macports/logs/_opt_local_var_macports_sources_rsync.macports.org_release_tarballs_ports_x11_mesa/mesa/main.log |
|---|