Ticket #47583: kerberos5_install_2015-04-28.log

File kerberos5_install_2015-04-28.log, 59.1 KB (added by dan+macports@…, 6 years ago)

kerberos5 clean, install

Line 
1# port -v clean --all kerberos5
2--->  Cleaning kerberos5
3--->  Removing distfiles for kerberos5
4--->  Removing temporary archives for kerberos5
5--->  Removing work directory for kerberos5
6# port -vs install kerberos5 build.jobs=1
7--->  Computing dependencies for kerberos5.
8--->  Fetching distfiles for kerberos5
9--->  krb5-1.13.1-final.tar.gz doesn't seem to exist in /opt/var/macports/distfiles/kerberos5
10--->  Attempting to fetch krb5-1.13.1-final.tar.gz from http://lil.fr.distfiles.macports.org/kerberos5
11  % Total    % Received % Xferd  Average Speed   Time    Time     Time  Current
12                                 Dload  Upload   Total   Spent    Left  Speed
13100 6124k  100 6124k    0     0  1306k      0  0:00:04  0:00:04 --:--:-- 1306k
14--->  Verifying checksums for kerberos5
15--->  Checksumming krb5-1.13.1-final.tar.gz
16--->  Extracting kerberos5
17--->  Extracting krb5-1.13.1-final.tar.gz
18--->  Applying patches to kerberos5
19--->  Applying patch-util__verto__Makefile.in-use-nonzero-compat-version.diff
20patching file util/verto/Makefile.in
21--->  Applying patch-config__shlib.conf-do-not-pass-dylib-file-ldflags.diff
22patching file config/shlib.conf
23--->  Applying patch-lib_rpc_Makefile.in-explicitly-link-krb5support.diff
24patching file lib/rpc/Makefile.in
25--->  Configuring kerberos5
26autoreconf: Entering directory `.'
27autoreconf: configure.in: not using Gettext
28autoreconf: configure.in: not using aclocal
29autoreconf: configure.in: tracing
30autoreconf: configure.in: not using Libtool
31autoreconf: running: /opt/bin/autoconf
32autoreconf: running: /opt/bin/autoheader
33autoreconf: configure.in: not using Automake
34autoreconf: Leaving directory `.'
35checking for gcc... /usr/bin/clang
36checking whether the C compiler works... yes
37checking for C compiler default output file name... a.out
38checking for suffix of executables...
39checking whether we are cross compiling... no
40checking for suffix of object files... o
41checking whether we are using the GNU C compiler... yes
42checking whether /usr/bin/clang accepts -g... yes
43checking for /usr/bin/clang option to accept ISO C89... none needed
44checking whether we are using the GNU C++ compiler... yes
45checking whether /usr/bin/clang++ accepts -g... yes
46checking how to run the C preprocessor... /usr/bin/clang -E
47checking build system type... x86_64-apple-darwin11.4.0
48checking host system type... x86_64-apple-darwin11.4.0
49checking for grep that handles long lines and -e... /usr/bin/grep
50checking for egrep... /usr/bin/grep -E
51checking for ANSI C header files... yes
52checking for sys/types.h... yes
53checking for sys/stat.h... yes
54checking for stdlib.h... yes
55checking for string.h... yes
56checking for memory.h... yes
57checking for strings.h... yes
58checking for inttypes.h... yes
59checking for stdint.h... yes
60checking for unistd.h... yes
61checking for GNU linker... no
62configure: adding extra warning flags for gcc
63configure: skipping pedantic warnings on Darwin
64configure: adding extra warning flags for g++
65checking if C compiler supports -Wno-format-zero-length... yes
66checking if C compiler supports -Woverflow... yes
67checking if C compiler supports -Wstrict-overflow... yes
68checking if C compiler supports -Wmissing-format-attribute... yes
69checking if C compiler supports -Wmissing-prototypes... yes
70checking if C compiler supports -Wreturn-type... yes
71checking if C compiler supports -Wmissing-braces... yes
72checking if C compiler supports -Wparentheses... yes
73checking if C compiler supports -Wswitch... yes
74checking if C compiler supports -Wunused-function... yes
75checking if C compiler supports -Wunused-label... yes
76checking if C compiler supports -Wunused-variable... yes
77checking if C compiler supports -Wunused-value... yes
78checking if C compiler supports -Wunknown-pragmas... yes
79checking if C compiler supports -Wsign-compare... yes
80checking if C compiler supports -Wnewline-eof... yes
81checking if C compiler supports -Werror=uninitialized... yes
82checking if C compiler supports -Werror=pointer-arith... yes
83checking if C compiler supports -Werror=declaration-after-statement... yes
84checking if C compiler supports -Werror-implicit-function-declaration... yes
85configure: disabling the use of common storage on Darwin
86checking which version of com_err to use... system
87checking for add_error_table in -lcom_err... yes
88checking for remove_error_table in -lcom_err... yes
89checking for compile_et... compile_et
90checking whether compile_et is useful... yes
91checking whether compile_et supports --textdomain... no
92checking which version of subsystem package to use... krb5
93checking for an ANSI C-conforming const... yes
94checking for gethostbyname... yes
95checking for socket... yes
96checking for main in -lresolv... yes
97checking for res_ninit... yes
98checking for res_nclose... yes
99checking for res_ndestroy... yes
100checking for res_nsearch... yes
101checking for ns_initparse... yes
102checking for ns_name_uncompress... yes
103checking for dn_skipname... yes
104checking for res_search... yes
105checking whether pragma weak references are supported... no
106checking for constructor/destructor attribute support... yes,yes
107configure: enabling thread support
108checking for the pthreads library -lpthreads... no
109checking whether pthreads work without any flags... yes
110checking for joinable pthread attribute... PTHREAD_CREATE_JOINABLE
111checking if more special flags are required for pthreads... no
112checking for cc_r... /usr/bin/clang
113configure: PTHREAD_CC = /usr/bin/clang
114configure: PTHREAD_CFLAGS =
115configure: PTHREAD_LIBS =
116checking for pthread_once... yes
117checking for pthread_rwlock_init... yes
118configure: rechecking with PTHREAD_... options
119checking for pthread_rwlock_init in -lc... yes
120checking for library containing dlopen... none required
121checking keyutils.h usability... no
122checking keyutils.h presence... no
123checking for keyutils.h... no
124checking for keyutils.h... (cached) no
125checking if va_copy is available... yes
126checking if va_list objects can be copied by assignment... no
127configure: using shared libraries
128checking whether ln -s works... yes
129checking for ranlib... ranlib
130checking for ar... ar cqv
131checking for ar... ar cruv
132checking for a BSD-compatible install... /usr/bin/install -c
133checking for ar... ar
134checking for perl... perl
135checking for working regcomp... yes
136checking for mode_t... yes
137checking if daemon needs a prototype provided... yes
138checking if getsockname() takes arguments struct sockaddr * and size_t *... no
139checking if getsockname() takes arguments struct sockaddr * and int *... no
140checking if getsockname() takes arguments struct sockaddr * and socklen_t *... yes
141checking for main in -lutil... yes
142checking libintl.h usability... yes
143checking libintl.h presence... yes
144checking for libintl.h... yes
145checking for library containing dgettext... no
146checking for msgfmt... msgfmt
147checking syslog.h usability... yes
148checking syslog.h presence... yes
149checking for syslog.h... yes
150checking sys/sockio.h usability... yes
151checking sys/sockio.h presence... yes
152checking for sys/sockio.h... yes
153checking ifaddrs.h usability... yes
154checking ifaddrs.h presence... yes
155checking for ifaddrs.h... yes
156checking for unistd.h... (cached) yes
157checking fnmatch.h usability... yes
158checking fnmatch.h presence... yes
159checking for fnmatch.h... yes
160checking for openlog... yes
161checking for syslog... yes
162checking for closelog... yes
163checking for strftime... yes
164checking for vsprintf... yes
165checking for vasprintf... yes
166checking for vsnprintf... yes
167checking for strlcpy... yes
168checking for fnmatch... yes
169checking for strlcpy... (cached) yes
170checking for fnmatch... (cached) yes
171checking for vasprintf... (cached) yes
172checking if vasprintf needs a prototype provided... no
173checking if swab needs a prototype provided... no
174checking for gawk... no
175checking for mawk... no
176checking for nawk... no
177checking for awk... awk
178checking for struct sockaddr.sa_len... yes
179checking for sys/types.h... (cached) yes
180checking sys/socket.h usability... yes
181checking sys/socket.h presence... yes
182checking for sys/socket.h... yes
183checking netinet/in.h usability... yes
184checking netinet/in.h presence... yes
185checking for netinet/in.h... yes
186checking netdb.h usability... yes
187checking netdb.h presence... yes
188checking for netdb.h... yes
189checking for inet_ntop... yes
190checking for inet_pton... yes
191checking for getnameinfo... yes
192checking for getaddrinfo... yes
193checking for IPv6 compile-time support without -DINET6... yes
194checking for struct sockaddr.sa_len... (cached) yes
195checking for sigprocmask... yes
196checking for sigset_t and POSIX_SIGNALS... yes
197configure: k5crypto will use 'openssl'
198checking for PKCS7_get_signer_info in -lcrypto... yes
199configure: pkinit will use 'openssl'
200checking for PKCS7_get_signer_info in -lcrypto... (cached) yes
201checking for CMS_get0_content in -lcrypto... no
202checking for SSL_CTX_new in -lssl... yes
203checking for OpenSSL... yes
204configure: TLS module will use OpenSSL
205checking return type of signal handlers... void
206checking for flex... flex
207checking lex output file root... lex.yy
208checking lex library... -lfl
209checking whether yytext is a pointer... yes
210checking for an ANSI C-conforming const... (cached) yes
211checking for dirent.h that defines DIR... yes
212checking for library containing opendir... none required
213checking whether strerror_r is declared... yes
214checking for strerror_r... yes
215checking whether strerror_r returns char *... no
216checking for strdup... yes
217checking for setvbuf... yes
218checking for seteuid... yes
219checking for setresuid... no
220checking for setreuid... yes
221checking for setegid... yes
222checking for setresgid... no
223checking for setregid... yes
224checking for setsid... yes
225checking for flock... yes
226checking for fchmod... yes
227checking for chmod... yes
228checking for strftime... (cached) yes
229checking for strptime... yes
230checking for geteuid... yes
231checking for setenv... yes
232checking for unsetenv... yes
233checking for getenv... yes
234checking for gmtime_r... yes
235checking for localtime_r... yes
236checking for bswap16... no
237checking for bswap64... no
238checking for mkstemp... yes
239checking for getusershell... yes
240checking for access... yes
241checking for getcwd... yes
242checking for srand48... yes
243checking for srand... yes
244checking for srandom... yes
245checking for stat... yes
246checking for strchr... yes
247checking for strerror... yes
248checking for timegm... yes
249checking for mkstemp... (cached) yes
250checking for gettimeofday... yes
251checking for sys_errlist declaration... yes
252checking for unistd.h... (cached) yes
253checking paths.h usability... yes
254checking paths.h presence... yes
255checking for paths.h... yes
256checking regex.h usability... yes
257checking regex.h presence... yes
258checking for regex.h... yes
259checking regexpr.h usability... no
260checking regexpr.h presence... no
261checking for regexpr.h... no
262checking fcntl.h usability... yes
263checking fcntl.h presence... yes
264checking for fcntl.h... yes
265checking for memory.h... (cached) yes
266checking for ifaddrs.h... (cached) yes
267checking sys/filio.h usability... yes
268checking sys/filio.h presence... yes
269checking for sys/filio.h... yes
270checking byteswap.h usability... no
271checking byteswap.h presence... no
272checking for byteswap.h... no
273checking machine/endian.h usability... yes
274checking machine/endian.h presence... yes
275checking for machine/endian.h... yes
276checking machine/byte_order.h usability... yes
277checking machine/byte_order.h presence... yes
278checking for machine/byte_order.h... yes
279checking sys/bswap.h usability... no
280checking sys/bswap.h presence... no
281checking for sys/bswap.h... no
282checking endian.h usability... no
283checking endian.h presence... no
284checking for endian.h... no
285checking pwd.h usability... yes
286checking pwd.h presence... yes
287checking for pwd.h... yes
288checking arpa/inet.h usability... yes
289checking arpa/inet.h presence... yes
290checking for arpa/inet.h... yes
291checking alloca.h usability... yes
292checking alloca.h presence... yes
293checking for alloca.h... yes
294checking dlfcn.h usability... yes
295checking dlfcn.h presence... yes
296checking for dlfcn.h... yes
297checking limits.h usability... yes
298checking limits.h presence... yes
299checking for limits.h... yes
300checking for regexp.h... no
301checking for struct stat.st_mtimensec... no
302checking for struct stat.st_mtimespec.tv_nsec... yes
303checking for struct stat.st_mtim.tv_nsec... no
304checking for re_comp... no
305checking for re_exec... no
306checking for regexec... yes
307checking for off_t... yes
308checking for perror declaration... no
309checking if strptime needs a prototype provided... no
310checking if argument to wait is int *... no
311checking for use of sigprocmask... yes
312checking for uid_t in sys/types.h... yes
313checking type of array argument to getgroups... gid_t
314checking for sigsetjmp... yes
315checking for sigjmp_buf... yes
316checking return type of setrpcent... void
317checking return type of endrpcent... void
318checking for bswap_16... no
319checking for bswap_64... no
320checking for gethostbyname_r... no
321checking for getpwnam_r... yes
322checking for getpwuid_r... yes
323checking return type of getpwnam_r... int
324checking number of arguments to getpwnam_r... 5
325checking whether gmtime_r returns int... no
326checking for getservbyname_r... no
327checking for yylineno declaration... yes
328checking dirent.h usability... yes
329checking dirent.h presence... yes
330checking for dirent.h... yes
331checking for uid_t in sys/types.h... (cached) yes
332checking termios.h usability... yes
333checking termios.h presence... yes
334checking for termios.h... yes
335checking for tcsetattr... yes
336checking POSIX signal handlers... yes
337checking poll.h usability... yes
338checking poll.h presence... yes
339checking for poll.h... yes
340checking for stdlib.h... (cached) yes
341checking for string.h... (cached) yes
342checking stddef.h usability... yes
343checking stddef.h presence... yes
344checking for stddef.h... yes
345checking for sys/types.h... (cached) yes
346checking sys/file.h usability... yes
347checking sys/file.h presence... yes
348checking for sys/file.h... yes
349checking sys/param.h usability... yes
350checking sys/param.h presence... yes
351checking for sys/param.h... yes
352checking for sys/stat.h... (cached) yes
353checking sys/time.h usability... yes
354checking sys/time.h presence... yes
355checking for sys/time.h... yes
356checking for netinet/in.h... (cached) yes
357checking sys/uio.h usability... yes
358checking sys/uio.h presence... yes
359checking for sys/uio.h... yes
360checking for sys/filio.h... (cached) yes
361checking sys/select.h usability... yes
362checking sys/select.h presence... yes
363checking for sys/select.h... yes
364checking time.h usability... yes
365checking time.h presence... yes
366checking for time.h... yes
367checking for paths.h... (cached) yes
368checking errno.h usability... yes
369checking errno.h presence... yes
370checking for errno.h... yes
371checking for in6addr_any definition in library... yes
372checking for ANSI stdio... yes
373checking whether time.h and sys/time.h may both be included... yes
374checking for time_t... yes
375checking for replay cache directory... /var/tmp
376checking for socklen_t... yes
377checking for struct lifconf... no
378checking for struct if_laddrconf... no
379checking for h_errno in netdb.h... yes
380checking for inline... inline
381checking for struct cmsghdr... yes
382checking for struct in_pktinfo... yes
383checking for struct in6_pktinfo... yes
384checking for struct sockaddr_storage... yes
385checking for struct rt_msghdr... yes
386checking for ssize_t... yes
387checking for u_char... yes
388checking for u_int... yes
389checking for u_long... yes
390checking for u_int8_t... yes
391checking for u_int16_t... yes
392checking for u_int32_t... yes
393checking for int8_t... yes
394checking for int16_t... yes
395checking for int32_t... yes
396checking for sh... /bin/sh
397checking for sh5... false
398checking for bash... /bin/sh
399checking if /bin/sh supports functions... yes
400checking for POSIX printf positional specification support... yes
401checking for dig... /usr/bin/dig
402checking for nslookup... /usr/bin/nslookup
403checking for bison... bison -y
404checking for runtest... no
405checking for perl... perl
406checking for perl... /opt/bin/perl
407checking for expect... /usr/bin/expect
408checking whether to use priocntl hack... no
409checking for runtest... no
410checking for perl... (cached) perl
411checking xom.h usability... no
412checking xom.h presence... no
413checking for xom.h... no
414checking where struct rpcent is declared... netdb.h
415checking for sys/select.h... (cached) yes
416checking for sys/time.h... (cached) yes
417checking for unistd.h... (cached) yes
418checking for MAXHOSTNAMELEN in sys/param.h... yes
419checking for MAXHOSTNAMELEN in netdb.h... no
420checking for BSD type aliases... yes
421checking return type of setrpcent... (cached) void
422checking return type of endrpcent... (cached) void
423checking for a recent enough OpenSSL... yes
424checking for PKCS7_get_signer_info in -lcrypto... (cached) yes
425checking for daemon... yes
426checking for python... /opt/bin/python2.7
427checking for gethostbyname_r... (cached) no
428checking for getservbyname_r... (cached) no
429checking for gmtime_r... (cached) yes
430checking for localtime_r... (cached) yes
431configure: WARNING: Some functions that are needed for library thread
432configure: WARNING: safety appear to be missing.
433configure: WARNING:   missing thread-safe function: gethostbyname_r
434configure: WARNING:   missing thread-safe function: getservbyname_r
435configure: WARNING: Without these functions, the installed libraries
436configure: WARNING: may not be thread-safe.
437checking for sd_init in -laceclnt... no
438checking Python.h usability... no
439checking Python.h presence... no
440checking for Python.h... no
441checking python2.3/Python.h usability... no
442checking python2.3/Python.h presence... no
443checking for python2.3/Python.h... no
444checking python2.5/Python.h usability... yes
445checking python2.5/Python.h presence... yes
446checking for python2.5/Python.h... yes
447checking for main in -lpython2.3... no
448checking for main in -lpython2.5... yes
449checking for readline support... using libedit
450Using built-in libverto
451checking for groff... /usr/bin/groff
452configure: Default ccache name: KCM:
453configure: Default keytab name: FILE:/etc/krb5.keytab
454configure: Default client keytab name: FILE:/opt/var/krb5/user/%{euid}/client.keytab
455configure: creating ./config.status
456config.status: creating kadmin/testing/scripts/env-setup.sh
457config.status: creating include/gssrpc/types.h
458config.status: creating plugins/preauth/pkinit/Makefile
459config.status: creating util/ss/Makefile
460config.status: creating build-tools/krb5-config
461config.status: creating build-tools/kadm-server.pc
462config.status: creating build-tools/kadm-client.pc
463config.status: creating build-tools/kdb.pc
464config.status: creating build-tools/krb5.pc
465config.status: creating build-tools/krb5-gssapi.pc
466config.status: creating build-tools/mit-krb5.pc
467config.status: creating build-tools/mit-krb5-gssapi.pc
468config.status: creating build-tools/gssrpc.pc
469config.status: creating ./Makefile
470config.status: creating util/Makefile
471config.status: creating util/support/Makefile
472config.status: creating util/profile/Makefile
473config.status: creating util/profile/testmod/Makefile
474config.status: creating util/verto/Makefile
475config.status: creating lib/Makefile
476config.status: creating lib/kdb/Makefile
477config.status: creating lib/crypto/Makefile
478config.status: creating lib/crypto/krb/Makefile
479config.status: creating lib/crypto/openssl/Makefile
480config.status: creating lib/crypto/openssl/enc_provider/Makefile
481config.status: creating lib/crypto/openssl/hash_provider/Makefile
482config.status: creating lib/crypto/openssl/des/Makefile
483config.status: creating lib/crypto/openssl/md4/Makefile
484config.status: creating lib/crypto/openssl/md5/Makefile
485config.status: creating lib/crypto/openssl/sha1/Makefile
486config.status: creating lib/crypto/openssl/sha2/Makefile
487config.status: creating lib/crypto/openssl/aes/Makefile
488config.status: creating lib/crypto/openssl/camellia/Makefile
489config.status: creating lib/crypto/crypto_tests/Makefile
490config.status: creating lib/krb5/Makefile
491config.status: creating lib/krb5/error_tables/Makefile
492config.status: creating lib/krb5/asn.1/Makefile
493config.status: creating lib/krb5/ccache/Makefile
494config.status: creating lib/krb5/keytab/Makefile
495config.status: creating lib/krb5/krb/Makefile
496config.status: creating lib/krb5/rcache/Makefile
497config.status: creating lib/krb5/os/Makefile
498config.status: creating lib/krb5/unicode/Makefile
499config.status: creating lib/gssapi/Makefile
500config.status: creating lib/gssapi/generic/Makefile
501config.status: creating lib/gssapi/krb5/Makefile
502config.status: creating lib/gssapi/spnego/Makefile
503config.status: creating lib/gssapi/mechglue/Makefile
504config.status: creating lib/rpc/Makefile
505config.status: creating lib/rpc/unit-test/Makefile
506config.status: creating lib/kadm5/Makefile
507config.status: creating lib/kadm5/clnt/Makefile
508config.status: creating lib/kadm5/srv/Makefile
509config.status: creating lib/kadm5/unit-test/Makefile
510config.status: creating lib/krad/Makefile
511config.status: creating lib/apputils/Makefile
512config.status: creating kdc/Makefile
513config.status: creating slave/Makefile
514config.status: creating config-files/Makefile
515config.status: creating build-tools/Makefile
516config.status: creating man/Makefile
517config.status: creating doc/Makefile
518config.status: creating include/Makefile
519config.status: creating plugins/hostrealm/test/Makefile
520config.status: creating plugins/locate/python/Makefile
521config.status: creating plugins/localauth/test/Makefile
522config.status: creating plugins/kadm5_hook/test/Makefile
523config.status: creating plugins/pwqual/test/Makefile
524config.status: creating plugins/audit/Makefile
525config.status: creating plugins/audit/test/Makefile
526config.status: creating plugins/kdb/db2/Makefile
527config.status: creating plugins/kdb/db2/libdb2/Makefile
528config.status: creating plugins/kdb/db2/libdb2/hash/Makefile
529config.status: creating plugins/kdb/db2/libdb2/btree/Makefile
530config.status: creating plugins/kdb/db2/libdb2/db/Makefile
531config.status: creating plugins/kdb/db2/libdb2/mpool/Makefile
532config.status: creating plugins/kdb/db2/libdb2/recno/Makefile
533config.status: creating plugins/kdb/db2/libdb2/test/Makefile
534config.status: creating plugins/kdb/hdb/Makefile
535config.status: creating plugins/preauth/cksum_body/Makefile
536config.status: creating plugins/preauth/otp/Makefile
537config.status: creating plugins/preauth/securid_sam2/Makefile
538config.status: creating plugins/preauth/wpse/Makefile
539config.status: creating plugins/authdata/greet/Makefile
540config.status: creating plugins/authdata/greet_client/Makefile
541config.status: creating plugins/authdata/greet_server/Makefile
542config.status: creating plugins/tls/k5tls/Makefile
543config.status: creating clients/Makefile
544config.status: creating clients/klist/Makefile
545config.status: creating clients/kinit/Makefile
546config.status: creating clients/kvno/Makefile
547config.status: creating clients/kdestroy/Makefile
548config.status: creating clients/kpasswd/Makefile
549config.status: creating clients/ksu/Makefile
550config.status: creating clients/kswitch/Makefile
551config.status: creating kadmin/Makefile
552config.status: creating kadmin/cli/Makefile
553config.status: creating kadmin/dbutil/Makefile
554config.status: creating kadmin/ktutil/Makefile
555config.status: creating kadmin/server/Makefile
556config.status: creating kadmin/testing/Makefile
557config.status: creating kadmin/testing/scripts/Makefile
558config.status: creating kadmin/testing/util/Makefile
559config.status: creating appl/Makefile
560config.status: creating appl/sample/Makefile
561config.status: creating appl/sample/sclient/Makefile
562config.status: creating appl/sample/sserver/Makefile
563config.status: creating appl/simple/Makefile
564config.status: creating appl/simple/client/Makefile
565config.status: creating appl/simple/server/Makefile
566config.status: creating appl/gss-sample/Makefile
567config.status: creating appl/user_user/Makefile
568config.status: creating tests/Makefile
569config.status: creating tests/resolve/Makefile
570config.status: creating tests/asn.1/Makefile
571config.status: creating tests/create/Makefile
572config.status: creating tests/hammer/Makefile
573config.status: creating tests/verify/Makefile
574config.status: creating tests/gssapi/Makefile
575config.status: creating tests/dejagnu/Makefile
576config.status: creating tests/threads/Makefile
577config.status: creating tests/shlib/Makefile
578config.status: creating tests/gss-threads/Makefile
579config.status: creating tests/misc/Makefile
580config.status: creating util/gss-kernel-lib/Makefile
581config.status: creating util/collected-client-lib/Makefile
582config.status: creating po/Makefile
583config.status: creating include/autoconf.h
584config.status: executing CRYPTO_IMPL commands
585config.status: executing PRNG_ALG commands
586config.status: executing PKINIT_CRYPTO_IMPL commands
587--->  Patching krb5-config: s|-arch [^ ]+||g
588--->  Building kerberos5
589make: Entering directory `/opt/var/macports/build/_opt_var_macports_sources_rsync.macports.org_release_tarballs_ports_net_kerberos5/kerberos5/work/krb5-1.13.1-final/src'
590(cd include && /usr/bin/make autoconf.h osconf.h)
591make[1]: Entering directory `/opt/var/macports/build/_opt_var_macports_sources_rsync.macports.org_release_tarballs_ports_net_kerberos5/kerberos5/work/krb5-1.13.1-final/src/include'
592make[1]: Nothing to be done for `autoconf.h'.
593cat ./osconf.hin | sed -e "s+@KRB5RCTMPDIR+/var/tmp+" -e "s+@PREFIX+/opt+" -e "s+@EXEC_PREFIX+/opt+" -e "s+@BINDIR+/opt/bin+" -e "s+@LIBDIR+/opt/lib+" -e "s+@SBINDIR+/opt/sbin+" -e "s+@MODULEDIR+/opt/lib/krb5/plugins+" -e "s+@GSSMODULEDIR+/opt/lib/gss+" -e 's+@LOCALSTATEDIR+/opt/var+' -e 's+@RUNSTATEDIR+/opt/var/run+' -e 's+@SYSCONFDIR+/opt/etc+' -e 's+@DYNOBJEXT+.so+' -e 's+@SYSCONFCONF+:/opt/etc/krb5.conf+' > osconf.new
594../config/move-if-changed osconf.new osconf.h
595make[1]: Leaving directory `/opt/var/macports/build/_opt_var_macports_sources_rsync.macports.org_release_tarballs_ports_net_kerberos5/kerberos5/work/krb5-1.13.1-final/src/include'
596making all in util...
597make[1]: Entering directory `/opt/var/macports/build/_opt_var_macports_sources_rsync.macports.org_release_tarballs_ports_net_kerberos5/kerberos5/work/krb5-1.13.1-final/src/util'
598making all in util/support...
599make[2]: Entering directory `/opt/var/macports/build/_opt_var_macports_sources_rsync.macports.org_release_tarballs_ports_net_kerberos5/kerberos5/work/krb5-1.13.1-final/src/util/support'
600/usr/bin/clang  -DSHARED -DHAVE_CONFIG_H  -I../../include -I../../include  -DKRB5_DEPRECATED=1 -DKRB5_PRIVATE -I/opt/include -pipe -Os -arch x86_64 -fno-common -Wall -Wcast-align -Wshadow -Wmissing-prototypes -Wno-format-zero-length -Woverflow -Wstrict-overflow -Wmissing-format-attribute -Wmissing-prototypes -Wreturn-type -Wmissing-braces -Wparentheses -Wswitch -Wunused-function -Wunused-label -Wunused-variable -Wunused-value -Wunknown-pragmas -Wsign-compare -Wnewline-eof -Werror=uninitialized -Werror=pointer-arith -Werror=declaration-after-statement -Werror-implicit-function-declaration  -c threads.c -o threads.so.o && mv -f threads.so.o threads.so
601/usr/bin/clang  -DSHARED -DHAVE_CONFIG_H  -I../../include -I../../include  -DKRB5_DEPRECATED=1 -DKRB5_PRIVATE -I/opt/include -pipe -Os -arch x86_64 -fno-common -Wall -Wcast-align -Wshadow -Wmissing-prototypes -Wno-format-zero-length -Woverflow -Wstrict-overflow -Wmissing-format-attribute -Wmissing-prototypes -Wreturn-type -Wmissing-braces -Wparentheses -Wswitch -Wunused-function -Wunused-label -Wunused-variable -Wunused-value -Wunknown-pragmas -Wsign-compare -Wnewline-eof -Werror=uninitialized -Werror=pointer-arith -Werror=declaration-after-statement -Werror-implicit-function-declaration  -c init-addrinfo.c -o init-addrinfo.so.o && mv -f init-addrinfo.so.o init-addrinfo.so
602/usr/bin/clang  -DSHARED -DHAVE_CONFIG_H  -I../../include -I../../include  -DKRB5_DEPRECATED=1 -DKRB5_PRIVATE -I/opt/include -pipe -Os -arch x86_64 -fno-common -Wall -Wcast-align -Wshadow -Wmissing-prototypes -Wno-format-zero-length -Woverflow -Wstrict-overflow -Wmissing-format-attribute -Wmissing-prototypes -Wreturn-type -Wmissing-braces -Wparentheses -Wswitch -Wunused-function -Wunused-label -Wunused-variable -Wunused-value -Wunknown-pragmas -Wsign-compare -Wnewline-eof -Werror=uninitialized -Werror=pointer-arith -Werror=declaration-after-statement -Werror-implicit-function-declaration  -c plugins.c -o plugins.so.o && mv -f plugins.so.o plugins.so
603/usr/bin/clang  -DSHARED -DHAVE_CONFIG_H  -I../../include -I../../include  -DKRB5_DEPRECATED=1 -DKRB5_PRIVATE -I/opt/include -pipe -Os -arch x86_64 -fno-common -Wall -Wcast-align -Wshadow -Wmissing-prototypes -Wno-format-zero-length -Woverflow -Wstrict-overflow -Wmissing-format-attribute -Wmissing-prototypes -Wreturn-type -Wmissing-braces -Wparentheses -Wswitch -Wunused-function -Wunused-label -Wunused-variable -Wunused-value -Wunknown-pragmas -Wsign-compare -Wnewline-eof -Werror=uninitialized -Werror=pointer-arith -Werror=declaration-after-statement -Werror-implicit-function-declaration  -c errors.c -o errors.so.o && mv -f errors.so.o errors.so
604/usr/bin/clang  -DSHARED -DHAVE_CONFIG_H  -I../../include -I../../include  -DKRB5_DEPRECATED=1 -DKRB5_PRIVATE -I/opt/include -pipe -Os -arch x86_64 -fno-common -Wall -Wcast-align -Wshadow -Wmissing-prototypes -Wno-format-zero-length -Woverflow -Wstrict-overflow -Wmissing-format-attribute -Wmissing-prototypes -Wreturn-type -Wmissing-braces -Wparentheses -Wswitch -Wunused-function -Wunused-label -Wunused-variable -Wunused-value -Wunknown-pragmas -Wsign-compare -Wnewline-eof -Werror=uninitialized -Werror=pointer-arith -Werror=declaration-after-statement -Werror-implicit-function-declaration  -c k5buf.c -o k5buf.so.o && mv -f k5buf.so.o k5buf.so
605/usr/bin/clang  -DSHARED -DHAVE_CONFIG_H  -I../../include -I../../include  -DKRB5_DEPRECATED=1 -DKRB5_PRIVATE -I/opt/include -pipe -Os -arch x86_64 -fno-common -Wall -Wcast-align -Wshadow -Wmissing-prototypes -Wno-format-zero-length -Woverflow -Wstrict-overflow -Wmissing-format-attribute -Wmissing-prototypes -Wreturn-type -Wmissing-braces -Wparentheses -Wswitch -Wunused-function -Wunused-label -Wunused-variable -Wunused-value -Wunknown-pragmas -Wsign-compare -Wnewline-eof -Werror=uninitialized -Werror=pointer-arith -Werror=declaration-after-statement -Werror-implicit-function-declaration  -c gmt_mktime.c -o gmt_mktime.so.o && mv -f gmt_mktime.so.o gmt_mktime.so
606/usr/bin/clang  -DSHARED -DHAVE_CONFIG_H  -I../../include -I../../include  -DKRB5_DEPRECATED=1 -DKRB5_PRIVATE -I/opt/include -pipe -Os -arch x86_64 -fno-common -Wall -Wcast-align -Wshadow -Wmissing-prototypes -Wno-format-zero-length -Woverflow -Wstrict-overflow -Wmissing-format-attribute -Wmissing-prototypes -Wreturn-type -Wmissing-braces -Wparentheses -Wswitch -Wunused-function -Wunused-label -Wunused-variable -Wunused-value -Wunknown-pragmas -Wsign-compare -Wnewline-eof -Werror=uninitialized -Werror=pointer-arith -Werror=declaration-after-statement -Werror-implicit-function-declaration  -c fake-addrinfo.c -o fake-addrinfo.so.o && mv -f fake-addrinfo.so.o fake-addrinfo.so
607/usr/bin/clang  -DSHARED -DHAVE_CONFIG_H  -I../../include -I../../include  -DKRB5_DEPRECATED=1 -DKRB5_PRIVATE -I/opt/include -pipe -Os -arch x86_64 -fno-common -Wall -Wcast-align -Wshadow -Wmissing-prototypes -Wno-format-zero-length -Woverflow -Wstrict-overflow -Wmissing-format-attribute -Wmissing-prototypes -Wreturn-type -Wmissing-braces -Wparentheses -Wswitch -Wunused-function -Wunused-label -Wunused-variable -Wunused-value -Wunknown-pragmas -Wsign-compare -Wnewline-eof -Werror=uninitialized -Werror=pointer-arith -Werror=declaration-after-statement -Werror-implicit-function-declaration  -c utf8.c -o utf8.so.o && mv -f utf8.so.o utf8.so
608/usr/bin/clang  -DSHARED -DHAVE_CONFIG_H  -I../../include -I../../include  -DKRB5_DEPRECATED=1 -DKRB5_PRIVATE -I/opt/include -pipe -Os -arch x86_64 -fno-common -Wall -Wcast-align -Wshadow -Wmissing-prototypes -Wno-format-zero-length -Woverflow -Wstrict-overflow -Wmissing-format-attribute -Wmissing-prototypes -Wreturn-type -Wmissing-braces -Wparentheses -Wswitch -Wunused-function -Wunused-label -Wunused-variable -Wunused-value -Wunknown-pragmas -Wsign-compare -Wnewline-eof -Werror=uninitialized -Werror=pointer-arith -Werror=declaration-after-statement -Werror-implicit-function-declaration  -c utf8_conv.c -o utf8_conv.so.o && mv -f utf8_conv.so.o utf8_conv.so
609utf8_conv.c:203:29: warning: cast from 'unsigned char *' to 'krb5_ucs2 *' (aka 'unsigned short *') increases required alignment from 1 to 2 [-Wcast-align]
610    len = k5_utf8s_to_ucs2s((krb5_ucs2 *)*ucs2les, utf8s, chars + 1, 1);
611                            ^~~~~~~~~~~~~~~~~~~~~
612utf8_conv.c:362:35: warning: cast from 'const unsigned char *' to 'krb5_ucs2 *' (aka 'unsigned short *') increases required alignment from 1 to 2 [-Wcast-align]
613    len = k5_ucs2s_to_utf8s(NULL, (krb5_ucs2 *)ucs2les, 0, -1, 1);
614                                  ^~~~~~~~~~~~~~~~~~~~
615utf8_conv.c:371:37: warning: cast from 'const unsigned char *' to 'krb5_ucs2 *' (aka 'unsigned short *') increases required alignment from 1 to 2 [-Wcast-align]
616    len = k5_ucs2s_to_utf8s(*utf8s, (krb5_ucs2 *)ucs2les, (size_t)len + 1, -1, 1);
617                                    ^~~~~~~~~~~~~~~~~~~~
618utf8_conv.c:433:35: warning: cast from 'const unsigned char *' to 'krb5_ucs2 *' (aka 'unsigned short *') increases required alignment from 1 to 2 [-Wcast-align]
619    len = k5_ucs2s_to_utf8s(NULL, (krb5_ucs2 *)ucs2les, 0,
620                                  ^~~~~~~~~~~~~~~~~~~~
621utf8_conv.c:443:37: warning: cast from 'const unsigned char *' to 'krb5_ucs2 *' (aka 'unsigned short *') increases required alignment from 1 to 2 [-Wcast-align]
622    len = k5_ucs2s_to_utf8s(*utf8s, (krb5_ucs2 *)ucs2les, (size_t)len,
623                                    ^~~~~~~~~~~~~~~~~~~~
6245 warnings generated.
625/usr/bin/clang  -DSHARED -DHAVE_CONFIG_H  -I../../include -I../../include  -DKRB5_DEPRECATED=1 -DKRB5_PRIVATE -I/opt/include -pipe -Os -arch x86_64 -fno-common -Wall -Wcast-align -Wshadow -Wmissing-prototypes -Wno-format-zero-length -Woverflow -Wstrict-overflow -Wmissing-format-attribute -Wmissing-prototypes -Wreturn-type -Wmissing-braces -Wparentheses -Wswitch -Wunused-function -Wunused-label -Wunused-variable -Wunused-value -Wunknown-pragmas -Wsign-compare -Wnewline-eof -Werror=uninitialized -Werror=pointer-arith -Werror=declaration-after-statement -Werror-implicit-function-declaration  -c zap.c -o zap.so.o && mv -f zap.so.o zap.so
626/usr/bin/clang  -DSHARED -DHAVE_CONFIG_H  -I../../include -I../../include  -DKRB5_DEPRECATED=1 -DKRB5_PRIVATE -I/opt/include -pipe -Os -arch x86_64 -fno-common -Wall -Wcast-align -Wshadow -Wmissing-prototypes -Wno-format-zero-length -Woverflow -Wstrict-overflow -Wmissing-format-attribute -Wmissing-prototypes -Wreturn-type -Wmissing-braces -Wparentheses -Wswitch -Wunused-function -Wunused-label -Wunused-variable -Wunused-value -Wunknown-pragmas -Wsign-compare -Wnewline-eof -Werror=uninitialized -Werror=pointer-arith -Werror=declaration-after-statement -Werror-implicit-function-declaration  -c path.c -o path.so.o && mv -f path.so.o path.so
627/usr/bin/clang  -DSHARED -DHAVE_CONFIG_H  -I../../include -I../../include  -DKRB5_DEPRECATED=1 -DKRB5_PRIVATE -I/opt/include -pipe -Os -arch x86_64 -fno-common -Wall -Wcast-align -Wshadow -Wmissing-prototypes -Wno-format-zero-length -Woverflow -Wstrict-overflow -Wmissing-format-attribute -Wmissing-prototypes -Wreturn-type -Wmissing-braces -Wparentheses -Wswitch -Wunused-function -Wunused-label -Wunused-variable -Wunused-value -Wunknown-pragmas -Wsign-compare -Wnewline-eof -Werror=uninitialized -Werror=pointer-arith -Werror=declaration-after-statement -Werror-implicit-function-declaration  -c base64.c -o base64.so.o && mv -f base64.so.o base64.so
628/usr/bin/clang  -DSHARED -DHAVE_CONFIG_H  -I../../include -I../../include  -DKRB5_DEPRECATED=1 -DKRB5_PRIVATE -I/opt/include -pipe -Os -arch x86_64 -fno-common -Wall -Wcast-align -Wshadow -Wmissing-prototypes -Wno-format-zero-length -Woverflow -Wstrict-overflow -Wmissing-format-attribute -Wmissing-prototypes -Wreturn-type -Wmissing-braces -Wparentheses -Wswitch -Wunused-function -Wunused-label -Wunused-variable -Wunused-value -Wunknown-pragmas -Wsign-compare -Wnewline-eof -Werror=uninitialized -Werror=pointer-arith -Werror=declaration-after-statement -Werror-implicit-function-declaration  -c json.c -o json.so.o && mv -f json.so.o json.so
629/usr/bin/clang  -DSHARED -DHAVE_CONFIG_H  -I../../include -I../../include  -DKRB5_DEPRECATED=1 -DKRB5_PRIVATE -I/opt/include -pipe -Os -arch x86_64 -fno-common -Wall -Wcast-align -Wshadow -Wmissing-prototypes -Wno-format-zero-length -Woverflow -Wstrict-overflow -Wmissing-format-attribute -Wmissing-prototypes -Wreturn-type -Wmissing-braces -Wparentheses -Wswitch -Wunused-function -Wunused-label -Wunused-variable -Wunused-value -Wunknown-pragmas -Wsign-compare -Wnewline-eof -Werror=uninitialized -Werror=pointer-arith -Werror=declaration-after-statement -Werror-implicit-function-declaration  -c bcmp.c -o bcmp.so.o && mv -f bcmp.so.o bcmp.so
630/usr/bin/clang  -DSHARED -DHAVE_CONFIG_H  -I../../include -I../../include  -DKRB5_DEPRECATED=1 -DKRB5_PRIVATE -I/opt/include -pipe -Os -arch x86_64 -fno-common -Wall -Wcast-align -Wshadow -Wmissing-prototypes -Wno-format-zero-length -Woverflow -Wstrict-overflow -Wmissing-format-attribute -Wmissing-prototypes -Wreturn-type -Wmissing-braces -Wparentheses -Wswitch -Wunused-function -Wunused-label -Wunused-variable -Wunused-value -Wunknown-pragmas -Wsign-compare -Wnewline-eof -Werror=uninitialized -Werror=pointer-arith -Werror=declaration-after-statement -Werror-implicit-function-declaration  -c strerror_r.c -o strerror_r.so.o && mv -f strerror_r.so.o strerror_r.so
631: updated OBJS.SH
632cat ./libkrb5support-fixed.exports > new-exports
633for i in  .; do \
634          if test "$i" != .; then echo $i >> new-exports; else :; fi ; \
635        done
636mv -f new-exports libkrb5support.exports
637sed > darwin-exports.tmp < libkrb5support.exports "s/^/_/"
638mv -f darwin-exports.tmp darwin.exports
639rm -f libkrb5support.1.1.dylib
640building shared krb5support library (1.1)
641set -x; objlist=`set -x && perl -p -e 'BEGIN { $SIG{__WARN__} = sub {die @_} }; $e=$ARGV; $e =~ s/OBJS\...$//; s/^/ /; s/ $//; s/ / $e/g;' OBJS.SH` && /usr/bin/clang -undefined error -dead_strip -dynamiclib -compatibility_version 1 -current_version 1.1 -install_name "/opt/lib/libkrb5support.1.1.dylib" -exported_symbols_list darwin.exports -pipe -Os -arch x86_64 -fno-common -o libkrb5support.1.1.dylib $objlist -L../../lib -lcrypto -lresolv   -Wl,-headerpad_max_install_names -arch x86_64 -Wl,-search_paths_first
642++ set -x
643++ perl -p -e 'BEGIN { $SIG{__WARN__} = sub {die @_} }; $e=$ARGV; $e =~ s/OBJS\...$//; s/^/ /; s/ $//; s/ / $e/g;' OBJS.SH
644+ objlist=' threads.so init-addrinfo.so plugins.so errors.so k5buf.so gmt_mktime.so fake-addrinfo.so utf8.so utf8_conv.so zap.so path.so base64.so json.so bcmp.so strerror_r.so'
645+ /usr/bin/clang -undefined error -dead_strip -dynamiclib -compatibility_version 1 -current_version 1.1 -install_name /opt/lib/libkrb5support.1.1.dylib -exported_symbols_list darwin.exports -pipe -Os -arch x86_64 -fno-common -o libkrb5support.1.1.dylib threads.so init-addrinfo.so plugins.so errors.so k5buf.so gmt_mktime.so fake-addrinfo.so utf8.so utf8_conv.so zap.so path.so base64.so json.so bcmp.so strerror_r.so -L../../lib -lcrypto -lresolv -Wl,-headerpad_max_install_names -arch x86_64 -Wl,-search_paths_first
646rm -f libkrb5support.dylib
647ln -s libkrb5support.1.1.dylib libkrb5support.dylib
648rm -f ../../lib/libkrb5support.dylib
649(cd ../../lib && \
650         ln -s libkrb5support.1.1.dylib libkrb5support.dylib)
651rm -f ../../lib/libkrb5support.1.1.dylib
652(cd ../../lib && ln -s ../util/support/libkrb5support.1.1.dylib .)
653rm -f libkrb5support.1.dylib
654ln -s libkrb5support.1.1.dylib libkrb5support.1.dylib
655rm -f ../../lib/libkrb5support.1.dylib
656(cd ../../lib && \
657         ln -s libkrb5support.1.1.dylib libkrb5support.1.dylib)
658make[2]: Leaving directory `/opt/var/macports/build/_opt_var_macports_sources_rsync.macports.org_release_tarballs_ports_net_kerberos5/kerberos5/work/krb5-1.13.1-final/src/util/support'
659making all in util/ss...
660make[2]: Entering directory `/opt/var/macports/build/_opt_var_macports_sources_rsync.macports.org_release_tarballs_ports_net_kerberos5/kerberos5/work/krb5-1.13.1-final/src/util/ss'
661/bin/sh ./config_script ./mk_cmds.sh . awk sed > mk_cmds
662chmod 755 mk_cmds       
663rm -f ct_c.awk
664cp ./ct_c_awk.in ct_c.awk
665sed -e '/^#/d' ./ct_c_sed.in > ct_c.sed
666rm -f et-h-ss_err.et et-h-ss_err.c et-h-ss_err.h
667cp ss_err.et et-h-ss_err.et
668compile_et et-h-ss_err.et
669mv -f et-h-ss_err.h ss_err.h
670rm -f et-h-ss_err.et et-h-ss_err.c
671if [ -d ../../include/ss ] ; then :; else mkdir -p ../../include/ss; fi
672echo timestamp > ../../include/ss/timestamp
673rm -f ../../include/ss/ss.h
674cp ./ss.h ../../include/ss/ss.h
675rm -f ../../include/ss/ss_err.h
676cp ss_err.h ../../include/ss/ss_err.h
677rm -f et-c-ss_err.et et-c-ss_err.c et-c-ss_err.h
678cp ss_err.et et-c-ss_err.et
679compile_et et-c-ss_err.et
680mv -f et-c-ss_err.c ss_err.c
681rm -f et-c-ss_err.et et-c-ss_err.h
682/usr/bin/clang -DHAVE_CONFIG_H  -I../../include -I../../include -I. -I./ -I/opt/include -I/opt/include/editline  -DKRB5_DEPRECATED=1 -DKRB5_PRIVATE -I/opt/include -pipe -Os -arch x86_64 -fno-common -Wall -Wcast-align -Wshadow -Wmissing-prototypes -Wno-format-zero-length -Woverflow -Wstrict-overflow -Wmissing-format-attribute -Wmissing-prototypes -Wreturn-type -Wmissing-braces -Wparentheses -Wswitch -Wunused-function -Wunused-label -Wunused-variable -Wunused-value -Wunknown-pragmas -Wsign-compare -Wnewline-eof -Werror=uninitialized -Werror=pointer-arith -Werror=declaration-after-statement -Werror-implicit-function-declaration  -c ss_err.c
683../../util/ss/mk_cmds std_rqs.ct
684/usr/bin/clang -DHAVE_CONFIG_H  -I../../include -I../../include -I. -I./ -I/opt/include -I/opt/include/editline  -DKRB5_DEPRECATED=1 -DKRB5_PRIVATE -I/opt/include -pipe -Os -arch x86_64 -fno-common -Wall -Wcast-align -Wshadow -Wmissing-prototypes -Wno-format-zero-length -Woverflow -Wstrict-overflow -Wmissing-format-attribute -Wmissing-prototypes -Wreturn-type -Wmissing-braces -Wparentheses -Wswitch -Wunused-function -Wunused-label -Wunused-variable -Wunused-value -Wunknown-pragmas -Wsign-compare -Wnewline-eof -Werror=uninitialized -Werror=pointer-arith -Werror=declaration-after-statement -Werror-implicit-function-declaration  -c std_rqs.c
685/usr/bin/clang -DHAVE_CONFIG_H  -I../../include -I../../include -I. -I./ -I/opt/include -I/opt/include/editline  -DKRB5_DEPRECATED=1 -DKRB5_PRIVATE -I/opt/include -pipe -Os -arch x86_64 -fno-common -Wall -Wcast-align -Wshadow -Wmissing-prototypes -Wno-format-zero-length -Woverflow -Wstrict-overflow -Wmissing-format-attribute -Wmissing-prototypes -Wreturn-type -Wmissing-braces -Wparentheses -Wswitch -Wunused-function -Wunused-label -Wunused-variable -Wunused-value -Wunknown-pragmas -Wsign-compare -Wnewline-eof -Werror=uninitialized -Werror=pointer-arith -Werror=declaration-after-statement -Werror-implicit-function-declaration  -c invocation.c
686/usr/bin/clang -DHAVE_CONFIG_H  -I../../include -I../../include -I. -I./ -I/opt/include -I/opt/include/editline  -DKRB5_DEPRECATED=1 -DKRB5_PRIVATE -I/opt/include -pipe -Os -arch x86_64 -fno-common -Wall -Wcast-align -Wshadow -Wmissing-prototypes -Wno-format-zero-length -Woverflow -Wstrict-overflow -Wmissing-format-attribute -Wmissing-prototypes -Wreturn-type -Wmissing-braces -Wparentheses -Wswitch -Wunused-function -Wunused-label -Wunused-variable -Wunused-value -Wunknown-pragmas -Wsign-compare -Wnewline-eof -Werror=uninitialized -Werror=pointer-arith -Werror=declaration-after-statement -Werror-implicit-function-declaration  -c help.c
687/usr/bin/clang -DHAVE_CONFIG_H  -I../../include -I../../include -I. -I./ -I/opt/include -I/opt/include/editline  -DKRB5_DEPRECATED=1 -DKRB5_PRIVATE -I/opt/include -pipe -Os -arch x86_64 -fno-common -Wall -Wcast-align -Wshadow -Wmissing-prototypes -Wno-format-zero-length -Woverflow -Wstrict-overflow -Wmissing-format-attribute -Wmissing-prototypes -Wreturn-type -Wmissing-braces -Wparentheses -Wswitch -Wunused-function -Wunused-label -Wunused-variable -Wunused-value -Wunknown-pragmas -Wsign-compare -Wnewline-eof -Werror=uninitialized -Werror=pointer-arith -Werror=declaration-after-statement -Werror-implicit-function-declaration  -c execute_cmd.c
688/usr/bin/clang -DHAVE_CONFIG_H  -I../../include -I../../include -I. -I./ -I/opt/include -I/opt/include/editline  -DKRB5_DEPRECATED=1 -DKRB5_PRIVATE -I/opt/include -pipe -Os -arch x86_64 -fno-common -Wall -Wcast-align -Wshadow -Wmissing-prototypes -Wno-format-zero-length -Woverflow -Wstrict-overflow -Wmissing-format-attribute -Wmissing-prototypes -Wreturn-type -Wmissing-braces -Wparentheses -Wswitch -Wunused-function -Wunused-label -Wunused-variable -Wunused-value -Wunknown-pragmas -Wsign-compare -Wnewline-eof -Werror=uninitialized -Werror=pointer-arith -Werror=declaration-after-statement -Werror-implicit-function-declaration  -c listen.c
689/usr/bin/clang -DHAVE_CONFIG_H  -I../../include -I../../include -I. -I./ -I/opt/include -I/opt/include/editline  -DKRB5_DEPRECATED=1 -DKRB5_PRIVATE -I/opt/include -pipe -Os -arch x86_64 -fno-common -Wall -Wcast-align -Wshadow -Wmissing-prototypes -Wno-format-zero-length -Woverflow -Wstrict-overflow -Wmissing-format-attribute -Wmissing-prototypes -Wreturn-type -Wmissing-braces -Wparentheses -Wswitch -Wunused-function -Wunused-label -Wunused-variable -Wunused-value -Wunknown-pragmas -Wsign-compare -Wnewline-eof -Werror=uninitialized -Werror=pointer-arith -Werror=declaration-after-statement -Werror-implicit-function-declaration  -c parse.c
690/usr/bin/clang -DHAVE_CONFIG_H  -I../../include -I../../include -I. -I./ -I/opt/include -I/opt/include/editline  -DKRB5_DEPRECATED=1 -DKRB5_PRIVATE -I/opt/include -pipe -Os -arch x86_64 -fno-common -Wall -Wcast-align -Wshadow -Wmissing-prototypes -Wno-format-zero-length -Woverflow -Wstrict-overflow -Wmissing-format-attribute -Wmissing-prototypes -Wreturn-type -Wmissing-braces -Wparentheses -Wswitch -Wunused-function -Wunused-label -Wunused-variable -Wunused-value -Wunknown-pragmas -Wsign-compare -Wnewline-eof -Werror=uninitialized -Werror=pointer-arith -Werror=declaration-after-statement -Werror-implicit-function-declaration  -c error.c
691/usr/bin/clang -DHAVE_CONFIG_H  -I../../include -I../../include -I. -I./ -I/opt/include -I/opt/include/editline  -DKRB5_DEPRECATED=1 -DKRB5_PRIVATE -I/opt/include -pipe -Os -arch x86_64 -fno-common -Wall -Wcast-align -Wshadow -Wmissing-prototypes -Wno-format-zero-length -Woverflow -Wstrict-overflow -Wmissing-format-attribute -Wmissing-prototypes -Wreturn-type -Wmissing-braces -Wparentheses -Wswitch -Wunused-function -Wunused-label -Wunused-variable -Wunused-value -Wunknown-pragmas -Wsign-compare -Wnewline-eof -Werror=uninitialized -Werror=pointer-arith -Werror=declaration-after-statement -Werror-implicit-function-declaration  -c prompt.c
692/usr/bin/clang -DHAVE_CONFIG_H  -I../../include -I../../include -I. -I./ -I/opt/include -I/opt/include/editline  -DKRB5_DEPRECATED=1 -DKRB5_PRIVATE -I/opt/include -pipe -Os -arch x86_64 -fno-common -Wall -Wcast-align -Wshadow -Wmissing-prototypes -Wno-format-zero-length -Woverflow -Wstrict-overflow -Wmissing-format-attribute -Wmissing-prototypes -Wreturn-type -Wmissing-braces -Wparentheses -Wswitch -Wunused-function -Wunused-label -Wunused-variable -Wunused-value -Wunknown-pragmas -Wsign-compare -Wnewline-eof -Werror=uninitialized -Werror=pointer-arith -Werror=declaration-after-statement -Werror-implicit-function-declaration  -c request_tbl.c
693/usr/bin/clang -DHAVE_CONFIG_H  -I../../include -I../../include -I. -I./ -I/opt/include -I/opt/include/editline  -DKRB5_DEPRECATED=1 -DKRB5_PRIVATE -I/opt/include -pipe -Os -arch x86_64 -fno-common -Wall -Wcast-align -Wshadow -Wmissing-prototypes -Wno-format-zero-length -Woverflow -Wstrict-overflow -Wmissing-format-attribute -Wmissing-prototypes -Wreturn-type -Wmissing-braces -Wparentheses -Wswitch -Wunused-function -Wunused-label -Wunused-variable -Wunused-value -Wunknown-pragmas -Wsign-compare -Wnewline-eof -Werror=uninitialized -Werror=pointer-arith -Werror=declaration-after-statement -Werror-implicit-function-declaration  -c list_rqs.c
694/usr/bin/clang -DHAVE_CONFIG_H  -I../../include -I../../include -I. -I./ -I/opt/include -I/opt/include/editline  -DKRB5_DEPRECATED=1 -DKRB5_PRIVATE -I/opt/include -pipe -Os -arch x86_64 -fno-common -Wall -Wcast-align -Wshadow -Wmissing-prototypes -Wno-format-zero-length -Woverflow -Wstrict-overflow -Wmissing-format-attribute -Wmissing-prototypes -Wreturn-type -Wmissing-braces -Wparentheses -Wswitch -Wunused-function -Wunused-label -Wunused-variable -Wunused-value -Wunknown-pragmas -Wsign-compare -Wnewline-eof -Werror=uninitialized -Werror=pointer-arith -Werror=declaration-after-statement -Werror-implicit-function-declaration  -c pager.c
695/usr/bin/clang -DHAVE_CONFIG_H  -I../../include -I../../include -I. -I./ -I/opt/include -I/opt/include/editline  -DKRB5_DEPRECATED=1 -DKRB5_PRIVATE -I/opt/include -pipe -Os -arch x86_64 -fno-common -Wall -Wcast-align -Wshadow -Wmissing-prototypes -Wno-format-zero-length -Woverflow -Wstrict-overflow -Wmissing-format-attribute -Wmissing-prototypes -Wreturn-type -Wmissing-braces -Wparentheses -Wswitch -Wunused-function -Wunused-label -Wunused-variable -Wunused-value -Wunknown-pragmas -Wsign-compare -Wnewline-eof -Werror=uninitialized -Werror=pointer-arith -Werror=declaration-after-statement -Werror-implicit-function-declaration  -c requests.c
696/usr/bin/clang -DHAVE_CONFIG_H  -I../../include -I../../include -I. -I./ -I/opt/include -I/opt/include/editline  -DKRB5_DEPRECATED=1 -DKRB5_PRIVATE -I/opt/include -pipe -Os -arch x86_64 -fno-common -Wall -Wcast-align -Wshadow -Wmissing-prototypes -Wno-format-zero-length -Woverflow -Wstrict-overflow -Wmissing-format-attribute -Wmissing-prototypes -Wreturn-type -Wmissing-braces -Wparentheses -Wswitch -Wunused-function -Wunused-label -Wunused-variable -Wunused-value -Wunknown-pragmas -Wsign-compare -Wnewline-eof -Werror=uninitialized -Werror=pointer-arith -Werror=declaration-after-statement -Werror-implicit-function-declaration  -c data.c
697: updated OBJS.ST
698rm -f libss.a
699building static ss library
700set -x; objlist=`set -x && perl -p -e 'BEGIN { $SIG{__WARN__} = sub {die @_} }; $e=$ARGV; $e =~ s/OBJS\...$//; s/^/ /; s/ $//; s/ / $e/g;' OBJS.ST` && ar cq libss.a $objlist
701++ set -x
702++ perl -p -e 'BEGIN { $SIG{__WARN__} = sub {die @_} }; $e=$ARGV; $e =~ s/OBJS\...$//; s/^/ /; s/ $//; s/ / $e/g;' OBJS.ST
703+ objlist=' ss_err.o std_rqs.o invocation.o help.o execute_cmd.o listen.o parse.o error.o prompt.o request_tbl.o list_rqs.o pager.o requests.o data.o'
704+ ar cq libss.a ss_err.o std_rqs.o invocation.o help.o execute_cmd.o listen.o parse.o error.o prompt.o request_tbl.o list_rqs.o pager.o requests.o data.o
705ranlib libss.a
706rm -f ../../lib/libss.a
707(cd ../../lib && ln -s ../util/ss/libss.a .)
708make[2]: Leaving directory `/opt/var/macports/build/_opt_var_macports_sources_rsync.macports.org_release_tarballs_ports_net_kerberos5/kerberos5/work/krb5-1.13.1-final/src/util/ss'
709making all in util/profile...
710make[2]: Entering directory `/opt/var/macports/build/_opt_var_macports_sources_rsync.macports.org_release_tarballs_ports_net_kerberos5/kerberos5/work/krb5-1.13.1-final/src/util/profile'
711making all in util/profile/testmod...
712make[3]: Entering directory `/opt/var/macports/build/_opt_var_macports_sources_rsync.macports.org_release_tarballs_ports_net_kerberos5/kerberos5/work/krb5-1.13.1-final/src/util/profile/testmod'
713make[3]: Leaving directory `/opt/var/macports/build/_opt_var_macports_sources_rsync.macports.org_release_tarballs_ports_net_kerberos5/kerberos5/work/krb5-1.13.1-final/src/util/profile/testmod'
714rm -f et-h-prof_err.et et-h-prof_err.c et-h-prof_err.h
715cp prof_err.et et-h-prof_err.et
716compile_et et-h-prof_err.et
717mv -f et-h-prof_err.h prof_err.h
718rm -f et-h-prof_err.et et-h-prof_err.c
719cat ./profile.hin prof_err.h > profile.h
720cp profile.h "../../include/profile.h"
721/usr/bin/clang  -DSHARED -DHAVE_CONFIG_H -DHAS_STDARG -DLIBDIR=\"/opt/lib\" -I../../include -I../../include -I.  -DKRB5_DEPRECATED=1 -DKRB5_PRIVATE -I/opt/include -pipe -Os -arch x86_64 -fno-common -Wall -Wcast-align -Wshadow -Wmissing-prototypes -Wno-format-zero-length -Woverflow -Wstrict-overflow -Wmissing-format-attribute -Wmissing-prototypes -Wreturn-type -Wmissing-braces -Wparentheses -Wswitch -Wunused-function -Wunused-label -Wunused-variable -Wunused-value -Wunknown-pragmas -Wsign-compare -Wnewline-eof -Werror=uninitialized -Werror=pointer-arith -Werror=declaration-after-statement -Werror-implicit-function-declaration  -c prof_tree.c -o prof_tree.so.o && mv -f prof_tree.so.o prof_tree.so
722/usr/bin/clang  -DSHARED -DHAVE_CONFIG_H -DHAS_STDARG -DLIBDIR=\"/opt/lib\" -I../../include -I../../include -I.  -DKRB5_DEPRECATED=1 -DKRB5_PRIVATE -I/opt/include -pipe -Os -arch x86_64 -fno-common -Wall -Wcast-align -Wshadow -Wmissing-prototypes -Wno-format-zero-length -Woverflow -Wstrict-overflow -Wmissing-format-attribute -Wmissing-prototypes -Wreturn-type -Wmissing-braces -Wparentheses -Wswitch -Wunused-function -Wunused-label -Wunused-variable -Wunused-value -Wunknown-pragmas -Wsign-compare -Wnewline-eof -Werror=uninitialized -Werror=pointer-arith -Werror=declaration-after-statement -Werror-implicit-function-declaration  -c prof_file.c -o prof_file.so.o && mv -f prof_file.so.o prof_file.so
723/usr/bin/clang  -DSHARED -DHAVE_CONFIG_H -DHAS_STDARG -DLIBDIR=\"/opt/lib\" -I../../include -I../../include -I.  -DKRB5_DEPRECATED=1 -DKRB5_PRIVATE -I/opt/include -pipe -Os -arch x86_64 -fno-common -Wall -Wcast-align -Wshadow -Wmissing-prototypes -Wno-format-zero-length -Woverflow -Wstrict-overflow -Wmissing-format-attribute -Wmissing-prototypes -Wreturn-type -Wmissing-braces -Wparentheses -Wswitch -Wunused-function -Wunused-label -Wunused-variable -Wunused-value -Wunknown-pragmas -Wsign-compare -Wnewline-eof -Werror=uninitialized -Werror=pointer-arith -Werror=declaration-after-statement -Werror-implicit-function-declaration  -c prof_parse.c -o prof_parse.so.o && mv -f prof_parse.so.o prof_parse.so
724/usr/bin/clang  -DSHARED -DHAVE_CONFIG_H -DHAS_STDARG -DLIBDIR=\"/opt/lib\" -I../../include -I../../include -I.  -DKRB5_DEPRECATED=1 -DKRB5_PRIVATE -I/opt/include -pipe -Os -arch x86_64 -fno-common -Wall -Wcast-align -Wshadow -Wmissing-prototypes -Wno-format-zero-length -Woverflow -Wstrict-overflow -Wmissing-format-attribute -Wmissing-prototypes -Wreturn-type -Wmissing-braces -Wparentheses -Wswitch -Wunused-function -Wunused-label -Wunused-variable -Wunused-value -Wunknown-pragmas -Wsign-compare -Wnewline-eof -Werror=uninitialized -Werror=pointer-arith -Werror=declaration-after-statement -Werror-implicit-function-declaration  -c prof_get.c -o prof_get.so.o && mv -f prof_get.so.o prof_get.so
725/usr/bin/clang  -DSHARED -DHAVE_CONFIG_H -DHAS_STDARG -DLIBDIR=\"/opt/lib\" -I../../include -I../../include -I.  -DKRB5_DEPRECATED=1 -DKRB5_PRIVATE -I/opt/include -pipe -Os -arch x86_64 -fno-common -Wall -Wcast-align -Wshadow -Wmissing-prototypes -Wno-format-zero-length -Woverflow -Wstrict-overflow -Wmissing-format-attribute -Wmissing-prototypes -Wreturn-type -Wmissing-braces -Wparentheses -Wswitch -Wunused-function -Wunused-label -Wunused-variable -Wunused-value -Wunknown-pragmas -Wsign-compare -Wnewline-eof -Werror=uninitialized -Werror=pointer-arith -Werror=declaration-after-statement -Werror-implicit-function-declaration  -c prof_set.c -o prof_set.so.o && mv -f prof_set.so.o prof_set.so
726rm -f et-c-prof_err.et et-c-prof_err.c et-c-prof_err.h
727cp prof_err.et et-c-prof_err.et
728compile_et et-c-prof_err.et
729mv -f et-c-prof_err.c prof_err.c
730rm -f et-c-prof_err.et et-c-prof_err.h
731/usr/bin/clang  -DSHARED -DHAVE_CONFIG_H -DHAS_STDARG -DLIBDIR=\"/opt/lib\" -I../../include -I../../include -I.  -DKRB5_DEPRECATED=1 -DKRB5_PRIVATE -I/opt/include -pipe -Os -arch x86_64 -fno-common -Wall -Wcast-align -Wshadow -Wmissing-prototypes -Wno-format-zero-length -Woverflow -Wstrict-overflow -Wmissing-format-attribute -Wmissing-prototypes -Wreturn-type -Wmissing-braces -Wparentheses -Wswitch -Wunused-function -Wunused-label -Wunused-variable -Wunused-value -Wunknown-pragmas -Wsign-compare -Wnewline-eof -Werror=uninitialized -Werror=pointer-arith -Werror=declaration-after-statement -Werror-implicit-function-declaration  -c prof_err.c -o prof_err.so.o && mv -f prof_err.so.o prof_err.so
732/usr/bin/clang  -DSHARED -DHAVE_CONFIG_H -DHAS_STDARG -DLIBDIR=\"/opt/lib\" -I../../include -I../../include -I.  -DKRB5_DEPRECATED=1 -DKRB5_PRIVATE -I/opt/include -pipe -Os -arch x86_64 -fno-common -Wall -Wcast-align -Wshadow -Wmissing-prototypes -Wno-format-zero-length -Woverflow -Wstrict-overflow -Wmissing-format-attribute -Wmissing-prototypes -Wreturn-type -Wmissing-braces -Wparentheses -Wswitch -Wunused-function -Wunused-label -Wunused-variable -Wunused-value -Wunknown-pragmas -Wsign-compare -Wnewline-eof -Werror=uninitialized -Werror=pointer-arith -Werror=declaration-after-statement -Werror-implicit-function-declaration  -c prof_init.c -o prof_init.so.o && mv -f prof_init.so.o prof_init.so
733: updated OBJS.SH
734sed > darwin-exports.tmp < ./libprofile.exports "s/^/_/"
735mv -f darwin-exports.tmp darwin.exports
736rm -f libprofile.1.1.dylib
737building shared profile library (1.1)
738set -x; objlist=`set -x && perl -p -e 'BEGIN { $SIG{__WARN__} = sub {die @_} }; $e=$ARGV; $e =~ s/OBJS\...$//; s/^/ /; s/ $//; s/ / $e/g;' OBJS.SH` && /usr/bin/clang -undefined error -dead_strip -dynamiclib -compatibility_version 1 -current_version 1.1 -install_name "/opt/lib/libprofile.1.1.dylib" -exported_symbols_list darwin.exports -pipe -Os -arch x86_64 -fno-common -o libprofile.1.1.dylib $objlist -L../../lib -lcom_err -lkrb5support -lcrypto -lresolv  -Wl,-headerpad_max_install_names -arch x86_64 -Wl,-search_paths_first
739++ set -x
740++ perl -p -e 'BEGIN { $SIG{__WARN__} = sub {die @_} }; $e=$ARGV; $e =~ s/OBJS\...$//; s/^/ /; s/ $//; s/ / $e/g;' OBJS.SH
741+ objlist=' prof_tree.so prof_file.so prof_parse.so prof_get.so prof_set.so prof_err.so prof_init.so'
742+ /usr/bin/clang -undefined error -dead_strip -dynamiclib -compatibility_version 1 -current_version 1.1 -install_name /opt/lib/libprofile.1.1.dylib -exported_symbols_list darwin.exports -pipe -Os -arch x86_64 -fno-common -o libprofile.1.1.dylib prof_tree.so prof_file.so prof_parse.so prof_get.so prof_set.so prof_err.so prof_init.so -L../../lib -lcom_err -lkrb5support -lcrypto -lresolv -Wl,-headerpad_max_install_names -arch x86_64 -Wl,-search_paths_first
743Undefined symbols for architecture x86_64:
744  "__et_list", referenced from:
745      _initialize_prof_error_table in prof_err.so
746ld: symbol(s) not found for architecture x86_64
747clang: error: linker command failed with exit code 1 (use -v to see invocation)
748make[2]: *** [libprofile.1.1.dylib] Error 1
749make[2]: Leaving directory `/opt/var/macports/build/_opt_var_macports_sources_rsync.macports.org_release_tarballs_ports_net_kerberos5/kerberos5/work/krb5-1.13.1-final/src/util/profile'
750make[1]: *** [all-recurse] Error 1
751make[1]: Leaving directory `/opt/var/macports/build/_opt_var_macports_sources_rsync.macports.org_release_tarballs_ports_net_kerberos5/kerberos5/work/krb5-1.13.1-final/src/util'
752make: *** [all-recurse] Error 1
753make: Leaving directory `/opt/var/macports/build/_opt_var_macports_sources_rsync.macports.org_release_tarballs_ports_net_kerberos5/kerberos5/work/krb5-1.13.1-final/src'
754Command failed:  cd "/opt/var/macports/build/_opt_var_macports_sources_rsync.macports.org_release_tarballs_ports_net_kerberos5/kerberos5/work/krb5-1.13.1-final/src" && /usr/bin/make -w all
755Exit code: 2
756Error: org.macports.build for port kerberos5 returned: command execution failed
757Warning: targets not executed for kerberos5: org.macports.activate org.macports.build org.macports.destroot org.macports.install
758Please see the log file for port kerberos5 for details:
759    /opt/var/macports/logs/_opt_var_macports_sources_rsync.macports.org_release_tarballs_ports_net_kerberos5/kerberos5/main.log
760To report a bug, follow the instructions in the guide:
761    http://guide.macports.org/#project.tickets
762Error: Processing of port kerberos5 failed
763#