Ticket #47908: processing-err.txt

File processing-err.txt, 44.5 KB (added by jenstroeger (Jens Troeger), 6 years ago)

Debug log of the failure.

Line 
1--->  Building processing
2DEBUG: Executing org.macports.build (processing)
3DEBUG: Environment:
4CC_PRINT_OPTIONS='YES'
5CC_PRINT_OPTIONS_FILE='/opt/local/var/macports/build/_opt_local_var_macports_sources_rsync.macports.org_release_tarballs_ports_lang_processing/processing/work/.CC_PRINT_OPTIONS'
6CPATH='/opt/local/include'
7LIBRARY_PATH='/opt/local/lib'
8MACOSX_DEPLOYMENT_TARGET='10.10'
9DEBUG: Assembled command: 'cd "/opt/local/var/macports/build/_opt_local_var_macports_sources_rsync.macports.org_release_tarballs_ports_lang_processing/processing/work/processing-1.2.1/build" && /opt/local/bin/ant macosx-build'
10DEBUG: Executing command line:  cd "/opt/local/var/macports/build/_opt_local_var_macports_sources_rsync.macports.org_release_tarballs_ports_lang_processing/processing/work/processing-1.2.1/build" && /opt/local/bin/ant macosx-build
11Buildfile: /opt/local/var/macports/build/_opt_local_var_macports_sources_rsync.macports.org_release_tarballs_ports_lang_processing/processing/work/processing-1.2.1/build/build.xml
12
13revision-check:
14
15macosx-checkos:
16
17subprojects-build:
18
19compile:
20  [methods] No changes to PApplet API.
21
22build:
23
24preproc:
25
26compile:
27    [javac] Compiling 86 source files to /opt/local/var/macports/build/_opt_local_var_macports_sources_rsync.macports.org_release_tarballs_ports_lang_processing/processing/work/processing-1.2.1/app/bin
28    [javac]
29    [javac]           WARNING
30    [javac]
31    [javac] The -source switch defaults to 1.8 in JDK 1.8.
32    [javac] If you specify -target 1.5 you now must also specify -source 1.5.
33    [javac] Ant will implicitly add -source 1.5 for you.  Please change your build file.
34    [javac] warning: [options] bootstrap class path not set in conjunction with -source 1.5
35    [javac] warning: [options] source value 1.5 is obsolete and will be removed in a future release
36    [javac] warning: [options] target value 1.5 is obsolete and will be removed in a future release
37    [javac] warning: [options] To suppress warnings about obsolete options, use -Xlint:-options.
38    [javac] /opt/local/var/macports/build/_opt_local_var_macports_sources_rsync.macports.org_release_tarballs_ports_lang_processing/processing/work/processing-1.2.1/app/src/processing/app/debug/Runner.java:33: error: package com.sun.jdi does not exist
39    [javac] import com.sun.jdi.*;
40    [javac] ^
41    [javac] /opt/local/var/macports/build/_opt_local_var_macports_sources_rsync.macports.org_release_tarballs_ports_lang_processing/processing/work/processing-1.2.1/app/src/processing/app/debug/Runner.java:34: error: package com.sun.jdi.connect does not exist
42    [javac] import com.sun.jdi.connect.*;
43    [javac] ^
44    [javac] /opt/local/var/macports/build/_opt_local_var_macports_sources_rsync.macports.org_release_tarballs_ports_lang_processing/processing/work/processing-1.2.1/app/src/processing/app/debug/Runner.java:35: error: package com.sun.jdi.event does not exist
45    [javac] import com.sun.jdi.event.ExceptionEvent;
46    [javac]                         ^
47    [javac] /opt/local/var/macports/build/_opt_local_var_macports_sources_rsync.macports.org_release_tarballs_ports_lang_processing/processing/work/processing-1.2.1/app/src/processing/app/debug/Runner.java:55: error: cannot find symbol
48    [javac]   protected VirtualMachine vm;
49    [javac]             ^
50    [javac]   symbol:   class VirtualMachine
51    [javac]   location: class Runner
52    [javac] /opt/local/var/macports/build/_opt_local_var_macports_sources_rsync.macports.org_release_tarballs_ports_lang_processing/processing/work/processing-1.2.1/app/src/processing/app/debug/Runner.java:256: error: cannot find symbol
53    [javac]   protected VirtualMachine launchVirtualMachine(String[] vmParams,
54    [javac]             ^
55    [javac]   symbol:   class VirtualMachine
56    [javac]   location: class Runner
57    [javac] /opt/local/var/macports/build/_opt_local_var_macports_sources_rsync.macports.org_release_tarballs_ports_lang_processing/processing/work/processing-1.2.1/app/src/processing/app/debug/Runner.java:450: error: cannot find symbol
58    [javac]   protected Connector findConnector(String connectorName) {
59    [javac]             ^
60    [javac]   symbol:   class Connector
61    [javac]   location: class Runner
62    [javac] /opt/local/var/macports/build/_opt_local_var_macports_sources_rsync.macports.org_release_tarballs_ports_lang_processing/processing/work/processing-1.2.1/app/src/processing/app/debug/Runner.java:471: error: cannot find symbol
63    [javac]   public void exception(ExceptionEvent event) {
64    [javac]                         ^
65    [javac]   symbol:   class ExceptionEvent
66    [javac]   location: class Runner
67    [javac] /opt/local/var/macports/build/_opt_local_var_macports_sources_rsync.macports.org_release_tarballs_ports_lang_processing/processing/work/processing-1.2.1/app/src/processing/app/debug/Runner.java:557: error: cannot find symbol
68    [javac]   protected void reportException(String message, ThreadReference thread) {
69    [javac]                                                  ^
70    [javac]   symbol:   class ThreadReference
71    [javac]   location: class Runner
72    [javac] /opt/local/var/macports/build/_opt_local_var_macports_sources_rsync.macports.org_release_tarballs_ports_lang_processing/processing/work/processing-1.2.1/app/src/processing/app/debug/Runner.java:568: error: cannot find symbol
73    [javac]   RunnerException findException(String message, ThreadReference thread) {
74    [javac]                                                 ^
75    [javac]   symbol:   class ThreadReference
76    [javac]   location: class Runner
77    [javac] /opt/local/var/macports/build/_opt_local_var_macports_sources_rsync.macports.org_release_tarballs_ports_lang_processing/processing/work/processing-1.2.1/app/src/processing/app/debug/EventThread.java:43: error: package com.sun.jdi does not exist
78    [javac] import com.sun.jdi.*;
79    [javac] ^
80    [javac] /opt/local/var/macports/build/_opt_local_var_macports_sources_rsync.macports.org_release_tarballs_ports_lang_processing/processing/work/processing-1.2.1/app/src/processing/app/debug/EventThread.java:44: error: package com.sun.jdi.event does not exist
81    [javac] import com.sun.jdi.event.*;
82    [javac] ^
83    [javac] /opt/local/var/macports/build/_opt_local_var_macports_sources_rsync.macports.org_release_tarballs_ports_lang_processing/processing/work/processing-1.2.1/app/src/processing/app/debug/EventThread.java:45: error: package com.sun.jdi.request does not exist
84    [javac] import com.sun.jdi.request.*;
85    [javac] ^
86    [javac] /opt/local/var/macports/build/_opt_local_var_macports_sources_rsync.macports.org_release_tarballs_ports_lang_processing/processing/work/processing-1.2.1/app/src/processing/app/debug/EventThread.java:56: error: cannot find symbol
87    [javac]   private final VirtualMachine vm;   // Running VM
88    [javac]                 ^
89    [javac]   symbol:   class VirtualMachine
90    [javac]   location: class EventThread
91    [javac] /opt/local/var/macports/build/_opt_local_var_macports_sources_rsync.macports.org_release_tarballs_ports_lang_processing/processing/work/processing-1.2.1/app/src/processing/app/debug/EventThread.java:69: error: cannot find symbol
92    [javac]   public EventThread(Runner parent, VirtualMachine vm, String[] excludes, PrintWriter writer) {
93    [javac]                                     ^
94    [javac]   symbol:   class VirtualMachine
95    [javac]   location: class EventThread
96    [javac] /opt/local/var/macports/build/_opt_local_var_macports_sources_rsync.macports.org_release_tarballs_ports_lang_processing/processing/work/processing-1.2.1/app/src/processing/app/debug/EventThread.java:241: error: cannot find symbol
97    [javac]   ThreadTrace threadTrace(ThreadReference thread) {
98    [javac]                           ^
99    [javac]   symbol:   class ThreadReference
100    [javac]   location: class EventThread
101    [javac] /opt/local/var/macports/build/_opt_local_var_macports_sources_rsync.macports.org_release_tarballs_ports_lang_processing/processing/work/processing-1.2.1/app/src/processing/app/debug/EventThread.java:253: error: cannot find symbol
102    [javac]   private void handleEvent(Event event) {
103    [javac]                            ^
104    [javac]   symbol:   class Event
105    [javac]   location: class EventThread
106    [javac] /opt/local/var/macports/build/_opt_local_var_macports_sources_rsync.macports.org_release_tarballs_ports_lang_processing/processing/work/processing-1.2.1/app/src/processing/app/debug/EventThread.java:306: error: cannot find symbol
107    [javac]   private void vmStartEvent(VMStartEvent event)  {
108    [javac]                             ^
109    [javac]   symbol:   class VMStartEvent
110    [javac]   location: class EventThread
111    [javac] /opt/local/var/macports/build/_opt_local_var_macports_sources_rsync.macports.org_release_tarballs_ports_lang_processing/processing/work/processing-1.2.1/app/src/processing/app/debug/EventThread.java:311: error: cannot find symbol
112    [javac]   private void methodEntryEvent(MethodEntryEvent event)  {
113    [javac]                                 ^
114    [javac]   symbol:   class MethodEntryEvent
115    [javac]   location: class EventThread
116    [javac] /opt/local/var/macports/build/_opt_local_var_macports_sources_rsync.macports.org_release_tarballs_ports_lang_processing/processing/work/processing-1.2.1/app/src/processing/app/debug/EventThread.java:316: error: cannot find symbol
117    [javac]   private void methodExitEvent(MethodExitEvent event)  {
118    [javac]                                ^
119    [javac]   symbol:   class MethodExitEvent
120    [javac]   location: class EventThread
121    [javac] /opt/local/var/macports/build/_opt_local_var_macports_sources_rsync.macports.org_release_tarballs_ports_lang_processing/processing/work/processing-1.2.1/app/src/processing/app/debug/EventThread.java:321: error: cannot find symbol
122    [javac]   private void stepEvent(StepEvent event)  {
123    [javac]                          ^
124    [javac]   symbol:   class StepEvent
125    [javac]   location: class EventThread
126    [javac] /opt/local/var/macports/build/_opt_local_var_macports_sources_rsync.macports.org_release_tarballs_ports_lang_processing/processing/work/processing-1.2.1/app/src/processing/app/debug/EventThread.java:326: error: cannot find symbol
127    [javac]   private void fieldWatchEvent(ModificationWatchpointEvent event)  {
128    [javac]                                ^
129    [javac]   symbol:   class ModificationWatchpointEvent
130    [javac]   location: class EventThread
131    [javac] /opt/local/var/macports/build/_opt_local_var_macports_sources_rsync.macports.org_release_tarballs_ports_lang_processing/processing/work/processing-1.2.1/app/src/processing/app/debug/EventThread.java:330: error: cannot find symbol
132    [javac]   void threadDeathEvent(ThreadDeathEvent event)  {
133    [javac]                         ^
134    [javac]   symbol:   class ThreadDeathEvent
135    [javac]   location: class EventThread
136    [javac] /opt/local/var/macports/build/_opt_local_var_macports_sources_rsync.macports.org_release_tarballs_ports_lang_processing/processing/work/processing-1.2.1/app/src/processing/app/debug/EventThread.java:341: error: cannot find symbol
137    [javac]   private void classPrepareEvent(ClassPrepareEvent event)  {
138    [javac]                                  ^
139    [javac]   symbol:   class ClassPrepareEvent
140    [javac]   location: class EventThread
141    [javac] /opt/local/var/macports/build/_opt_local_var_macports_sources_rsync.macports.org_release_tarballs_ports_lang_processing/processing/work/processing-1.2.1/app/src/processing/app/debug/EventThread.java:362: error: cannot find symbol
142    [javac]   private void exceptionEvent(ExceptionEvent event) {
143    [javac]                               ^
144    [javac]   symbol:   class ExceptionEvent
145    [javac]   location: class EventThread
146    [javac] /opt/local/var/macports/build/_opt_local_var_macports_sources_rsync.macports.org_release_tarballs_ports_lang_processing/processing/work/processing-1.2.1/app/src/processing/app/debug/EventThread.java:388: error: cannot find symbol
147    [javac]   public void vmDeathEvent(VMDeathEvent event) {
148    [javac]                            ^
149    [javac]   symbol:   class VMDeathEvent
150    [javac]   location: class EventThread
151    [javac] /opt/local/var/macports/build/_opt_local_var_macports_sources_rsync.macports.org_release_tarballs_ports_lang_processing/processing/work/processing-1.2.1/app/src/processing/app/debug/EventThread.java:396: error: cannot find symbol
152    [javac]   public void vmDisconnectEvent(VMDisconnectEvent event) {
153    [javac]                                 ^
154    [javac]   symbol:   class VMDisconnectEvent
155    [javac]   location: class EventThread
156    [javac] /opt/local/var/macports/build/_opt_local_var_macports_sources_rsync.macports.org_release_tarballs_ports_lang_processing/processing/work/processing-1.2.1/app/src/processing/app/debug/EventThread.java:161: error: cannot find symbol
157    [javac]     final ThreadReference thread;
158    [javac]           ^
159    [javac]   symbol:   class ThreadReference
160    [javac]   location: class EventThread.ThreadTrace
161    [javac] /opt/local/var/macports/build/_opt_local_var_macports_sources_rsync.macports.org_release_tarballs_ports_lang_processing/processing/work/processing-1.2.1/app/src/processing/app/debug/EventThread.java:166: error: cannot find symbol
162    [javac]     ThreadTrace(ThreadReference thread) {
163    [javac]                 ^
164    [javac]   symbol:   class ThreadReference
165    [javac]   location: class EventThread.ThreadTrace
166    [javac] /opt/local/var/macports/build/_opt_local_var_macports_sources_rsync.macports.org_release_tarballs_ports_lang_processing/processing/work/processing-1.2.1/app/src/processing/app/debug/EventThread.java:182: error: cannot find symbol
167    [javac]     void methodEntryEvent(MethodEntryEvent event)  {
168    [javac]                           ^
169    [javac]   symbol:   class MethodEntryEvent
170    [javac]   location: class EventThread.ThreadTrace
171    [javac] /opt/local/var/macports/build/_opt_local_var_macports_sources_rsync.macports.org_release_tarballs_ports_lang_processing/processing/work/processing-1.2.1/app/src/processing/app/debug/EventThread.java:188: error: cannot find symbol
172    [javac]     void methodExitEvent(MethodExitEvent event)  {
173    [javac]                          ^
174    [javac]   symbol:   class MethodExitEvent
175    [javac]   location: class EventThread.ThreadTrace
176    [javac] /opt/local/var/macports/build/_opt_local_var_macports_sources_rsync.macports.org_release_tarballs_ports_lang_processing/processing/work/processing-1.2.1/app/src/processing/app/debug/EventThread.java:192: error: cannot find symbol
177    [javac]     void fieldWatchEvent(ModificationWatchpointEvent event)  {
178    [javac]                          ^
179    [javac]   symbol:   class ModificationWatchpointEvent
180    [javac]   location: class EventThread.ThreadTrace
181    [javac] /opt/local/var/macports/build/_opt_local_var_macports_sources_rsync.macports.org_release_tarballs_ports_lang_processing/processing/work/processing-1.2.1/app/src/processing/app/debug/EventThread.java:198: error: cannot find symbol
182    [javac]     void exceptionEvent(ExceptionEvent event) {
183    [javac]                         ^
184    [javac]   symbol:   class ExceptionEvent
185    [javac]   location: class EventThread.ThreadTrace
186    [javac] /opt/local/var/macports/build/_opt_local_var_macports_sources_rsync.macports.org_release_tarballs_ports_lang_processing/processing/work/processing-1.2.1/app/src/processing/app/debug/EventThread.java:215: error: cannot find symbol
187    [javac]     void stepEvent(StepEvent event)  {
188    [javac]                    ^
189    [javac]   symbol:   class StepEvent
190    [javac]   location: class EventThread.ThreadTrace
191    [javac] /opt/local/var/macports/build/_opt_local_var_macports_sources_rsync.macports.org_release_tarballs_ports_lang_processing/processing/work/processing-1.2.1/app/src/processing/app/debug/EventThread.java:231: error: cannot find symbol
192    [javac]     void threadDeathEvent(ThreadDeathEvent event)  {
193    [javac]                           ^
194    [javac]   symbol:   class ThreadDeathEvent
195    [javac]   location: class EventThread.ThreadTrace
196    [javac] /opt/local/var/macports/build/_opt_local_var_macports_sources_rsync.macports.org_release_tarballs_ports_lang_processing/processing/work/processing-1.2.1/app/src/processing/app/debug/Runner.java:259: error: cannot find symbol
197    [javac]     LaunchingConnector connector = (LaunchingConnector)
198    [javac]     ^
199    [javac]   symbol:   class LaunchingConnector
200    [javac]   location: class Runner
201    [javac] /opt/local/var/macports/build/_opt_local_var_macports_sources_rsync.macports.org_release_tarballs_ports_lang_processing/processing/work/processing-1.2.1/app/src/processing/app/debug/Runner.java:259: error: cannot find symbol
202    [javac]     LaunchingConnector connector = (LaunchingConnector)
203    [javac]                                     ^
204    [javac]   symbol:   class LaunchingConnector
205    [javac]   location: class Runner
206    [javac] /opt/local/var/macports/build/_opt_local_var_macports_sources_rsync.macports.org_release_tarballs_ports_lang_processing/processing/work/processing-1.2.1/app/src/processing/app/debug/Runner.java:266: error: package Connector does not exist
207    [javac]     Connector.Argument commandArg =
208    [javac]              ^
209    [javac] /opt/local/var/macports/build/_opt_local_var_macports_sources_rsync.macports.org_release_tarballs_ports_lang_processing/processing/work/processing-1.2.1/app/src/processing/app/debug/Runner.java:267: error: package Connector does not exist
210    [javac]       (Connector.Argument)arguments.get("command");
211    [javac]                 ^
212    [javac] /opt/local/var/macports/build/_opt_local_var_macports_sources_rsync.macports.org_release_tarballs_ports_lang_processing/processing/work/processing-1.2.1/app/src/processing/app/debug/Runner.java:301: error: package Connector does not exist
213    [javac]     Connector.Argument addressArg =
214    [javac]              ^
215    [javac] /opt/local/var/macports/build/_opt_local_var_macports_sources_rsync.macports.org_release_tarballs_ports_lang_processing/processing/work/processing-1.2.1/app/src/processing/app/debug/Runner.java:302: error: package Connector does not exist
216    [javac]       (Connector.Argument)arguments.get("address");
217    [javac]                 ^
218    [javac] /opt/local/var/macports/build/_opt_local_var_macports_sources_rsync.macports.org_release_tarballs_ports_lang_processing/processing/work/processing-1.2.1/app/src/processing/app/debug/Runner.java:315: error: cannot find symbol
219    [javac]     } catch (IllegalConnectorArgumentsException exc) {
220    [javac]              ^
221    [javac]   symbol:   class IllegalConnectorArgumentsException
222    [javac]   location: class Runner
223    [javac] /opt/local/var/macports/build/_opt_local_var_macports_sources_rsync.macports.org_release_tarballs_ports_lang_processing/processing/work/processing-1.2.1/app/src/processing/app/debug/Runner.java:317: error: cannot find symbol
224    [javac]     } catch (VMStartException exc) {
225    [javac]              ^
226    [javac]   symbol:   class VMStartException
227    [javac]   location: class Runner
228    [javac] /opt/local/var/macports/build/_opt_local_var_macports_sources_rsync.macports.org_release_tarballs_ports_lang_processing/processing/work/processing-1.2.1/app/src/processing/app/debug/Runner.java:451: error: cannot find symbol
229    [javac]     List connectors = Bootstrap.virtualMachineManager().allConnectors();
230    [javac]                       ^
231    [javac]   symbol:   variable Bootstrap
232    [javac]   location: class Runner
233    [javac] /opt/local/var/macports/build/_opt_local_var_macports_sources_rsync.macports.org_release_tarballs_ports_lang_processing/processing/work/processing-1.2.1/app/src/processing/app/debug/Runner.java:462: error: cannot find symbol
234    [javac]       Connector connector = (Connector)iter.next();
235    [javac]       ^
236    [javac]   symbol:   class Connector
237    [javac]   location: class Runner
238    [javac] /opt/local/var/macports/build/_opt_local_var_macports_sources_rsync.macports.org_release_tarballs_ports_lang_processing/processing/work/processing-1.2.1/app/src/processing/app/debug/Runner.java:462: error: cannot find symbol
239    [javac]       Connector connector = (Connector)iter.next();
240    [javac]                              ^
241    [javac]   symbol:   class Connector
242    [javac]   location: class Runner
243    [javac] /opt/local/var/macports/build/_opt_local_var_macports_sources_rsync.macports.org_release_tarballs_ports_lang_processing/processing/work/processing-1.2.1/app/src/processing/app/debug/Runner.java:473: error: cannot find symbol
244    [javac]     ObjectReference or = event.exception();
245    [javac]     ^
246    [javac]   symbol:   class ObjectReference
247    [javac]   location: class Runner
248    [javac] /opt/local/var/macports/build/_opt_local_var_macports_sources_rsync.macports.org_release_tarballs_ports_lang_processing/processing/work/processing-1.2.1/app/src/processing/app/debug/Runner.java:474: error: cannot find symbol
249    [javac]     ReferenceType rt = or.referenceType();
250    [javac]     ^
251    [javac]   symbol:   class ReferenceType
252    [javac]   location: class Runner
253    [javac] /opt/local/var/macports/build/_opt_local_var_macports_sources_rsync.macports.org_release_tarballs_ports_lang_processing/processing/work/processing-1.2.1/app/src/processing/app/debug/Runner.java:477: error: cannot find symbol
254    [javac]     Field messageField = rt.fieldByName("detailMessage");
255    [javac]     ^
256    [javac]   symbol:   class Field
257    [javac]   location: class Runner
258    [javac] /opt/local/var/macports/build/_opt_local_var_macports_sources_rsync.macports.org_release_tarballs_ports_lang_processing/processing/work/processing-1.2.1/app/src/processing/app/debug/Runner.java:479: error: cannot find symbol
259    [javac]     Value messageValue = or.getValue(messageField);
260    [javac]     ^
261    [javac]   symbol:   class Value
262    [javac]   location: class Runner
263    [javac] /opt/local/var/macports/build/_opt_local_var_macports_sources_rsync.macports.org_release_tarballs_ports_lang_processing/processing/work/processing-1.2.1/app/src/processing/app/debug/Runner.java:575: error: cannot find symbol
264    [javac]       List<StackFrame> frames = thread.frames();
265    [javac]            ^
266    [javac]   symbol:   class StackFrame
267    [javac]   location: class Runner
268    [javac] /opt/local/var/macports/build/_opt_local_var_macports_sources_rsync.macports.org_release_tarballs_ports_lang_processing/processing/work/processing-1.2.1/app/src/processing/app/debug/Runner.java:576: error: cannot find symbol
269    [javac]       for (StackFrame frame : frames) {
270    [javac]            ^
271    [javac]   symbol:   class StackFrame
272    [javac]   location: class Runner
273    [javac] /opt/local/var/macports/build/_opt_local_var_macports_sources_rsync.macports.org_release_tarballs_ports_lang_processing/processing/work/processing-1.2.1/app/src/processing/app/debug/Runner.java:578: error: cannot find symbol
274    [javac]           Location location = frame.location();
275    [javac]           ^
276    [javac]   symbol:   class Location
277    [javac]   location: class Runner
278    [javac] /opt/local/var/macports/build/_opt_local_var_macports_sources_rsync.macports.org_release_tarballs_ports_lang_processing/processing/work/processing-1.2.1/app/src/processing/app/debug/Runner.java:587: error: cannot find symbol
279    [javac]         } catch (AbsentInformationException e) {
280    [javac]                  ^
281    [javac]   symbol:   class AbsentInformationException
282    [javac]   location: class Runner
283    [javac] /opt/local/var/macports/build/_opt_local_var_macports_sources_rsync.macports.org_release_tarballs_ports_lang_processing/processing/work/processing-1.2.1/app/src/processing/app/debug/Runner.java:597: error: cannot find symbol
284    [javac]     } catch (IncompatibleThreadStateException e) {
285    [javac]              ^
286    [javac]   symbol:   class IncompatibleThreadStateException
287    [javac]   location: class Runner
288    [javac] /opt/local/var/macports/build/_opt_local_var_macports_sources_rsync.macports.org_release_tarballs_ports_lang_processing/processing/work/processing-1.2.1/app/src/processing/app/debug/Runner.java:618: error: package com.sun.jdi does not exist
289    [javac]       } catch (com.sun.jdi.VMDisconnectedException vmde) {
290    [javac]                           ^
291    [javac] /opt/local/var/macports/build/_opt_local_var_macports_sources_rsync.macports.org_release_tarballs_ports_lang_processing/processing/work/processing-1.2.1/app/src/processing/app/debug/EventThread.java:83: error: cannot find symbol
292    [javac]     EventQueue queue = vm.eventQueue();
293    [javac]     ^
294    [javac]   symbol:   class EventQueue
295    [javac]   location: class EventThread
296    [javac] /opt/local/var/macports/build/_opt_local_var_macports_sources_rsync.macports.org_release_tarballs_ports_lang_processing/processing/work/processing-1.2.1/app/src/processing/app/debug/EventThread.java:86: error: cannot find symbol
297    [javac]         EventSet eventSet = queue.remove();
298    [javac]         ^
299    [javac]   symbol:   class EventSet
300    [javac]   location: class EventThread
301    [javac] /opt/local/var/macports/build/_opt_local_var_macports_sources_rsync.macports.org_release_tarballs_ports_lang_processing/processing/work/processing-1.2.1/app/src/processing/app/debug/EventThread.java:87: error: cannot find symbol
302    [javac]         EventIterator it = eventSet.eventIterator();
303    [javac]         ^
304    [javac]   symbol:   class EventIterator
305    [javac]   location: class EventThread
306    [javac] /opt/local/var/macports/build/_opt_local_var_macports_sources_rsync.macports.org_release_tarballs_ports_lang_processing/processing/work/processing-1.2.1/app/src/processing/app/debug/EventThread.java:94: error: cannot find symbol
307    [javac]       } catch (VMDisconnectedException discExc) {
308    [javac]                ^
309    [javac]   symbol:   class VMDisconnectedException
310    [javac]   location: class EventThread
311    [javac] /opt/local/var/macports/build/_opt_local_var_macports_sources_rsync.macports.org_release_tarballs_ports_lang_processing/processing/work/processing-1.2.1/app/src/processing/app/debug/EventThread.java:108: error: cannot find symbol
312    [javac]     EventRequestManager mgr = vm.eventRequestManager();
313    [javac]     ^
314    [javac]   symbol:   class EventRequestManager
315    [javac]   location: class EventThread
316    [javac] /opt/local/var/macports/build/_opt_local_var_macports_sources_rsync.macports.org_release_tarballs_ports_lang_processing/processing/work/processing-1.2.1/app/src/processing/app/debug/EventThread.java:115: error: cannot find symbol
317    [javac]     ExceptionRequest excReq = mgr.createExceptionRequest(null, false, true);
318    [javac]     ^
319    [javac]   symbol:   class ExceptionRequest
320    [javac]   location: class EventThread
321    [javac] /opt/local/var/macports/build/_opt_local_var_macports_sources_rsync.macports.org_release_tarballs_ports_lang_processing/processing/work/processing-1.2.1/app/src/processing/app/debug/EventThread.java:119: error: cannot find symbol
322    [javac]     excReq.setSuspendPolicy(EventRequest.SUSPEND_ALL);
323    [javac]                             ^
324    [javac]   symbol:   variable EventRequest
325    [javac]   location: class EventThread
326    [javac] /opt/local/var/macports/build/_opt_local_var_macports_sources_rsync.macports.org_release_tarballs_ports_lang_processing/processing/work/processing-1.2.1/app/src/processing/app/debug/EventThread.java:193: error: cannot find symbol
327    [javac]       Field field = event.field();
328    [javac]       ^
329    [javac]   symbol:   class Field
330    [javac]   location: class EventThread.ThreadTrace
331    [javac] /opt/local/var/macports/build/_opt_local_var_macports_sources_rsync.macports.org_release_tarballs_ports_lang_processing/processing/work/processing-1.2.1/app/src/processing/app/debug/EventThread.java:194: error: cannot find symbol
332    [javac]       Value value = event.valueToBe();
333    [javac]       ^
334    [javac]   symbol:   class Value
335    [javac]   location: class EventThread.ThreadTrace
336    [javac] /opt/local/var/macports/build/_opt_local_var_macports_sources_rsync.macports.org_release_tarballs_ports_lang_processing/processing/work/processing-1.2.1/app/src/processing/app/debug/EventThread.java:205: error: cannot find symbol
337    [javac]       EventRequestManager mgr = vm.eventRequestManager();
338    [javac]       ^
339    [javac]   symbol:   class EventRequestManager
340    [javac]   location: class EventThread.ThreadTrace
341    [javac] /opt/local/var/macports/build/_opt_local_var_macports_sources_rsync.macports.org_release_tarballs_ports_lang_processing/processing/work/processing-1.2.1/app/src/processing/app/debug/EventThread.java:206: error: cannot find symbol
342    [javac]       StepRequest req = mgr.createStepRequest(thread,
343    [javac]       ^
344    [javac]   symbol:   class StepRequest
345    [javac]   location: class EventThread.ThreadTrace
346    [javac] /opt/local/var/macports/build/_opt_local_var_macports_sources_rsync.macports.org_release_tarballs_ports_lang_processing/processing/work/processing-1.2.1/app/src/processing/app/debug/EventThread.java:207: error: cannot find symbol
347    [javac]           StepRequest.STEP_MIN,
348    [javac]           ^
349    [javac]   symbol:   variable StepRequest
350    [javac]   location: class EventThread.ThreadTrace
351    [javac] /opt/local/var/macports/build/_opt_local_var_macports_sources_rsync.macports.org_release_tarballs_ports_lang_processing/processing/work/processing-1.2.1/app/src/processing/app/debug/EventThread.java:208: error: cannot find symbol
352    [javac]           StepRequest.STEP_INTO);
353    [javac]           ^
354    [javac]   symbol:   variable StepRequest
355    [javac]   location: class EventThread.ThreadTrace
356    [javac] /opt/local/var/macports/build/_opt_local_var_macports_sources_rsync.macports.org_release_tarballs_ports_lang_processing/processing/work/processing-1.2.1/app/src/processing/app/debug/EventThread.java:210: error: cannot find symbol
357    [javac]       req.setSuspendPolicy(EventRequest.SUSPEND_ALL);
358    [javac]                            ^
359    [javac]   symbol:   variable EventRequest
360    [javac]   location: class EventThread.ThreadTrace
361    [javac] /opt/local/var/macports/build/_opt_local_var_macports_sources_rsync.macports.org_release_tarballs_ports_lang_processing/processing/work/processing-1.2.1/app/src/processing/app/debug/EventThread.java:221: error: cannot find symbol
362    [javac]       } catch (IncompatibleThreadStateException exc) {
363    [javac]                ^
364    [javac]   symbol:   class IncompatibleThreadStateException
365    [javac]   location: class EventThread.ThreadTrace
366    [javac] /opt/local/var/macports/build/_opt_local_var_macports_sources_rsync.macports.org_release_tarballs_ports_lang_processing/processing/work/processing-1.2.1/app/src/processing/app/debug/EventThread.java:227: error: cannot find symbol
367    [javac]       EventRequestManager mgr = vm.eventRequestManager();
368    [javac]       ^
369    [javac]   symbol:   class EventRequestManager
370    [javac]   location: class EventThread.ThreadTrace
371    [javac] /opt/local/var/macports/build/_opt_local_var_macports_sources_rsync.macports.org_release_tarballs_ports_lang_processing/processing/work/processing-1.2.1/app/src/processing/app/debug/EventThread.java:254: error: cannot find symbol
372    [javac]     if (event instanceof ExceptionEvent) {
373    [javac]                          ^
374    [javac]   symbol:   class ExceptionEvent
375    [javac]   location: class EventThread
376    [javac] /opt/local/var/macports/build/_opt_local_var_macports_sources_rsync.macports.org_release_tarballs_ports_lang_processing/processing/work/processing-1.2.1/app/src/processing/app/debug/EventThread.java:255: error: cannot find symbol
377    [javac]       exceptionEvent((ExceptionEvent)event);
378    [javac]                       ^
379    [javac]   symbol:   class ExceptionEvent
380    [javac]   location: class EventThread
381    [javac] /opt/local/var/macports/build/_opt_local_var_macports_sources_rsync.macports.org_release_tarballs_ports_lang_processing/processing/work/processing-1.2.1/app/src/processing/app/debug/EventThread.java:256: error: cannot find symbol
382    [javac]     } else if (event instanceof ModificationWatchpointEvent) {
383    [javac]                                 ^
384    [javac]   symbol:   class ModificationWatchpointEvent
385    [javac]   location: class EventThread
386    [javac] /opt/local/var/macports/build/_opt_local_var_macports_sources_rsync.macports.org_release_tarballs_ports_lang_processing/processing/work/processing-1.2.1/app/src/processing/app/debug/EventThread.java:257: error: cannot find symbol
387    [javac]       fieldWatchEvent((ModificationWatchpointEvent)event);
388    [javac]                        ^
389    [javac]   symbol:   class ModificationWatchpointEvent
390    [javac]   location: class EventThread
391    [javac] /opt/local/var/macports/build/_opt_local_var_macports_sources_rsync.macports.org_release_tarballs_ports_lang_processing/processing/work/processing-1.2.1/app/src/processing/app/debug/EventThread.java:258: error: cannot find symbol
392    [javac]     } else if (event instanceof MethodEntryEvent) {
393    [javac]                                 ^
394    [javac]   symbol:   class MethodEntryEvent
395    [javac]   location: class EventThread
396    [javac] /opt/local/var/macports/build/_opt_local_var_macports_sources_rsync.macports.org_release_tarballs_ports_lang_processing/processing/work/processing-1.2.1/app/src/processing/app/debug/EventThread.java:259: error: cannot find symbol
397    [javac]       methodEntryEvent((MethodEntryEvent)event);
398    [javac]                         ^
399    [javac]   symbol:   class MethodEntryEvent
400    [javac]   location: class EventThread
401    [javac] /opt/local/var/macports/build/_opt_local_var_macports_sources_rsync.macports.org_release_tarballs_ports_lang_processing/processing/work/processing-1.2.1/app/src/processing/app/debug/EventThread.java:260: error: cannot find symbol
402    [javac]     } else if (event instanceof MethodExitEvent) {
403    [javac]                                 ^
404    [javac]   symbol:   class MethodExitEvent
405    [javac]   location: class EventThread
406    [javac] /opt/local/var/macports/build/_opt_local_var_macports_sources_rsync.macports.org_release_tarballs_ports_lang_processing/processing/work/processing-1.2.1/app/src/processing/app/debug/EventThread.java:261: error: cannot find symbol
407    [javac]       methodExitEvent((MethodExitEvent)event);
408    [javac]                        ^
409    [javac]   symbol:   class MethodExitEvent
410    [javac]   location: class EventThread
411    [javac] /opt/local/var/macports/build/_opt_local_var_macports_sources_rsync.macports.org_release_tarballs_ports_lang_processing/processing/work/processing-1.2.1/app/src/processing/app/debug/EventThread.java:262: error: cannot find symbol
412    [javac]     } else if (event instanceof StepEvent) {
413    [javac]                                 ^
414    [javac]   symbol:   class StepEvent
415    [javac]   location: class EventThread
416    [javac] /opt/local/var/macports/build/_opt_local_var_macports_sources_rsync.macports.org_release_tarballs_ports_lang_processing/processing/work/processing-1.2.1/app/src/processing/app/debug/EventThread.java:263: error: cannot find symbol
417    [javac]       stepEvent((StepEvent)event);
418    [javac]                  ^
419    [javac]   symbol:   class StepEvent
420    [javac]   location: class EventThread
421    [javac] /opt/local/var/macports/build/_opt_local_var_macports_sources_rsync.macports.org_release_tarballs_ports_lang_processing/processing/work/processing-1.2.1/app/src/processing/app/debug/EventThread.java:264: error: cannot find symbol
422    [javac]     } else if (event instanceof ThreadDeathEvent) {
423    [javac]                                 ^
424    [javac]   symbol:   class ThreadDeathEvent
425    [javac]   location: class EventThread
426    [javac] /opt/local/var/macports/build/_opt_local_var_macports_sources_rsync.macports.org_release_tarballs_ports_lang_processing/processing/work/processing-1.2.1/app/src/processing/app/debug/EventThread.java:265: error: cannot find symbol
427    [javac]       threadDeathEvent((ThreadDeathEvent)event);
428    [javac]                         ^
429    [javac]   symbol:   class ThreadDeathEvent
430    [javac]   location: class EventThread
431    [javac] /opt/local/var/macports/build/_opt_local_var_macports_sources_rsync.macports.org_release_tarballs_ports_lang_processing/processing/work/processing-1.2.1/app/src/processing/app/debug/EventThread.java:266: error: cannot find symbol
432    [javac]     } else if (event instanceof ClassPrepareEvent) {
433    [javac]                                 ^
434    [javac]   symbol:   class ClassPrepareEvent
435    [javac]   location: class EventThread
436    [javac] /opt/local/var/macports/build/_opt_local_var_macports_sources_rsync.macports.org_release_tarballs_ports_lang_processing/processing/work/processing-1.2.1/app/src/processing/app/debug/EventThread.java:267: error: cannot find symbol
437    [javac]       classPrepareEvent((ClassPrepareEvent)event);
438    [javac]                          ^
439    [javac]   symbol:   class ClassPrepareEvent
440    [javac]   location: class EventThread
441    [javac] /opt/local/var/macports/build/_opt_local_var_macports_sources_rsync.macports.org_release_tarballs_ports_lang_processing/processing/work/processing-1.2.1/app/src/processing/app/debug/EventThread.java:268: error: cannot find symbol
442    [javac]     } else if (event instanceof VMStartEvent) {
443    [javac]                                 ^
444    [javac]   symbol:   class VMStartEvent
445    [javac]   location: class EventThread
446    [javac] /opt/local/var/macports/build/_opt_local_var_macports_sources_rsync.macports.org_release_tarballs_ports_lang_processing/processing/work/processing-1.2.1/app/src/processing/app/debug/EventThread.java:269: error: cannot find symbol
447    [javac]       vmStartEvent((VMStartEvent)event);
448    [javac]                     ^
449    [javac]   symbol:   class VMStartEvent
450    [javac]   location: class EventThread
451    [javac] /opt/local/var/macports/build/_opt_local_var_macports_sources_rsync.macports.org_release_tarballs_ports_lang_processing/processing/work/processing-1.2.1/app/src/processing/app/debug/EventThread.java:270: error: cannot find symbol
452    [javac]     } else if (event instanceof VMDeathEvent) {
453    [javac]                                 ^
454    [javac]   symbol:   class VMDeathEvent
455    [javac]   location: class EventThread
456    [javac] /opt/local/var/macports/build/_opt_local_var_macports_sources_rsync.macports.org_release_tarballs_ports_lang_processing/processing/work/processing-1.2.1/app/src/processing/app/debug/EventThread.java:271: error: cannot find symbol
457    [javac]       vmDeathEvent((VMDeathEvent)event);
458    [javac]                     ^
459    [javac]   symbol:   class VMDeathEvent
460    [javac]   location: class EventThread
461    [javac] /opt/local/var/macports/build/_opt_local_var_macports_sources_rsync.macports.org_release_tarballs_ports_lang_processing/processing/work/processing-1.2.1/app/src/processing/app/debug/EventThread.java:272: error: cannot find symbol
462    [javac]     } else if (event instanceof VMDisconnectEvent) {
463    [javac]                                 ^
464    [javac]   symbol:   class VMDisconnectEvent
465    [javac]   location: class EventThread
466    [javac] /opt/local/var/macports/build/_opt_local_var_macports_sources_rsync.macports.org_release_tarballs_ports_lang_processing/processing/work/processing-1.2.1/app/src/processing/app/debug/EventThread.java:273: error: cannot find symbol
467    [javac]       vmDisconnectEvent((VMDisconnectEvent)event);
468    [javac]                          ^
469    [javac]   symbol:   class VMDisconnectEvent
470    [javac]   location: class EventThread
471    [javac] /opt/local/var/macports/build/_opt_local_var_macports_sources_rsync.macports.org_release_tarballs_ports_lang_processing/processing/work/processing-1.2.1/app/src/processing/app/debug/EventThread.java:286: error: cannot find symbol
472    [javac]     EventQueue queue = vm.eventQueue();
473    [javac]     ^
474    [javac]   symbol:   class EventQueue
475    [javac]   location: class EventThread
476    [javac] /opt/local/var/macports/build/_opt_local_var_macports_sources_rsync.macports.org_release_tarballs_ports_lang_processing/processing/work/processing-1.2.1/app/src/processing/app/debug/EventThread.java:289: error: cannot find symbol
477    [javac]         EventSet eventSet = queue.remove();
478    [javac]         ^
479    [javac]   symbol:   class EventSet
480    [javac]   location: class EventThread
481    [javac] /opt/local/var/macports/build/_opt_local_var_macports_sources_rsync.macports.org_release_tarballs_ports_lang_processing/processing/work/processing-1.2.1/app/src/processing/app/debug/EventThread.java:290: error: cannot find symbol
482    [javac]         EventIterator iter = eventSet.eventIterator();
483    [javac]         ^
484    [javac]   symbol:   class EventIterator
485    [javac]   location: class EventThread
486    [javac] /opt/local/var/macports/build/_opt_local_var_macports_sources_rsync.macports.org_release_tarballs_ports_lang_processing/processing/work/processing-1.2.1/app/src/processing/app/debug/EventThread.java:292: error: cannot find symbol
487    [javac]           Event event = iter.nextEvent();
488    [javac]           ^
489    [javac]   symbol:   class Event
490    [javac]   location: class EventThread
491    [javac] /opt/local/var/macports/build/_opt_local_var_macports_sources_rsync.macports.org_release_tarballs_ports_lang_processing/processing/work/processing-1.2.1/app/src/processing/app/debug/EventThread.java:293: error: cannot find symbol
492    [javac]           if (event instanceof VMDeathEvent) {
493    [javac]                                ^
494    [javac]   symbol:   class VMDeathEvent
495    [javac]   location: class EventThread
496    [javac] /opt/local/var/macports/build/_opt_local_var_macports_sources_rsync.macports.org_release_tarballs_ports_lang_processing/processing/work/processing-1.2.1/app/src/processing/app/debug/EventThread.java:294: error: cannot find symbol
497    [javac]             vmDeathEvent((VMDeathEvent)event);
498    [javac]                           ^
499    [javac]   symbol:   class VMDeathEvent
500    [javac]   location: class EventThread
501    [javac] /opt/local/var/macports/build/_opt_local_var_macports_sources_rsync.macports.org_release_tarballs_ports_lang_processing/processing/work/processing-1.2.1/app/src/processing/app/debug/EventThread.java:295: error: cannot find symbol
502    [javac]           } else if (event instanceof VMDisconnectEvent) {
503    [javac]                                       ^
504    [javac]   symbol:   class VMDisconnectEvent
505    [javac]   location: class EventThread
506    [javac] /opt/local/var/macports/build/_opt_local_var_macports_sources_rsync.macports.org_release_tarballs_ports_lang_processing/processing/work/processing-1.2.1/app/src/processing/app/debug/EventThread.java:296: error: cannot find symbol
507    [javac]             vmDisconnectEvent((VMDisconnectEvent)event);
508    [javac]                                ^
509    [javac]   symbol:   class VMDisconnectEvent
510    [javac]   location: class EventThread
511    [javac] /opt/local/var/macports/build/_opt_local_var_macports_sources_rsync.macports.org_release_tarballs_ports_lang_processing/processing/work/processing-1.2.1/app/src/processing/app/debug/EventThread.java:348: error: cannot find symbol
512    [javac]     EventRequestManager mgr = vm.eventRequestManager();
513    [javac]     ^
514    [javac]   symbol:   class EventRequestManager
515    [javac]   location: class EventThread
516    [javac] Note: Some input files use unchecked or unsafe operations.
517    [javac] Note: Recompile with -Xlint:unchecked for details.
518    [javac] 100 errors
519    [javac] 4 warnings
520
521BUILD FAILED
522/opt/local/var/macports/build/_opt_local_var_macports_sources_rsync.macports.org_release_tarballs_ports_lang_processing/processing/work/processing-1.2.1/build/build.xml:68: The following error occurred while executing this line:
523/opt/local/var/macports/build/_opt_local_var_macports_sources_rsync.macports.org_release_tarballs_ports_lang_processing/processing/work/processing-1.2.1/app/build.xml:104: Compile failed; see the compiler error output for details.
524
525Total time: 1 second
526Command failed:  cd "/opt/local/var/macports/build/_opt_local_var_macports_sources_rsync.macports.org_release_tarballs_ports_lang_processing/processing/work/processing-1.2.1/build" && /opt/local/bin/ant macosx-build
527Exit code: 1
528Error: org.macports.build for port processing returned: command execution failed
529DEBUG: Error code: CHILDSTATUS 73371 1
530DEBUG: Backtrace: command execution failed
531    while executing
532"system -nice 0 $fullcmdstring"
533    ("eval" body line 1)
534    invoked from within
535"eval system $notty $nice \$fullcmdstring"
536    invoked from within
537"command_exec build"
538    (procedure "portbuild::build_main" line 8)
539    invoked from within
540"portbuild::build_main org.macports.build"
541    ("eval" body line 1)
542    invoked from within
543"eval $procedure $targetname"
544Warning: targets not executed for processing: org.macports.activate org.macports.build org.macports.destroot org.macports.install
545Please see the log file for port processing for details:
546    /opt/local/var/macports/logs/_opt_local_var_macports_sources_rsync.macports.org_release_tarballs_ports_lang_processing/processing/main.log
547To report a bug, follow the instructions in the guide:
548    http://guide.macports.org/#project.tickets
549Error: Processing of port processing failed