Ticket #47974: main.2.log

File main.2.log, 29.0 KB (added by sjlacroix@…, 6 years ago)

MIssing Files

Line 
1version:1
2:debug:main epoch: in tree: 2 installed: 2
3:debug:main gettext 0.19.4_0 exists in the ports tree
4:debug:main gettext 0.19.4_0  is the latest installed
5:debug:main gettext 0.19.4_0  is active
6:debug:main Merging existing variants '' into variants
7:debug:main new fully merged portvariants:
8:debug:main Changing to port directory: /opt/local/var/macports/sources/rsync.macports.org/release/tarballs/ports/devel/gettext
9:debug:main OS darwin/14.3.0 (Mac OS X 10.10) arch i386
10:debug:main Sourcing PortGroup compiler_blacklist_versions 1.0 from /opt/local/var/macports/sources/rsync.macports.org/release/tarballs/ports/_resources/port1.0/group/compiler_blacklist_versions-1.0.tcl
11:debug:main Reading variant descriptions from /opt/local/var/macports/sources/rsync.macports.org/release/tarballs/ports/_resources/port1.0/variant_descriptions.conf
12:debug:main Sourcing PortGroup muniversal 1.0 from /opt/local/var/macports/sources/rsync.macports.org/release/tarballs/ports/_resources/port1.0/group/muniversal-1.0.tcl
13:debug:main compiler clang 602.0.53 not blacklisted because it doesn't match {clang < 211.10.1}
14:debug:main universal variant already exists, so not adding the default one
15:debug:main Running callback portconfigure::add_automatic_compiler_dependencies
16:debug:main Finished running callback portconfigure::add_automatic_compiler_dependencies
17:debug:main Running callback portbuild::add_automatic_buildsystem_dependencies
18:debug:main Finished running callback portbuild::add_automatic_buildsystem_dependencies
19:debug:main No need to upgrade! gettext 0.19.4_0 >= gettext 0.19.4_0
20:debug:main epoch: in tree: 0 installed: 0
21:debug:main expat 2.1.0_0 exists in the ports tree
22:debug:main expat 2.1.0_0  is the latest installed
23:debug:main expat 2.1.0_0  is active
24:debug:main Merging existing variants '' into variants
25:debug:main new fully merged portvariants:
26:debug:main Changing to port directory: /opt/local/var/macports/sources/rsync.macports.org/release/tarballs/ports/textproc/expat
27:debug:main OS darwin/14.3.0 (Mac OS X 10.10) arch i386
28:debug:main adding the default universal variant
29:debug:main Reading variant descriptions from /opt/local/var/macports/sources/rsync.macports.org/release/tarballs/ports/_resources/port1.0/variant_descriptions.conf
30:debug:main Running callback portconfigure::add_automatic_compiler_dependencies
31:debug:main Finished running callback portconfigure::add_automatic_compiler_dependencies
32:debug:main Running callback portbuild::add_automatic_buildsystem_dependencies
33:debug:main Finished running callback portbuild::add_automatic_buildsystem_dependencies
34:debug:main No need to upgrade! expat 2.1.0_0 >= expat 2.1.0_0
35:debug:main epoch: in tree: 0 installed: 0
36:debug:main libiconv 1.14_0 exists in the ports tree
37:debug:main libiconv 1.14_0  is the latest installed
38:debug:main libiconv 1.14_0  is active
39:debug:main Merging existing variants '' into variants
40:debug:main new fully merged portvariants:
41:debug:main Changing to port directory: /opt/local/var/macports/sources/rsync.macports.org/release/tarballs/ports/textproc/libiconv
42:debug:main OS darwin/14.3.0 (Mac OS X 10.10) arch i386
43:debug:main Reading variant descriptions from /opt/local/var/macports/sources/rsync.macports.org/release/tarballs/ports/_resources/port1.0/variant_descriptions.conf
44:debug:main Sourcing PortGroup muniversal 1.0 from /opt/local/var/macports/sources/rsync.macports.org/release/tarballs/ports/_resources/port1.0/group/muniversal-1.0.tcl
45:debug:main universal variant already exists, so not adding the default one
46:debug:main Running callback portconfigure::add_automatic_compiler_dependencies
47:debug:main Finished running callback portconfigure::add_automatic_compiler_dependencies
48:debug:main Running callback portbuild::add_automatic_buildsystem_dependencies
49:debug:main Finished running callback portbuild::add_automatic_buildsystem_dependencies
50:debug:main No need to upgrade! libiconv 1.14_0 >= libiconv 1.14_0
51:debug:main epoch: in tree: 0 installed: 0
52:debug:main ncurses 5.9_2 exists in the ports tree
53:debug:main ncurses 5.9_2  is the latest installed
54:debug:main ncurses 5.9_2  is active
55:debug:main Merging existing variants '' into variants
56:debug:main new fully merged portvariants:
57:debug:main Changing to port directory: /opt/local/var/macports/sources/rsync.macports.org/release/tarballs/ports/devel/ncurses
58:debug:main OS darwin/14.3.0 (Mac OS X 10.10) arch i386
59:debug:main adding the default universal variant
60:debug:main Reading variant descriptions from /opt/local/var/macports/sources/rsync.macports.org/release/tarballs/ports/_resources/port1.0/variant_descriptions.conf
61:debug:main Running callback portconfigure::add_automatic_compiler_dependencies
62:debug:main Finished running callback portconfigure::add_automatic_compiler_dependencies
63:debug:main Running callback portbuild::add_automatic_buildsystem_dependencies
64:debug:main Finished running callback portbuild::add_automatic_buildsystem_dependencies
65:debug:main No need to upgrade! ncurses 5.9_2 >= ncurses 5.9_2
66:debug:main epoch: in tree: 0 installed: 0
67:debug:main arm-none-linux-gnueabi-binutils 2005q3-2_0 exists in the ports tree
68:debug:main arm-none-linux-gnueabi-binutils 2005q3-2_0  is the latest installed
69:debug:main arm-none-linux-gnueabi-binutils 2005q3-2_0  is active
70:debug:main Merging existing variants '' into variants
71:debug:main new fully merged portvariants:
72:debug:main Changing to port directory: /opt/local/var/macports/sources/rsync.macports.org/release/tarballs/ports/cross/arm-none-linux-gnueabi-binutils
73:debug:main OS darwin/14.3.0 (Mac OS X 10.10) arch i386
74:debug:main adding the default universal variant
75:debug:main Reading variant descriptions from /opt/local/var/macports/sources/rsync.macports.org/release/tarballs/ports/_resources/port1.0/variant_descriptions.conf
76:debug:main Running callback portconfigure::add_automatic_compiler_dependencies
77:debug:main Finished running callback portconfigure::add_automatic_compiler_dependencies
78:debug:main Running callback portbuild::add_automatic_buildsystem_dependencies
79:debug:main Finished running callback portbuild::add_automatic_buildsystem_dependencies
80:debug:main No need to upgrade! arm-none-linux-gnueabi-binutils 2005q3-2_0 >= arm-none-linux-gnueabi-binutils 2005q3-2_0
81:debug:main epoch: in tree: 0 installed: 0
82:debug:main arm-none-linux-gnueabi-runtime cs2005q3.2_0 exists in the ports tree
83:debug:main arm-none-linux-gnueabi-runtime cs2005q3.2_0  is the latest installed
84:debug:main arm-none-linux-gnueabi-runtime cs2005q3.2_0  is active
85:debug:main Merging existing variants '' into variants
86:debug:main new fully merged portvariants:
87:debug:main Changing to port directory: /opt/local/var/macports/sources/rsync.macports.org/release/tarballs/ports/cross/arm-none-linux-gnueabi-runtime
88:debug:main OS darwin/14.3.0 (Mac OS X 10.10) arch i386
89:debug:main universal_variant is false, so not adding the default universal variant
90:debug:main Running callback portconfigure::add_automatic_compiler_dependencies
91:debug:main Finished running callback portconfigure::add_automatic_compiler_dependencies
92:debug:main Running callback portbuild::add_automatic_buildsystem_dependencies
93:debug:main Finished running callback portbuild::add_automatic_buildsystem_dependencies
94:debug:main No need to upgrade! arm-none-linux-gnueabi-runtime cs2005q3.2_0 >= arm-none-linux-gnueabi-runtime cs2005q3.2_0
95:msg:main --->  Computing dependencies for arm-none-linux-gnueabi-gcc:info:main .:debug:main arm-none-linux-gnueabi-gcc has no conflicts
96:debug:main Searching for dependency: gettext
97:debug:main Found Dependency: receipt exists for gettext
98:debug:main Searching for dependency: arm-none-linux-gnueabi-binutils
99:debug:main Found Dependency: receipt exists for arm-none-linux-gnueabi-binutils
100:debug:main Searching for dependency: arm-none-linux-gnueabi-runtime
101:debug:main Found Dependency: receipt exists for arm-none-linux-gnueabi-runtime
102:msg:main
103:debug:main Executing org.macports.main (arm-none-linux-gnueabi-gcc)
104:debug:main changing euid/egid - current euid: 0 - current egid: 0
105:debug:main egid changed to: 20
106:debug:main euid changed to: 502
107:debug:main Skipping completed org.macports.archivefetch (arm-none-linux-gnueabi-gcc)
108:debug:main Privilege de-escalation not attempted as not running as root.
109:debug:main Skipping completed org.macports.fetch (arm-none-linux-gnueabi-gcc)
110:debug:main Privilege de-escalation not attempted as not running as root.
111:debug:main Skipping completed org.macports.checksum (arm-none-linux-gnueabi-gcc)
112:debug:main Privilege de-escalation not attempted as not running as root.
113:debug:main Skipping completed org.macports.extract (arm-none-linux-gnueabi-gcc)
114:debug:main Privilege de-escalation not attempted as not running as root.
115:debug:main Skipping completed org.macports.patch (arm-none-linux-gnueabi-gcc)
116:debug:main Privilege de-escalation not attempted as not running as root.
117:debug:main Can't run org.macports.configure on this port without elevated privileges. Escalating privileges back to root.
118:debug:main euid changed to: 0. egid changed to: 0.
119:debug:main Skipping completed org.macports.configure (arm-none-linux-gnueabi-gcc)
120:debug:main changing euid/egid - current euid: 0 - current egid: 0
121:debug:main egid changed to: 20
122:debug:main euid changed to: 502
123:debug:main Can't run org.macports.build on this port without elevated privileges. Escalating privileges back to root.
124:debug:main euid changed to: 0. egid changed to: 0.
125:debug:build build phase started at Mon Jun 22 08:53:59 EDT 2015
126:notice:build --->  Building arm-none-linux-gnueabi-gcc
127:debug:build Executing org.macports.build (arm-none-linux-gnueabi-gcc)
128:debug:build Environment:
129CC_PRINT_OPTIONS='YES'
130CC_PRINT_OPTIONS_FILE='/opt/local/var/macports/build/_opt_local_var_macports_sources_rsync.macports.org_release_tarballs_ports_cross_arm-none-linux-gnueabi-gcc/arm-none-linux-gnueabi-gcc/work/.CC_PRINT_OPTIONS'
131CPATH='/opt/local/include'
132LIBRARY_PATH='/opt/local/lib'
133MACOSX_DEPLOYMENT_TARGET='10.10'
134:debug:build Assembled command: 'cd "/opt/local/var/macports/build/_opt_local_var_macports_sources_rsync.macports.org_release_tarballs_ports_cross_arm-none-linux-gnueabi-gcc/arm-none-linux-gnueabi-gcc/work/build" && /usr/bin/make -j4 -w all AR_FOR_TARGET=arm-none-linux-gnueabi-ar AS_FOR_TARGET=arm-none-linux-gnueabi-as LD_FOR_TARGET=arm-none-linux-gnueabi-ld NM_FOR_TARGET=arm-none-linux-gnueabi-nm RANLIB_FOR_TARGET=arm-none-linux-gnueabi-ranlib'
135:debug:build Executing command line:  cd "/opt/local/var/macports/build/_opt_local_var_macports_sources_rsync.macports.org_release_tarballs_ports_cross_arm-none-linux-gnueabi-gcc/arm-none-linux-gnueabi-gcc/work/build" && /usr/bin/make -j4 -w all AR_FOR_TARGET=arm-none-linux-gnueabi-ar AS_FOR_TARGET=arm-none-linux-gnueabi-as LD_FOR_TARGET=arm-none-linux-gnueabi-ld NM_FOR_TARGET=arm-none-linux-gnueabi-nm RANLIB_FOR_TARGET=arm-none-linux-gnueabi-ranlib
136:info:build make: Entering directory `/opt/local/var/macports/build/_opt_local_var_macports_sources_rsync.macports.org_release_tarballs_ports_cross_arm-none-linux-gnueabi-gcc/arm-none-linux-gnueabi-gcc/work/build'
137:info:build make[1]: Entering directory `/opt/local/var/macports/build/_opt_local_var_macports_sources_rsync.macports.org_release_tarballs_ports_cross_arm-none-linux-gnueabi-gcc/arm-none-linux-gnueabi-gcc/work/build/intl'
138:info:build make[1]: Leaving directory `/opt/local/var/macports/build/_opt_local_var_macports_sources_rsync.macports.org_release_tarballs_ports_cross_arm-none-linux-gnueabi-gcc/arm-none-linux-gnueabi-gcc/work/build/intl'
139:info:build make[1]: Entering directory `/opt/local/var/macports/build/_opt_local_var_macports_sources_rsync.macports.org_release_tarballs_ports_cross_arm-none-linux-gnueabi-gcc/arm-none-linux-gnueabi-gcc/work/build/libiberty'
140:info:build make[2]: Entering directory `/opt/local/var/macports/build/_opt_local_var_macports_sources_rsync.macports.org_release_tarballs_ports_cross_arm-none-linux-gnueabi-gcc/arm-none-linux-gnueabi-gcc/work/build/libiberty/testsuite'
141:info:build make[2]: Nothing to be done for `all'.
142:info:build make[2]: Leaving directory `/opt/local/var/macports/build/_opt_local_var_macports_sources_rsync.macports.org_release_tarballs_ports_cross_arm-none-linux-gnueabi-gcc/arm-none-linux-gnueabi-gcc/work/build/libiberty/testsuite'
143:info:build make[1]: Leaving directory `/opt/local/var/macports/build/_opt_local_var_macports_sources_rsync.macports.org_release_tarballs_ports_cross_arm-none-linux-gnueabi-gcc/arm-none-linux-gnueabi-gcc/work/build/libiberty'
144:info:build make[1]: Entering directory `/opt/local/var/macports/build/_opt_local_var_macports_sources_rsync.macports.org_release_tarballs_ports_cross_arm-none-linux-gnueabi-gcc/arm-none-linux-gnueabi-gcc/work/build/gcc'
145:info:build /opt/local/var/macports/build/_opt_local_var_macports_sources_rsync.macports.org_release_tarballs_ports_cross_arm-none-linux-gnueabi-gcc/arm-none-linux-gnueabi-gcc/work/build/gcc/xgcc -B/opt/local/var/macports/build/_opt_local_var_macports_sources_rsync.macports.org_release_tarballs_ports_cross_arm-none-linux-gnueabi-gcc/arm-none-linux-gnueabi-gcc/work/build/gcc/ -B/opt/local/arm-none-linux-gnueabi/bin/ -B/opt/local/arm-none-linux-gnueabi/lib/ -isystem /opt/local/arm-none-linux-gnueabi/include -isystem /opt/local/arm-none-linux-gnueabi/sys-include -O2 -O2 -pipe -Os  -DIN_GCC -DCROSS_COMPILE   -W -Wall -Wwrite-strings -Wstrict-prototypes -Wmissing-prototypes -Wold-style-definition  -isystem ./include  -I. -I. -I/opt/local/var/macports/build/_opt_local_var_macports_sources_rsync.macports.org_release_tarballs_ports_cross_arm-none-linux-gnueabi-gcc/arm-none-linux-gnueabi-gcc/work/gcc-2005q3/gcc -I/opt/local/var/macports/build/_opt_local_var_macports_sources_rsync.macports.org_release_tarballs_ports_cross_arm-none-linux-gnueabi-gcc/arm-none-linux-gnueabi-gcc/work/gcc-2005q3/gcc/. -I/opt/local/var/macports/build/_opt_local_var_macports_sources_rsync.macports.org_release_tarballs_ports_cross_arm-none-linux-gnueabi-gcc/arm-none-linux-gnueabi-gcc/work/gcc-2005q3/gcc/../include -I../intl  -g0 -finhibit-size-directive -fno-inline-functions -fno-exceptions -fno-zero-initialized-in-bss -fno-unit-at-a-time   \
146:info:build       -c /opt/local/var/macports/build/_opt_local_var_macports_sources_rsync.macports.org_release_tarballs_ports_cross_arm-none-linux-gnueabi-gcc/arm-none-linux-gnueabi-gcc/work/gcc-2005q3/gcc/crtstuff.c -DCRT_BEGIN \
147:info:build       -o crtbegin.o
148:info:build /opt/local/var/macports/build/_opt_local_var_macports_sources_rsync.macports.org_release_tarballs_ports_cross_arm-none-linux-gnueabi-gcc/arm-none-linux-gnueabi-gcc/work/build/gcc/xgcc -B/opt/local/var/macports/build/_opt_local_var_macports_sources_rsync.macports.org_release_tarballs_ports_cross_arm-none-linux-gnueabi-gcc/arm-none-linux-gnueabi-gcc/work/build/gcc/ -B/opt/local/arm-none-linux-gnueabi/bin/ -B/opt/local/arm-none-linux-gnueabi/lib/ -isystem /opt/local/arm-none-linux-gnueabi/include -isystem /opt/local/arm-none-linux-gnueabi/sys-include -O2 -O2 -pipe -Os  -DIN_GCC -DCROSS_COMPILE   -W -Wall -Wwrite-strings -Wstrict-prototypes -Wmissing-prototypes -Wold-style-definition  -isystem ./include  -I. -I. -I/opt/local/var/macports/build/_opt_local_var_macports_sources_rsync.macports.org_release_tarballs_ports_cross_arm-none-linux-gnueabi-gcc/arm-none-linux-gnueabi-gcc/work/gcc-2005q3/gcc -I/opt/local/var/macports/build/_opt_local_var_macports_sources_rsync.macports.org_release_tarballs_ports_cross_arm-none-linux-gnueabi-gcc/arm-none-linux-gnueabi-gcc/work/gcc-2005q3/gcc/. -I/opt/local/var/macports/build/_opt_local_var_macports_sources_rsync.macports.org_release_tarballs_ports_cross_arm-none-linux-gnueabi-gcc/arm-none-linux-gnueabi-gcc/work/gcc-2005q3/gcc/../include -I../intl  -g0 -finhibit-size-directive -fno-inline-functions -fno-exceptions -fno-zero-initialized-in-bss -fno-unit-at-a-time   -fPIC \
149:info:build       -c /opt/local/var/macports/build/_opt_local_var_macports_sources_rsync.macports.org_release_tarballs_ports_cross_arm-none-linux-gnueabi-gcc/arm-none-linux-gnueabi-gcc/work/gcc-2005q3/gcc/crtstuff.c -DCRT_BEGIN -DCRTSTUFFS_O \
150:info:build       -o crtbeginS.o
151:info:build /opt/local/var/macports/build/_opt_local_var_macports_sources_rsync.macports.org_release_tarballs_ports_cross_arm-none-linux-gnueabi-gcc/arm-none-linux-gnueabi-gcc/work/build/gcc/xgcc -B/opt/local/var/macports/build/_opt_local_var_macports_sources_rsync.macports.org_release_tarballs_ports_cross_arm-none-linux-gnueabi-gcc/arm-none-linux-gnueabi-gcc/work/build/gcc/ -B/opt/local/arm-none-linux-gnueabi/bin/ -B/opt/local/arm-none-linux-gnueabi/lib/ -isystem /opt/local/arm-none-linux-gnueabi/include -isystem /opt/local/arm-none-linux-gnueabi/sys-include -O2 -O2 -pipe -Os  -DIN_GCC -DCROSS_COMPILE   -W -Wall -Wwrite-strings -Wstrict-prototypes -Wmissing-prototypes -Wold-style-definition  -isystem ./include  -I. -I. -I/opt/local/var/macports/build/_opt_local_var_macports_sources_rsync.macports.org_release_tarballs_ports_cross_arm-none-linux-gnueabi-gcc/arm-none-linux-gnueabi-gcc/work/gcc-2005q3/gcc -I/opt/local/var/macports/build/_opt_local_var_macports_sources_rsync.macports.org_release_tarballs_ports_cross_arm-none-linux-gnueabi-gcc/arm-none-linux-gnueabi-gcc/work/gcc-2005q3/gcc/. -I/opt/local/var/macports/build/_opt_local_var_macports_sources_rsync.macports.org_release_tarballs_ports_cross_arm-none-linux-gnueabi-gcc/arm-none-linux-gnueabi-gcc/work/gcc-2005q3/gcc/../include -I../intl  -g0 -finhibit-size-directive -fno-inline-functions -fno-exceptions -fno-zero-initialized-in-bss -fno-unit-at-a-time   \
152:info:build       -c /opt/local/var/macports/build/_opt_local_var_macports_sources_rsync.macports.org_release_tarballs_ports_cross_arm-none-linux-gnueabi-gcc/arm-none-linux-gnueabi-gcc/work/gcc-2005q3/gcc/crtstuff.c -DCRT_BEGIN -DCRTSTUFFT_O \
153:info:build       -o crtbeginT.o
154:info:build /opt/local/var/macports/build/_opt_local_var_macports_sources_rsync.macports.org_release_tarballs_ports_cross_arm-none-linux-gnueabi-gcc/arm-none-linux-gnueabi-gcc/work/build/gcc/xgcc -B/opt/local/var/macports/build/_opt_local_var_macports_sources_rsync.macports.org_release_tarballs_ports_cross_arm-none-linux-gnueabi-gcc/arm-none-linux-gnueabi-gcc/work/build/gcc/ -B/opt/local/arm-none-linux-gnueabi/bin/ -B/opt/local/arm-none-linux-gnueabi/lib/ -isystem /opt/local/arm-none-linux-gnueabi/include -isystem /opt/local/arm-none-linux-gnueabi/sys-include -O2 -O2 -pipe -Os  -DIN_GCC -DCROSS_COMPILE   -W -Wall -Wwrite-strings -Wstrict-prototypes -Wmissing-prototypes -Wold-style-definition  -isystem ./include  -I. -I. -I/opt/local/var/macports/build/_opt_local_var_macports_sources_rsync.macports.org_release_tarballs_ports_cross_arm-none-linux-gnueabi-gcc/arm-none-linux-gnueabi-gcc/work/gcc-2005q3/gcc -I/opt/local/var/macports/build/_opt_local_var_macports_sources_rsync.macports.org_release_tarballs_ports_cross_arm-none-linux-gnueabi-gcc/arm-none-linux-gnueabi-gcc/work/gcc-2005q3/gcc/. -I/opt/local/var/macports/build/_opt_local_var_macports_sources_rsync.macports.org_release_tarballs_ports_cross_arm-none-linux-gnueabi-gcc/arm-none-linux-gnueabi-gcc/work/gcc-2005q3/gcc/../include -I../intl  -g0 -finhibit-size-directive -fno-inline-functions -fno-exceptions -fno-zero-initialized-in-bss -fno-unit-at-a-time   \
155:info:build       -c /opt/local/var/macports/build/_opt_local_var_macports_sources_rsync.macports.org_release_tarballs_ports_cross_arm-none-linux-gnueabi-gcc/arm-none-linux-gnueabi-gcc/work/gcc-2005q3/gcc/crtstuff.c -DCRT_END \
156:info:build       -o crtend.o
157:info:build In file included from /opt/local/var/macports/build/_opt_local_var_macports_sources_rsync.macports.org_release_tarballs_ports_cross_arm-none-linux-gnueabi-gcc/arm-none-linux-gnueabi-gcc/work/gcc-2005q3/gcc/crtstuff.c:64In file included from /opt/local/var/macports/build/_opt_local_var_macports_sources_rsync.macports.org_release_tarballs_ports_cross_arm-none-linux-gnueabi-gcc/arm-none-linux-gnueabi-gcc/work/gcc-2005q3/gcc/crtstuff.c:64:
158:info:build :
159:info:build /opt/local/var/macports/build/_opt_local_var_macports_sources_rsync.macports.org_release_tarballs_ports_cross_arm-none-linux-gnueabi-gcc/arm-none-linux-gnueabi-gcc/work/gcc-2005q3/gcc/tsystem.h:79:19: /opt/local/var/macports/build/_opt_local_var_macports_sources_rsync.macports.org_release_tarballs_ports_cross_arm-none-linux-gnueabi-gcc/arm-none-linux-gnueabi-gcc/work/gcc-2005q3/gcc/tsystem.h:79:19: stdio.h: No such file or directory
160:info:build stdio.h: No such file or directory
161:info:build In file included from /opt/local/var/macports/build/_opt_local_var_macports_sources_rsync.macports.org_release_tarballs_ports_cross_arm-none-linux-gnueabi-gcc/arm-none-linux-gnueabi-gcc/work/gcc-2005q3/gcc/crtstuff.c:64:
162:info:build /opt/local/var/macports/build/_opt_local_var_macports_sources_rsync.macports.org_release_tarballs_ports_cross_arm-none-linux-gnueabi-gcc/arm-none-linux-gnueabi-gcc/work/gcc-2005q3/gcc/tsystem.h:79:19: stdio.h: No such file or directory
163:info:build In file included from /opt/local/var/macports/build/_opt_local_var_macports_sources_rsync.macports.org_release_tarballs_ports_cross_arm-none-linux-gnueabi-gcc/arm-none-linux-gnueabi-gcc/work/gcc-2005q3/gcc/crtstuff.c:64:
164:info:build /opt/local/var/macports/build/_opt_local_var_macports_sources_rsync.macports.org_release_tarballs_ports_cross_arm-none-linux-gnueabi-gcc/arm-none-linux-gnueabi-gcc/work/gcc-2005q3/gcc/tsystem.h:79:19: stdio.h: No such file or directory
165:info:build /opt/local/var/macports/build/_opt_local_var_macports_sources_rsync.macports.org_release_tarballs_ports_cross_arm-none-linux-gnueabi-gcc/arm-none-linux-gnueabi-gcc/work/gcc-2005q3/gcc/tsystem.h:82:23:/opt/local/var/macports/build/_opt_local_var_macports_sources_rsync.macports.org_release_tarballs_ports_cross_arm-none-linux-gnueabi-gcc/arm-none-linux-gnueabi-gcc/work/gcc-2005q3/gcc/tsystem.h:82:23:  sys/types.h: No such file or directory
166:info:build sys/types.h: No such file or directory
167:info:build /opt/local/var/macports/build/_opt_local_var_macports_sources_rsync.macports.org_release_tarballs_ports_cross_arm-none-linux-gnueabi-gcc/arm-none-linux-gnueabi-gcc/work/gcc-2005q3/gcc/tsystem.h:82:23: sys/types.h: No such file or directory
168:info:build /opt/local/var/macports/build/_opt_local_var_macports_sources_rsync.macports.org_release_tarballs_ports_cross_arm-none-linux-gnueabi-gcc/arm-none-linux-gnueabi-gcc/work/gcc-2005q3/gcc/tsystem.h:82:23: /opt/local/var/macports/build/_opt_local_var_macports_sources_rsync.macports.org_release_tarballs_ports_cross_arm-none-linux-gnueabi-gcc/arm-none-linux-gnueabi-gcc/work/gcc-2005q3/gcc/tsystem.h:85:19: sys/types.h: No such file or directory
169:info:build errno.h: No such file or directory
170:info:build /opt/local/var/macports/build/_opt_local_var_macports_sources_rsync.macports.org_release_tarballs_ports_cross_arm-none-linux-gnueabi-gcc/arm-none-linux-gnueabi-gcc/work/gcc-2005q3/gcc/tsystem.h:85:19: errno.h: No such file or directory
171:info:build /opt/local/var/macports/build/_opt_local_var_macports_sources_rsync.macports.org_release_tarballs_ports_cross_arm-none-linux-gnueabi-gcc/arm-none-linux-gnueabi-gcc/work/gcc-2005q3/gcc/tsystem.h:85:19: errno.h: No such file or directory
172:info:build /opt/local/var/macports/build/_opt_local_var_macports_sources_rsync.macports.org_release_tarballs_ports_cross_arm-none-linux-gnueabi-gcc/arm-none-linux-gnueabi-gcc/work/gcc-2005q3/gcc/tsystem.h:92:20: /opt/local/var/macports/build/_opt_local_var_macports_sources_rsync.macports.org_release_tarballs_ports_cross_arm-none-linux-gnueabi-gcc/arm-none-linux-gnueabi-gcc/work/gcc-2005q3/gcc/tsystem.h:92:20: string.h: No such file or directory
173:info:build string.h: No such file or directory
174:info:build /opt/local/var/macports/build/_opt_local_var_macports_sources_rsync.macports.org_release_tarballs_ports_cross_arm-none-linux-gnueabi-gcc/arm-none-linux-gnueabi-gcc/work/gcc-2005q3/gcc/tsystem.h:85:19: errno.h: No such file or directory
175:info:build /opt/local/var/macports/build/_opt_local_var_macports_sources_rsync.macports.org_release_tarballs_ports_cross_arm-none-linux-gnueabi-gcc/arm-none-linux-gnueabi-gcc/work/gcc-2005q3/gcc/tsystem.h:93:20:/opt/local/var/macports/build/_opt_local_var_macports_sources_rsync.macports.org_release_tarballs_ports_cross_arm-none-linux-gnueabi-gcc/arm-none-linux-gnueabi-gcc/work/gcc-2005q3/gcc/tsystem.h:93:20:  /opt/local/var/macports/build/_opt_local_var_macports_sources_rsync.macports.org_release_tarballs_ports_cross_arm-none-linux-gnueabi-gcc/arm-none-linux-gnueabi-gcc/work/gcc-2005q3/gcc/tsystem.h:92:20: stdlib.h: No such file or directorystdlib.h: No such file or directory
176:info:build /opt/local/var/macports/build/_opt_local_var_macports_sources_rsync.macports.org_release_tarballs_ports_cross_arm-none-linux-gnueabi-gcc/arm-none-linux-gnueabi-gcc/work/gcc-2005q3/gcc/tsystem.h:92:20:
177:info:build string.h: No such file or directory
178:info:build /opt/local/var/macports/build/_opt_local_var_macports_sources_rsync.macports.org_release_tarballs_ports_cross_arm-none-linux-gnueabi-gcc/arm-none-linux-gnueabi-gcc/work/gcc-2005q3/gcc/tsystem.h:93:20: stdlib.h: No such file or directory
179:info:build /opt/local/var/macports/build/_opt_local_var_macports_sources_rsync.macports.org_release_tarballs_ports_cross_arm-none-linux-gnueabi-gcc/arm-none-linux-gnueabi-gcc/work/gcc-2005q3/gcc/tsystem.h:94:20: string.h: No such file or directory
180:info:build unistd.h: No such file or directory
181:info:build /opt/local/var/macports/build/_opt_local_var_macports_sources_rsync.macports.org_release_tarballs_ports_cross_arm-none-linux-gnueabi-gcc/arm-none-linux-gnueabi-gcc/work/gcc-2005q3/gcc/tsystem.h:94:20: unistd.h: No such file or directory
182:info:build /opt/local/var/macports/build/_opt_local_var_macports_sources_rsync.macports.org_release_tarballs_ports_cross_arm-none-linux-gnueabi-gcc/arm-none-linux-gnueabi-gcc/work/gcc-2005q3/gcc/tsystem.h:93:20: stdlib.h: No such file or directory
183:info:build /opt/local/var/macports/build/_opt_local_var_macports_sources_rsync.macports.org_release_tarballs_ports_cross_arm-none-linux-gnueabi-gcc/arm-none-linux-gnueabi-gcc/work/gcc-2005q3/gcc/tsystem.h:94:20: unistd.h: No such file or directory
184:info:build /opt/local/var/macports/build/_opt_local_var_macports_sources_rsync.macports.org_release_tarballs_ports_cross_arm-none-linux-gnueabi-gcc/arm-none-linux-gnueabi-gcc/work/gcc-2005q3/gcc/tsystem.h:94:20: unistd.h: No such file or directory
185:info:build /opt/local/var/macports/build/_opt_local_var_macports_sources_rsync.macports.org_release_tarballs_ports_cross_arm-none-linux-gnueabi-gcc/arm-none-linux-gnueabi-gcc/work/gcc-2005q3/gcc/tsystem.h:100:18:/opt/local/var/macports/build/_opt_local_var_macports_sources_rsync.macports.org_release_tarballs_ports_cross_arm-none-linux-gnueabi-gcc/arm-none-linux-gnueabi-gcc/work/gcc-2005q3/gcc/tsystem.h:100:18:  time.h: No such file or directory/opt/local/var/macports/build/_opt_local_var_macports_sources_rsync.macports.org_release_tarballs_ports_cross_arm-none-linux-gnueabi-gcc/arm-none-linux-gnueabi-gcc/work/gcc-2005q3/gcc/tsystem.h:100:18:
186:info:build  time.h: No such file or directory
187:info:build time.h: No such file or directory
188:info:build /opt/local/var/macports/build/_opt_local_var_macports_sources_rsync.macports.org_release_tarballs_ports_cross_arm-none-linux-gnueabi-gcc/arm-none-linux-gnueabi-gcc/work/gcc-2005q3/gcc/tsystem.h:100:18: time.h: No such file or directory
189:info:build make[1]: *** [crtend.o] Error 1
190:info:build make[1]: *** Waiting for unfinished jobs....
191:info:build make[1]: *** [crtbegin.o] Error 1
192:info:build make[1]: *** [crtbeginT.o] Error 1
193:info:build make[1]: *** [crtbeginS.o] Error 1
194:info:build make[1]: Leaving directory `/opt/local/var/macports/build/_opt_local_var_macports_sources_rsync.macports.org_release_tarballs_ports_cross_arm-none-linux-gnueabi-gcc/arm-none-linux-gnueabi-gcc/work/build/gcc'
195:info:build make: *** [all-gcc] Error 2
196:info:build make: Leaving directory `/opt/local/var/macports/build/_opt_local_var_macports_sources_rsync.macports.org_release_tarballs_ports_cross_arm-none-linux-gnueabi-gcc/arm-none-linux-gnueabi-gcc/work/build'
197:info:build Command failed:  cd "/opt/local/var/macports/build/_opt_local_var_macports_sources_rsync.macports.org_release_tarballs_ports_cross_arm-none-linux-gnueabi-gcc/arm-none-linux-gnueabi-gcc/work/build" && /usr/bin/make -j4 -w all AR_FOR_TARGET=arm-none-linux-gnueabi-ar AS_FOR_TARGET=arm-none-linux-gnueabi-as LD_FOR_TARGET=arm-none-linux-gnueabi-ld NM_FOR_TARGET=arm-none-linux-gnueabi-nm RANLIB_FOR_TARGET=arm-none-linux-gnueabi-ranlib
198:info:build Exit code: 2
199:error:build org.macports.build for port arm-none-linux-gnueabi-gcc returned: command execution failed
200:debug:build Error code: CHILDSTATUS 87616 2
201:debug:build Backtrace: command execution failed
202    while executing
203"system -nice 0 $fullcmdstring"
204    ("eval" body line 1)
205    invoked from within
206"eval system $notty $nice \$fullcmdstring"
207    invoked from within
208"command_exec build"
209    (procedure "portbuild::build_main" line 8)
210    invoked from within
211"portbuild::build_main org.macports.build"
212    ("eval" body line 1)
213    invoked from within
214"eval $procedure $targetname"
215:info:build Warning: targets not executed for arm-none-linux-gnueabi-gcc: org.macports.activate org.macports.build org.macports.destroot org.macports.install
216:notice:build Please see the log file for port arm-none-linux-gnueabi-gcc for details:
217    /opt/local/var/macports/logs/_opt_local_var_macports_sources_rsync.macports.org_release_tarballs_ports_cross_arm-none-linux-gnueabi-gcc/arm-none-linux-gnueabi-gcc/main.log