| 1 | version:1 |
|---|
| 2 | :debug:clean Attempting ln -sf /sandbox/var/macports/build/_sandbox_trunk_dports_math_libcerf/libcerf/work /sandbox/trunk/dports/math/libcerf/work |
|---|
| 3 | :debug:clean dropping privileges: euid changed to 506, egid changed to 503. |
|---|
| 4 | :debug:main Executing org.macports.main (libcerf) |
|---|
| 5 | :debug:main Privilege de-escalation not attempted as not running as root. |
|---|
| 6 | :debug:archivefetch archivefetch phase started at Fri May 27 19:28:48 EDT 2016 |
|---|
| 7 | :debug:archivefetch Executing org.macports.archivefetch (libcerf) |
|---|
| 8 | :debug:archivefetch Privilege de-escalation not attempted as not running as root. |
|---|
| 9 | :debug:fetch fetch phase started at Fri May 27 19:28:48 EDT 2016 |
|---|
| 10 | :notice:fetch ---> Fetching distfiles for libcerf |
|---|
| 11 | :debug:fetch elevating privileges for fetch: euid changed to 0, egid changed to 0. |
|---|
| 12 | :debug:fetch dropping privileges: euid changed to 506, egid changed to 503. |
|---|
| 13 | :debug:fetch Executing org.macports.fetch (libcerf) |
|---|
| 14 | :info:fetch ---> libcerf-1.4.tgz does not exist in /sandbox/var/macports/distfiles/libcerf |
|---|
| 15 | :notice:fetch ---> Attempting to fetch libcerf-1.4.tgz from http://ykf.ca.distfiles.macports.org/MacPorts/mpdistfiles/libcerf |
|---|
| 16 | :debug:fetch Privilege de-escalation not attempted as not running as root. |
|---|
| 17 | :debug:checksum checksum phase started at Fri May 27 19:28:49 EDT 2016 |
|---|
| 18 | :notice:checksum ---> Verifying checksums for libcerf |
|---|
| 19 | :debug:checksum Executing org.macports.checksum (libcerf) |
|---|
| 20 | :info:checksum ---> Checksumming libcerf-1.4.tgz |
|---|
| 21 | :debug:checksum Calculated (rmd160) is d90dd82fd0561e0070dbf736b268a5b1e8d1a148 |
|---|
| 22 | :debug:checksum Correct (rmd160) checksum for libcerf-1.4.tgz |
|---|
| 23 | :debug:checksum Calculated (sha256) is 101265dd1e1b10339adb70b22b60e65ef12c4e01c4a3f52e508562eceef62272 |
|---|
| 24 | :debug:checksum Correct (sha256) checksum for libcerf-1.4.tgz |
|---|
| 25 | :debug:checksum Privilege de-escalation not attempted as not running as root. |
|---|
| 26 | :debug:extract extract phase started at Fri May 27 19:28:50 EDT 2016 |
|---|
| 27 | :notice:extract ---> Extracting libcerf |
|---|
| 28 | :debug:extract Executing org.macports.extract (libcerf) |
|---|
| 29 | :info:extract ---> Extracting libcerf-1.4.tgz |
|---|
| 30 | :debug:extract setting option extract.args to '/sandbox/var/macports/distfiles/libcerf/libcerf-1.4.tgz' |
|---|
| 31 | :debug:extract Environment: |
|---|
| 32 | :debug:extract CC_PRINT_OPTIONS='YES' |
|---|
| 33 | :debug:extract CC_PRINT_OPTIONS_FILE='/sandbox/var/macports/build/_sandbox_trunk_dports_math_libcerf/libcerf/work/.CC_PRINT_OPTIONS' |
|---|
| 34 | :debug:extract CPATH='/sandbox/include' |
|---|
| 35 | :debug:extract LIBRARY_PATH='/sandbox/lib' |
|---|
| 36 | :debug:extract MACOSX_DEPLOYMENT_TARGET='10.6' |
|---|
| 37 | :info:extract Executing: cd "/sandbox/var/macports/build/_sandbox_trunk_dports_math_libcerf/libcerf/work" && /usr/bin/gzip -dc '/sandbox/var/macports/distfiles/libcerf/libcerf-1.4.tgz' | /usr/bin/gnutar --no-same-owner -xf - |
|---|
| 38 | :debug:extract system: cd "/sandbox/var/macports/build/_sandbox_trunk_dports_math_libcerf/libcerf/work" && /usr/bin/gzip -dc '/sandbox/var/macports/distfiles/libcerf/libcerf-1.4.tgz' | /usr/bin/gnutar --no-same-owner -xf - |
|---|
| 39 | :debug:extract euid/egid changed to: 0/0 |
|---|
| 40 | :debug:extract chowned /sandbox/var/macports/build/_sandbox_trunk_dports_math_libcerf/libcerf/work to macports |
|---|
| 41 | :debug:extract euid/egid changed to: 506/503 |
|---|
| 42 | :debug:extract Privilege de-escalation not attempted as not running as root. |
|---|
| 43 | :debug:patch patch phase started at Fri May 27 19:28:50 EDT 2016 |
|---|
| 44 | :debug:patch Executing org.macports.patch (libcerf) |
|---|
| 45 | :debug:patch Privilege de-escalation not attempted as not running as root. |
|---|
| 46 | :debug:configure configure phase started at Fri May 27 19:28:50 EDT 2016 |
|---|
| 47 | :notice:configure ---> Configuring libcerf |
|---|
| 48 | :debug:configure Preferred compilers: gcc-4.2 clang llvm-gcc-4.2 macports-clang-3.4 macports-clang-3.3 macports-llvm-gcc-4.2 apple-gcc-4.2 |
|---|
| 49 | :debug:configure Using compiler 'Xcode GCC 4.2' |
|---|
| 50 | :debug:configure Executing org.macports.configure (libcerf) |
|---|
| 51 | :debug:configure Environment: |
|---|
| 52 | :debug:configure CC='/usr/bin/gcc-4.2' |
|---|
| 53 | :debug:configure CC_PRINT_OPTIONS='YES' |
|---|
| 54 | :debug:configure CC_PRINT_OPTIONS_FILE='/sandbox/var/macports/build/_sandbox_trunk_dports_math_libcerf/libcerf/work/.CC_PRINT_OPTIONS' |
|---|
| 55 | :debug:configure CFLAGS='-pipe -Os -arch x86_64' |
|---|
| 56 | :debug:configure CPATH='/sandbox/include' |
|---|
| 57 | :debug:configure CPPFLAGS='-I/sandbox/include' |
|---|
| 58 | :debug:configure CXX='/usr/bin/g++-4.2' |
|---|
| 59 | :debug:configure CXXFLAGS='-pipe -Os -arch x86_64' |
|---|
| 60 | :debug:configure F77FLAGS='-m64' |
|---|
| 61 | :debug:configure F90FLAGS='-pipe -Os -m64' |
|---|
| 62 | :debug:configure FCFLAGS='-pipe -Os -m64' |
|---|
| 63 | :debug:configure FFLAGS='-pipe -Os' |
|---|
| 64 | :debug:configure INSTALL='/usr/bin/install -c' |
|---|
| 65 | :debug:configure LDFLAGS='-L/sandbox/lib -Wl,-headerpad_max_install_names -arch x86_64' |
|---|
| 66 | :debug:configure LIBRARY_PATH='/sandbox/lib' |
|---|
| 67 | :debug:configure MACOSX_DEPLOYMENT_TARGET='10.6' |
|---|
| 68 | :debug:configure OBJC='/usr/bin/gcc-4.2' |
|---|
| 69 | :debug:configure OBJCFLAGS='-pipe -Os -arch x86_64' |
|---|
| 70 | :debug:configure OBJCXX='/usr/bin/g++-4.2' |
|---|
| 71 | :debug:configure OBJCXXFLAGS='-pipe -Os -arch x86_64' |
|---|
| 72 | :info:configure Executing: cd "/sandbox/var/macports/build/_sandbox_trunk_dports_math_libcerf/libcerf/work/libcerf-1.4" && ./configure --prefix=/sandbox |
|---|
| 73 | :debug:configure system: cd "/sandbox/var/macports/build/_sandbox_trunk_dports_math_libcerf/libcerf/work/libcerf-1.4" && ./configure --prefix=/sandbox |
|---|
| 74 | :info:configure checking for a BSD-compatible install... /usr/bin/install -c |
|---|
| 75 | :info:configure checking whether build environment is sane... yes |
|---|
| 76 | :info:configure checking for a thread-safe mkdir -p... build-aux/install-sh -c -d |
|---|
| 77 | :info:configure checking for gawk... no |
|---|
| 78 | :info:configure checking for mawk... no |
|---|
| 79 | :info:configure checking for nawk... no |
|---|
| 80 | :info:configure checking for awk... awk |
|---|
| 81 | :info:configure checking whether make sets $(MAKE)... yes |
|---|
| 82 | :info:configure checking whether make supports nested variables... yes |
|---|
| 83 | :info:configure checking build system type... x86_64-apple-darwin10.8.0 |
|---|
| 84 | :info:configure checking host system type... x86_64-apple-darwin10.8.0 |
|---|
| 85 | :info:configure checking how to print strings... printf |
|---|
| 86 | :info:configure checking for style of include used by make... GNU |
|---|
| 87 | :info:configure checking for gcc... /usr/bin/gcc-4.2 |
|---|
| 88 | :info:configure checking whether the C compiler works... yes |
|---|
| 89 | :info:configure checking for C compiler default output file name... a.out |
|---|
| 90 | :info:configure checking for suffix of executables... |
|---|
| 91 | :info:configure checking whether we are cross compiling... no |
|---|
| 92 | :info:configure checking for suffix of object files... o |
|---|
| 93 | :info:configure checking whether we are using the GNU C compiler... yes |
|---|
| 94 | :info:configure checking whether /usr/bin/gcc-4.2 accepts -g... yes |
|---|
| 95 | :info:configure checking for /usr/bin/gcc-4.2 option to accept ISO C89... none needed |
|---|
| 96 | :info:configure checking whether /usr/bin/gcc-4.2 understands -c and -o together... yes |
|---|
| 97 | :info:configure checking dependency style of /usr/bin/gcc-4.2... gcc3 |
|---|
| 98 | :info:configure checking for a sed that does not truncate output... /usr/bin/sed |
|---|
| 99 | :info:configure checking for grep that handles long lines and -e... /usr/bin/grep |
|---|
| 100 | :info:configure checking for egrep... /usr/bin/grep -E |
|---|
| 101 | :info:configure checking for fgrep... /usr/bin/grep -F |
|---|
| 102 | :info:configure checking for ld used by /usr/bin/gcc-4.2... /usr/libexec/gcc/i686-apple-darwin10/4.2.1/ld |
|---|
| 103 | :info:configure checking if the linker (/usr/libexec/gcc/i686-apple-darwin10/4.2.1/ld) is GNU ld... no |
|---|
| 104 | :info:configure checking for BSD- or MS-compatible name lister (nm)... /usr/bin/nm |
|---|
| 105 | :info:configure checking the name lister (/usr/bin/nm) interface... BSD nm |
|---|
| 106 | :info:configure checking whether ln -s works... yes |
|---|
| 107 | :info:configure checking the maximum length of command line arguments... 196608 |
|---|
| 108 | :info:configure checking whether the shell understands some XSI constructs... yes |
|---|
| 109 | :info:configure checking whether the shell understands "+="... yes |
|---|
| 110 | :info:configure checking how to convert x86_64-apple-darwin10.8.0 file names to x86_64-apple-darwin10.8.0 format... func_convert_file_noop |
|---|
| 111 | :info:configure checking how to convert x86_64-apple-darwin10.8.0 file names to toolchain format... func_convert_file_noop |
|---|
| 112 | :info:configure checking for /usr/libexec/gcc/i686-apple-darwin10/4.2.1/ld option to reload object files... -r |
|---|
| 113 | :info:configure checking for objdump... no |
|---|
| 114 | :info:configure checking how to recognize dependent libraries... pass_all |
|---|
| 115 | :info:configure checking for dlltool... no |
|---|
| 116 | :info:configure checking how to associate runtime and link libraries... printf %s\n |
|---|
| 117 | :info:configure checking for ar... ar |
|---|
| 118 | :info:configure checking for archiver @FILE support... no |
|---|
| 119 | :info:configure checking for strip... strip |
|---|
| 120 | :info:configure checking for ranlib... ranlib |
|---|
| 121 | :info:configure checking command to parse /usr/bin/nm output from /usr/bin/gcc-4.2 object... ok |
|---|
| 122 | :info:configure checking for sysroot... no |
|---|
| 123 | :info:configure checking for mt... no |
|---|
| 124 | :info:configure checking if : is a manifest tool... no |
|---|
| 125 | :info:configure checking for dsymutil... dsymutil |
|---|
| 126 | :info:configure checking for nmedit... nmedit |
|---|
| 127 | :info:configure checking for lipo... lipo |
|---|
| 128 | :info:configure checking for otool... otool |
|---|
| 129 | :info:configure checking for otool64... no |
|---|
| 130 | :info:configure checking for -single_module linker flag... yes |
|---|
| 131 | :info:configure checking for -exported_symbols_list linker flag... yes |
|---|
| 132 | :info:configure checking for -force_load linker flag... yes |
|---|
| 133 | :info:configure checking how to run the C preprocessor... /usr/bin/gcc-4.2 -E |
|---|
| 134 | :info:configure checking for ANSI C header files... yes |
|---|
| 135 | :info:configure checking for sys/types.h... yes |
|---|
| 136 | :info:configure checking for sys/stat.h... yes |
|---|
| 137 | :info:configure checking for stdlib.h... yes |
|---|
| 138 | :info:configure checking for string.h... yes |
|---|
| 139 | :info:configure checking for memory.h... yes |
|---|
| 140 | :info:configure checking for strings.h... yes |
|---|
| 141 | :info:configure checking for inttypes.h... yes |
|---|
| 142 | :info:configure checking for stdint.h... yes |
|---|
| 143 | :info:configure checking for unistd.h... yes |
|---|
| 144 | :info:configure checking for dlfcn.h... yes |
|---|
| 145 | :info:configure checking for objdir... .libs |
|---|
| 146 | :info:configure checking if /usr/bin/gcc-4.2 supports -fno-rtti -fno-exceptions... no |
|---|
| 147 | :info:configure checking for /usr/bin/gcc-4.2 option to produce PIC... -fno-common -DPIC |
|---|
| 148 | :info:configure checking if /usr/bin/gcc-4.2 PIC flag -fno-common -DPIC works... yes |
|---|
| 149 | :info:configure checking if /usr/bin/gcc-4.2 static flag -static works... no |
|---|
| 150 | :info:configure checking if /usr/bin/gcc-4.2 supports -c -o file.o... yes |
|---|
| 151 | :info:configure checking if /usr/bin/gcc-4.2 supports -c -o file.o... (cached) yes |
|---|
| 152 | :info:configure checking whether the /usr/bin/gcc-4.2 linker (/usr/libexec/gcc/i686-apple-darwin10/4.2.1/ld) supports shared libraries... yes |
|---|
| 153 | :info:configure checking dynamic linker characteristics... darwin10.8.0 dyld |
|---|
| 154 | :info:configure checking how to hardcode library paths into programs... immediate |
|---|
| 155 | :info:configure checking whether stripping libraries is possible... yes |
|---|
| 156 | :info:configure checking if libtool supports shared libraries... yes |
|---|
| 157 | :info:configure checking whether to build shared libraries... yes |
|---|
| 158 | :info:configure checking whether to build static libraries... no |
|---|
| 159 | :info:configure checking for /usr/bin/gcc-4.2 option to accept ISO C99... -std=gnu99 |
|---|
| 160 | :info:configure checking for ANSI C header files... (cached) yes |
|---|
| 161 | :info:configure checking for sin in -lm... yes |
|---|
| 162 | :info:configure checking for erfc in -lm... yes |
|---|
| 163 | :info:configure checking that generated files are newer than configure... done |
|---|
| 164 | :info:configure configure: creating ./config.status |
|---|
| 165 | :info:configure config.status: creating Makefile |
|---|
| 166 | :info:configure config.status: creating lib/Makefile |
|---|
| 167 | :info:configure config.status: creating man/Makefile |
|---|
| 168 | :info:configure config.status: creating test/Makefile |
|---|
| 169 | :info:configure config.status: creating libcerf.pc |
|---|
| 170 | :info:configure config.status: creating config.h |
|---|
| 171 | :info:configure config.status: executing depfiles commands |
|---|
| 172 | :info:configure config.status: executing libtool commands |
|---|
| 173 | :debug:configure Privilege de-escalation not attempted as not running as root. |
|---|
| 174 | :debug:build build phase started at Fri May 27 19:29:02 EDT 2016 |
|---|
| 175 | :notice:build ---> Building libcerf |
|---|
| 176 | :debug:build Executing org.macports.build (libcerf) |
|---|
| 177 | :debug:build Environment: |
|---|
| 178 | :debug:build CC_PRINT_OPTIONS='YES' |
|---|
| 179 | :debug:build CC_PRINT_OPTIONS_FILE='/sandbox/var/macports/build/_sandbox_trunk_dports_math_libcerf/libcerf/work/.CC_PRINT_OPTIONS' |
|---|
| 180 | :debug:build CPATH='/sandbox/include' |
|---|
| 181 | :debug:build LIBRARY_PATH='/sandbox/lib' |
|---|
| 182 | :debug:build MACOSX_DEPLOYMENT_TARGET='10.6' |
|---|
| 183 | :info:build Executing: cd "/sandbox/var/macports/build/_sandbox_trunk_dports_math_libcerf/libcerf/work/libcerf-1.4" && /usr/bin/make -j2 -w all |
|---|
| 184 | :debug:build system: cd "/sandbox/var/macports/build/_sandbox_trunk_dports_math_libcerf/libcerf/work/libcerf-1.4" && /usr/bin/make -j2 -w all |
|---|
| 185 | :info:build make: Entering directory `/sandbox/var/macports/build/_sandbox_trunk_dports_math_libcerf/libcerf/work/libcerf-1.4' |
|---|
| 186 | :info:build /usr/bin/make all-recursive |
|---|
| 187 | :info:build make[1]: Entering directory `/sandbox/var/macports/build/_sandbox_trunk_dports_math_libcerf/libcerf/work/libcerf-1.4' |
|---|
| 188 | :info:build Making all in lib |
|---|
| 189 | :info:build make[2]: Entering directory `/sandbox/var/macports/build/_sandbox_trunk_dports_math_libcerf/libcerf/work/libcerf-1.4/lib' |
|---|
| 190 | :info:build /bin/sh ../libtool --tag=CC --mode=compile /usr/bin/gcc-4.2 -std=gnu99 -DHAVE_CONFIG_H -I. -I.. -I/sandbox/include -pedantic -Wall -pipe -Os -arch x86_64 -MT im_w_of_x.lo -MD -MP -MF .deps/im_w_of_x.Tpo -c -o im_w_of_x.lo im_w_of_x.c |
|---|
| 191 | :info:build /bin/sh ../libtool --tag=CC --mode=compile /usr/bin/gcc-4.2 -std=gnu99 -DHAVE_CONFIG_H -I. -I.. -I/sandbox/include -pedantic -Wall -pipe -Os -arch x86_64 -MT erfcx.lo -MD -MP -MF .deps/erfcx.Tpo -c -o erfcx.lo erfcx.c |
|---|
| 192 | :info:build libtool: compile: /usr/bin/gcc-4.2 -std=gnu99 -DHAVE_CONFIG_H -I. -I.. -I/sandbox/include -pedantic -Wall -pipe -Os -arch x86_64 -MT im_w_of_x.lo -MD -MP -MF .deps/im_w_of_x.Tpo -c im_w_of_x.c -fno-common -DPIC -o .libs/im_w_of_x.o |
|---|
| 193 | :info:build libtool: compile: /usr/bin/gcc-4.2 -std=gnu99 -DHAVE_CONFIG_H -I. -I.. -I/sandbox/include -pedantic -Wall -pipe -Os -arch x86_64 -MT erfcx.lo -MD -MP -MF .deps/erfcx.Tpo -c erfcx.c -fno-common -DPIC -o .libs/erfcx.o |
|---|
| 194 | :info:build mv -f .deps/erfcx.Tpo .deps/erfcx.Plo |
|---|
| 195 | :info:build /bin/sh ../libtool --tag=CC --mode=compile /usr/bin/gcc-4.2 -std=gnu99 -DHAVE_CONFIG_H -I. -I.. -I/sandbox/include -pedantic -Wall -pipe -Os -arch x86_64 -MT w_of_z.lo -MD -MP -MF .deps/w_of_z.Tpo -c -o w_of_z.lo w_of_z.c |
|---|
| 196 | :info:build mv -f .deps/im_w_of_x.Tpo .deps/im_w_of_x.Plo |
|---|
| 197 | :info:build /bin/sh ../libtool --tag=CC --mode=compile /usr/bin/gcc-4.2 -std=gnu99 -DHAVE_CONFIG_H -I. -I.. -I/sandbox/include -pedantic -Wall -pipe -Os -arch x86_64 -MT err_fcts.lo -MD -MP -MF .deps/err_fcts.Tpo -c -o err_fcts.lo err_fcts.c |
|---|
| 198 | :info:build libtool: compile: /usr/bin/gcc-4.2 -std=gnu99 -DHAVE_CONFIG_H -I. -I.. -I/sandbox/include -pedantic -Wall -pipe -Os -arch x86_64 -MT w_of_z.lo -MD -MP -MF .deps/w_of_z.Tpo -c w_of_z.c -fno-common -DPIC -o .libs/w_of_z.o |
|---|
| 199 | :info:build libtool: compile: /usr/bin/gcc-4.2 -std=gnu99 -DHAVE_CONFIG_H -I. -I.. -I/sandbox/include -pedantic -Wall -pipe -Os -arch x86_64 -MT err_fcts.lo -MD -MP -MF .deps/err_fcts.Tpo -c err_fcts.c -fno-common -DPIC -o .libs/err_fcts.o |
|---|
| 200 | :info:build w_of_z.c:84:40: warning: imaginary constants are a GCC extension |
|---|
| 201 | :info:build w_of_z.c:176:43: warning: imaginary constants are a GCC extension |
|---|
| 202 | :info:build w_of_z.c:180:59: warning: imaginary constants are a GCC extension |
|---|
| 203 | :info:build w_of_z.c:225:45: warning: imaginary constants are a GCC extension |
|---|
| 204 | :info:build w_of_z.c:230:40: warning: imaginary constants are a GCC extension |
|---|
| 205 | :info:build w_of_z.c:230:49: warning: imaginary constants are a GCC extension |
|---|
| 206 | :info:build w_of_z.c:236:45: warning: imaginary constants are a GCC extension |
|---|
| 207 | :info:build w_of_z.c:243:69: warning: imaginary constants are a GCC extension |
|---|
| 208 | :info:build w_of_z.c:259:43: warning: imaginary constants are a GCC extension |
|---|
| 209 | :info:build w_of_z.c:267:54: warning: imaginary constants are a GCC extension |
|---|
| 210 | :info:build w_of_z.c:294:25: warning: imaginary constants are a GCC extension |
|---|
| 211 | :info:build w_of_z.c:359:66: warning: imaginary constants are a GCC extension |
|---|
| 212 | :info:build w_of_z.c:367:25: warning: imaginary constants are a GCC extension |
|---|
| 213 | :info:build w_of_z.c:369:25: warning: imaginary constants are a GCC extension |
|---|
| 214 | :info:build w_of_z.c:399:57: warning: imaginary constants are a GCC extension |
|---|
| 215 | :info:build err_fcts.c:76:40: warning: imaginary constants are a GCC extension |
|---|
| 216 | :info:build err_fcts.c:84:40: warning: imaginary constants are a GCC extension |
|---|
| 217 | :info:build err_fcts.c:85:33: warning: imaginary constants are a GCC extension |
|---|
| 218 | :info:build err_fcts.c:107:32: warning: imaginary constants are a GCC extension |
|---|
| 219 | :info:build err_fcts.c:112:32: warning: imaginary constants are a GCC extension |
|---|
| 220 | :info:build err_fcts.c:154:30: warning: imaginary constants are a GCC extension |
|---|
| 221 | :info:build err_fcts.c:175:27: warning: imaginary constants are a GCC extension |
|---|
| 222 | :info:build err_fcts.c:182:43: warning: imaginary constants are a GCC extension |
|---|
| 223 | :info:build err_fcts.c:202:40: warning: imaginary constants are a GCC extension |
|---|
| 224 | :info:build err_fcts.c:203:29: warning: imaginary constants are a GCC extension |
|---|
| 225 | :info:build err_fcts.c:213:43: warning: imaginary constants are a GCC extension |
|---|
| 226 | :info:build err_fcts.c:217:40: warning: imaginary constants are a GCC extension |
|---|
| 227 | :info:build err_fcts.c:218:29: warning: imaginary constants are a GCC extension |
|---|
| 228 | :info:build err_fcts.c:225:37: warning: imaginary constants are a GCC extension |
|---|
| 229 | :info:build err_fcts.c:256:71: warning: imaginary constants are a GCC extension |
|---|
| 230 | :info:build err_fcts.c:279:44: warning: imaginary constants are a GCC extension |
|---|
| 231 | :info:build err_fcts.c:283:24: warning: imaginary constants are a GCC extension |
|---|
| 232 | :info:build err_fcts.c:286:20: warning: imaginary constants are a GCC extension |
|---|
| 233 | :info:build err_fcts.c:295:37: warning: imaginary constants are a GCC extension |
|---|
| 234 | :info:build err_fcts.c:296:28: warning: imaginary constants are a GCC extension |
|---|
| 235 | :info:build err_fcts.c:298:43: warning: imaginary constants are a GCC extension |
|---|
| 236 | :info:build err_fcts.c:299:28: warning: imaginary constants are a GCC extension |
|---|
| 237 | :info:build err_fcts.c:320:20: warning: imaginary constants are a GCC extension |
|---|
| 238 | :info:build err_fcts.c:327:84: warning: imaginary constants are a GCC extension |
|---|
| 239 | :info:build err_fcts.c:332:48: warning: imaginary constants are a GCC extension |
|---|
| 240 | :info:build err_fcts.c:337:33: warning: imaginary constants are a GCC extension |
|---|
| 241 | :info:build err_fcts.c:350:48: warning: imaginary constants are a GCC extension |
|---|
| 242 | :info:build err_fcts.c:360:43: warning: imaginary constants are a GCC extension |
|---|
| 243 | :info:build err_fcts.c:362:48: warning: imaginary constants are a GCC extension |
|---|
| 244 | :info:build err_fcts.c:417:38: warning: imaginary constants are a GCC extension |
|---|
| 245 | :info:build err_fcts.c:423:50: warning: imaginary constants are a GCC extension |
|---|
| 246 | :info:build err_fcts.c:438:86: warning: imaginary constants are a GCC extension |
|---|
| 247 | :info:build mv -f .deps/w_of_z.Tpo .deps/w_of_z.Plo |
|---|
| 248 | :info:build mv -f .deps/err_fcts.Tpo .deps/err_fcts.Plo |
|---|
| 249 | :info:build /bin/sh ../libtool --tag=CC --mode=link /usr/bin/gcc-4.2 -std=gnu99 -pedantic -Wall -pipe -Os -arch x86_64 -version-info 1:4 -L/sandbox/lib -Wl,-headerpad_max_install_names -arch x86_64 -o libcerf.la -rpath /sandbox/lib im_w_of_x.lo erfcx.lo w_of_z.lo err_fcts.lo -lm -lm |
|---|
| 250 | :info:build libtool: link: /usr/bin/gcc-4.2 -dynamiclib -Wl,-undefined -Wl,dynamic_lookup -o .libs/libcerf.1.dylib .libs/im_w_of_x.o .libs/erfcx.o .libs/w_of_z.o .libs/err_fcts.o -L/sandbox/lib -lm -Os -arch x86_64 -Wl,-headerpad_max_install_names -arch x86_64 -install_name /sandbox/lib/libcerf.1.dylib -compatibility_version 2 -current_version 2.4 -Wl,-single_module |
|---|
| 251 | :info:build libtool: link: (cd ".libs" && rm -f "libcerf.dylib" && ln -s "libcerf.1.dylib" "libcerf.dylib") |
|---|
| 252 | :info:build libtool: link: ( cd ".libs" && rm -f "libcerf.la" && ln -s "../libcerf.la" "libcerf.la" ) |
|---|
| 253 | :info:build make[2]: Leaving directory `/sandbox/var/macports/build/_sandbox_trunk_dports_math_libcerf/libcerf/work/libcerf-1.4/lib' |
|---|
| 254 | :info:build Making all in man |
|---|
| 255 | :info:build make[2]: Entering directory `/sandbox/var/macports/build/_sandbox_trunk_dports_math_libcerf/libcerf/work/libcerf-1.4/man' |
|---|
| 256 | :info:build pod2man -s 3 -c "libcerf manual" w_of_z.pod > w_of_z.3 |
|---|
| 257 | :info:build pod2man -s 3 -c "libcerf manual" w_of_z.pod > im_w_of_x.3 |
|---|
| 258 | :info:build /bin/sh: /usr/bin/pod2man: Permission denied |
|---|
| 259 | :info:build /bin/sh: /usr/bin/pod2man: Permission denied |
|---|
| 260 | :info:build make[2]: *** [im_w_of_x.3] Error 126 |
|---|
| 261 | :info:build make[2]: *** Waiting for unfinished jobs.... |
|---|
| 262 | :info:build make[2]: *** [w_of_z.3] Error 126 |
|---|
| 263 | :info:build make[2]: Leaving directory `/sandbox/var/macports/build/_sandbox_trunk_dports_math_libcerf/libcerf/work/libcerf-1.4/man' |
|---|
| 264 | :info:build make[1]: *** [all-recursive] Error 1 |
|---|
| 265 | :info:build make[1]: Leaving directory `/sandbox/var/macports/build/_sandbox_trunk_dports_math_libcerf/libcerf/work/libcerf-1.4' |
|---|
| 266 | :info:build make: *** [all] Error 2 |
|---|
| 267 | :info:build make: Leaving directory `/sandbox/var/macports/build/_sandbox_trunk_dports_math_libcerf/libcerf/work/libcerf-1.4' |
|---|
| 268 | :info:build Command failed: cd "/sandbox/var/macports/build/_sandbox_trunk_dports_math_libcerf/libcerf/work/libcerf-1.4" && /usr/bin/make -j2 -w all |
|---|
| 269 | :info:build Exit code: 2 |
|---|
| 270 | :error:build Failed to build libcerf: command execution failed |
|---|
| 271 | :debug:build Error code: CHILDSTATUS 99538 2 |
|---|
| 272 | :debug:build Backtrace: command execution failed |
|---|
| 273 | :debug:build while executing |
|---|
| 274 | :debug:build "system {*}$notty {*}$nice $fullcmdstring" |
|---|
| 275 | :debug:build invoked from within |
|---|
| 276 | :debug:build "command_exec build" |
|---|
| 277 | :debug:build (procedure "portbuild::build_main" line 8) |
|---|
| 278 | :debug:build invoked from within |
|---|
| 279 | :debug:build "$procedure $targetname" |
|---|
| 280 | :debug:build could not read "/sandbox/share/man/man1/img2txt.1.gz": no such file or directory |
|---|
| 281 | :debug:build while executing |
|---|
| 282 | :debug:build "::file type $file" |
|---|
| 283 | :error:build See /sandbox/var/macports/logs/_sandbox_trunk_dports_math_libcerf/libcerf/main.log for details. |
|---|
| 284 | version:1 |
|---|
| 285 | :debug:main libcerf has no conflicts |
|---|
| 286 | :debug:main Executing org.macports.main (libcerf) |
|---|
| 287 | :debug:main dropping privileges: euid changed to 506, egid changed to 503. |
|---|
| 288 | :debug:main Skipping completed org.macports.archivefetch (libcerf) |
|---|
| 289 | :debug:main Privilege de-escalation not attempted as not running as root. |
|---|
| 290 | :debug:main Skipping completed org.macports.fetch (libcerf) |
|---|
| 291 | :debug:main Privilege de-escalation not attempted as not running as root. |
|---|
| 292 | :debug:main Skipping completed org.macports.checksum (libcerf) |
|---|
| 293 | :debug:main Privilege de-escalation not attempted as not running as root. |
|---|
| 294 | :debug:main Skipping completed org.macports.extract (libcerf) |
|---|
| 295 | :debug:main Privilege de-escalation not attempted as not running as root. |
|---|
| 296 | :debug:main Skipping completed org.macports.patch (libcerf) |
|---|
| 297 | :debug:main Privilege de-escalation not attempted as not running as root. |
|---|
| 298 | :debug:main Skipping completed org.macports.configure (libcerf) |
|---|
| 299 | :debug:main Privilege de-escalation not attempted as not running as root. |
|---|
| 300 | :debug:build build phase started at Fri May 27 19:41:05 EDT 2016 |
|---|
| 301 | :notice:build ---> Building libcerf |
|---|
| 302 | :debug:build Executing org.macports.build (libcerf) |
|---|
| 303 | :debug:build Environment: |
|---|
| 304 | :debug:build CC_PRINT_OPTIONS='YES' |
|---|
| 305 | :debug:build CC_PRINT_OPTIONS_FILE='/sandbox/var/macports/build/_sandbox_trunk_dports_math_libcerf/libcerf/work/.CC_PRINT_OPTIONS' |
|---|
| 306 | :debug:build CPATH='/sandbox/include' |
|---|
| 307 | :debug:build LIBRARY_PATH='/sandbox/lib' |
|---|
| 308 | :debug:build MACOSX_DEPLOYMENT_TARGET='10.6' |
|---|
| 309 | :info:build Executing: cd "/sandbox/var/macports/build/_sandbox_trunk_dports_math_libcerf/libcerf/work/libcerf-1.4" && /usr/bin/make -j2 -w all |
|---|
| 310 | :debug:build system: cd "/sandbox/var/macports/build/_sandbox_trunk_dports_math_libcerf/libcerf/work/libcerf-1.4" && /usr/bin/make -j2 -w all |
|---|
| 311 | :info:build make: Entering directory `/sandbox/var/macports/build/_sandbox_trunk_dports_math_libcerf/libcerf/work/libcerf-1.4' |
|---|
| 312 | :info:build /usr/bin/make all-recursive |
|---|
| 313 | :info:build make[1]: Entering directory `/sandbox/var/macports/build/_sandbox_trunk_dports_math_libcerf/libcerf/work/libcerf-1.4' |
|---|
| 314 | :info:build Making all in lib |
|---|
| 315 | :info:build make[2]: Entering directory `/sandbox/var/macports/build/_sandbox_trunk_dports_math_libcerf/libcerf/work/libcerf-1.4/lib' |
|---|
| 316 | :info:build make[2]: Nothing to be done for `all'. |
|---|
| 317 | :info:build make[2]: Leaving directory `/sandbox/var/macports/build/_sandbox_trunk_dports_math_libcerf/libcerf/work/libcerf-1.4/lib' |
|---|
| 318 | :info:build Making all in man |
|---|
| 319 | :info:build make[2]: Entering directory `/sandbox/var/macports/build/_sandbox_trunk_dports_math_libcerf/libcerf/work/libcerf-1.4/man' |
|---|
| 320 | :info:build pod2man -s 3 -c "libcerf manual" dawson.pod > dawson.3 |
|---|
| 321 | :info:build pod2man -s 3 -c "libcerf manual" dawson.pod > cdawson.3 |
|---|
| 322 | :info:build /bin/sh: /usr/bin/pod2man: Permission denied |
|---|
| 323 | :info:build /bin/sh: /usr/bin/pod2man: Permission denied |
|---|
| 324 | :info:build make[2]: *** [dawson.3] Error 126 |
|---|
| 325 | :info:build make[2]: *** Waiting for unfinished jobs.... |
|---|
| 326 | :info:build make[2]: *** [cdawson.3] Error 126 |
|---|
| 327 | :info:build make[2]: Leaving directory `/sandbox/var/macports/build/_sandbox_trunk_dports_math_libcerf/libcerf/work/libcerf-1.4/man' |
|---|
| 328 | :info:build make[1]: *** [all-recursive] Error 1 |
|---|
| 329 | :info:build make[1]: Leaving directory `/sandbox/var/macports/build/_sandbox_trunk_dports_math_libcerf/libcerf/work/libcerf-1.4' |
|---|
| 330 | :info:build make: *** [all] Error 2 |
|---|
| 331 | :info:build make: Leaving directory `/sandbox/var/macports/build/_sandbox_trunk_dports_math_libcerf/libcerf/work/libcerf-1.4' |
|---|
| 332 | :info:build Command failed: cd "/sandbox/var/macports/build/_sandbox_trunk_dports_math_libcerf/libcerf/work/libcerf-1.4" && /usr/bin/make -j2 -w all |
|---|
| 333 | :info:build Exit code: 2 |
|---|
| 334 | :error:build Failed to build libcerf: command execution failed |
|---|
| 335 | :debug:build Error code: CHILDSTATUS 99721 2 |
|---|
| 336 | :debug:build Backtrace: command execution failed |
|---|
| 337 | :debug:build while executing |
|---|
| 338 | :debug:build "system {*}$notty {*}$nice $fullcmdstring" |
|---|
| 339 | :debug:build invoked from within |
|---|
| 340 | :debug:build "command_exec build" |
|---|
| 341 | :debug:build (procedure "portbuild::build_main" line 8) |
|---|
| 342 | :debug:build invoked from within |
|---|
| 343 | :debug:build "$procedure $targetname" |
|---|
| 344 | :error:build See /sandbox/var/macports/logs/_sandbox_trunk_dports_math_libcerf/libcerf/main.log for details. |
|---|
| 345 | version:1 |
|---|
| 346 | :debug:main libcerf has no conflicts |
|---|
| 347 | :debug:main Executing org.macports.main (libcerf) |
|---|
| 348 | :debug:main dropping privileges: euid changed to 506, egid changed to 503. |
|---|
| 349 | :debug:main Skipping completed org.macports.archivefetch (libcerf) |
|---|
| 350 | :debug:main Privilege de-escalation not attempted as not running as root. |
|---|
| 351 | :debug:main Skipping completed org.macports.fetch (libcerf) |
|---|
| 352 | :debug:main Privilege de-escalation not attempted as not running as root. |
|---|
| 353 | :debug:main Skipping completed org.macports.checksum (libcerf) |
|---|
| 354 | :debug:main Privilege de-escalation not attempted as not running as root. |
|---|
| 355 | :debug:main Skipping completed org.macports.extract (libcerf) |
|---|
| 356 | :debug:main Privilege de-escalation not attempted as not running as root. |
|---|
| 357 | :debug:main Skipping completed org.macports.patch (libcerf) |
|---|
| 358 | :debug:main Privilege de-escalation not attempted as not running as root. |
|---|
| 359 | :debug:main Skipping completed org.macports.configure (libcerf) |
|---|
| 360 | :debug:main Privilege de-escalation not attempted as not running as root. |
|---|
| 361 | :debug:build build phase started at Fri May 27 19:41:14 EDT 2016 |
|---|
| 362 | :notice:build ---> Building libcerf |
|---|
| 363 | :debug:build Executing org.macports.build (libcerf) |
|---|
| 364 | :debug:build Environment: |
|---|
| 365 | :debug:build CC_PRINT_OPTIONS='YES' |
|---|
| 366 | :debug:build CC_PRINT_OPTIONS_FILE='/sandbox/var/macports/build/_sandbox_trunk_dports_math_libcerf/libcerf/work/.CC_PRINT_OPTIONS' |
|---|
| 367 | :debug:build CPATH='/sandbox/include' |
|---|
| 368 | :debug:build LIBRARY_PATH='/sandbox/lib' |
|---|
| 369 | :debug:build MACOSX_DEPLOYMENT_TARGET='10.6' |
|---|
| 370 | :info:build Executing: cd "/sandbox/var/macports/build/_sandbox_trunk_dports_math_libcerf/libcerf/work/libcerf-1.4" && /usr/bin/make -j2 -w all |
|---|
| 371 | :debug:build system: cd "/sandbox/var/macports/build/_sandbox_trunk_dports_math_libcerf/libcerf/work/libcerf-1.4" && /usr/bin/make -j2 -w all |
|---|
| 372 | :info:build make: Entering directory `/sandbox/var/macports/build/_sandbox_trunk_dports_math_libcerf/libcerf/work/libcerf-1.4' |
|---|
| 373 | :info:build /usr/bin/make all-recursive |
|---|
| 374 | :info:build make[1]: Entering directory `/sandbox/var/macports/build/_sandbox_trunk_dports_math_libcerf/libcerf/work/libcerf-1.4' |
|---|
| 375 | :info:build Making all in lib |
|---|
| 376 | :info:build make[2]: Entering directory `/sandbox/var/macports/build/_sandbox_trunk_dports_math_libcerf/libcerf/work/libcerf-1.4/lib' |
|---|
| 377 | :info:build make[2]: Nothing to be done for `all'. |
|---|
| 378 | :info:build make[2]: Leaving directory `/sandbox/var/macports/build/_sandbox_trunk_dports_math_libcerf/libcerf/work/libcerf-1.4/lib' |
|---|
| 379 | :info:build Making all in man |
|---|
| 380 | :info:build make[2]: Entering directory `/sandbox/var/macports/build/_sandbox_trunk_dports_math_libcerf/libcerf/work/libcerf-1.4/man' |
|---|
| 381 | :info:build pod2man -s 3 -c "libcerf manual" cerf.pod > cerf.3 |
|---|
| 382 | :info:build pod2man -s 3 -c "libcerf manual" cerf.pod > cerfc.3 |
|---|
| 383 | :info:build /bin/sh: /usr/bin/pod2man: Permission denied |
|---|
| 384 | :info:build make[2]: *** [cerfc.3] Error 126 |
|---|
| 385 | :info:build make[2]: *** Waiting for unfinished jobs.... |
|---|
| 386 | :info:build /bin/sh: /usr/bin/pod2man: Permission denied |
|---|
| 387 | :info:build make[2]: *** [cerf.3] Error 126 |
|---|
| 388 | :info:build make[2]: Leaving directory `/sandbox/var/macports/build/_sandbox_trunk_dports_math_libcerf/libcerf/work/libcerf-1.4/man' |
|---|
| 389 | :info:build make[1]: *** [all-recursive] Error 1 |
|---|
| 390 | :info:build make[1]: Leaving directory `/sandbox/var/macports/build/_sandbox_trunk_dports_math_libcerf/libcerf/work/libcerf-1.4' |
|---|
| 391 | :info:build make: *** [all] Error 2 |
|---|
| 392 | :info:build make: Leaving directory `/sandbox/var/macports/build/_sandbox_trunk_dports_math_libcerf/libcerf/work/libcerf-1.4' |
|---|
| 393 | :info:build Command failed: cd "/sandbox/var/macports/build/_sandbox_trunk_dports_math_libcerf/libcerf/work/libcerf-1.4" && /usr/bin/make -j2 -w all |
|---|
| 394 | :info:build Exit code: 2 |
|---|
| 395 | :error:build Failed to build libcerf: command execution failed |
|---|
| 396 | :debug:build Error code: CHILDSTATUS 99743 2 |
|---|
| 397 | :debug:build Backtrace: command execution failed |
|---|
| 398 | :debug:build while executing |
|---|
| 399 | :debug:build "system {*}$notty {*}$nice $fullcmdstring" |
|---|
| 400 | :debug:build invoked from within |
|---|
| 401 | :debug:build "command_exec build" |
|---|
| 402 | :debug:build (procedure "portbuild::build_main" line 8) |
|---|
| 403 | :debug:build invoked from within |
|---|
| 404 | :debug:build "$procedure $targetname" |
|---|
| 405 | :error:build See /sandbox/var/macports/logs/_sandbox_trunk_dports_math_libcerf/libcerf/main.log for details. |
|---|
| 406 | version:1 |
|---|
| 407 | :debug:main libcerf has no conflicts |
|---|
| 408 | :debug:main Executing org.macports.main (libcerf) |
|---|
| 409 | :debug:main dropping privileges: euid changed to 506, egid changed to 503. |
|---|
| 410 | :debug:main Skipping completed org.macports.archivefetch (libcerf) |
|---|
| 411 | :debug:main Privilege de-escalation not attempted as not running as root. |
|---|
| 412 | :debug:main Skipping completed org.macports.fetch (libcerf) |
|---|
| 413 | :debug:main Privilege de-escalation not attempted as not running as root. |
|---|
| 414 | :debug:main Skipping completed org.macports.checksum (libcerf) |
|---|
| 415 | :debug:main Privilege de-escalation not attempted as not running as root. |
|---|
| 416 | :debug:main Skipping completed org.macports.extract (libcerf) |
|---|
| 417 | :debug:main Privilege de-escalation not attempted as not running as root. |
|---|
| 418 | :debug:main Skipping completed org.macports.patch (libcerf) |
|---|
| 419 | :debug:main Privilege de-escalation not attempted as not running as root. |
|---|
| 420 | :debug:main Skipping completed org.macports.configure (libcerf) |
|---|
| 421 | :debug:main Privilege de-escalation not attempted as not running as root. |
|---|
| 422 | :debug:build build phase started at Fri May 27 19:45:34 EDT 2016 |
|---|
| 423 | :notice:build ---> Building libcerf |
|---|
| 424 | :debug:build Executing org.macports.build (libcerf) |
|---|
| 425 | :debug:build Environment: |
|---|
| 426 | :debug:build CC_PRINT_OPTIONS='YES' |
|---|
| 427 | :debug:build CC_PRINT_OPTIONS_FILE='/sandbox/var/macports/build/_sandbox_trunk_dports_math_libcerf/libcerf/work/.CC_PRINT_OPTIONS' |
|---|
| 428 | :debug:build CPATH='/sandbox/include' |
|---|
| 429 | :debug:build LIBRARY_PATH='/sandbox/lib' |
|---|
| 430 | :debug:build MACOSX_DEPLOYMENT_TARGET='10.6' |
|---|
| 431 | :info:build Executing: cd "/sandbox/var/macports/build/_sandbox_trunk_dports_math_libcerf/libcerf/work/libcerf-1.4" && /usr/bin/make -j2 -w all |
|---|
| 432 | :debug:build system: cd "/sandbox/var/macports/build/_sandbox_trunk_dports_math_libcerf/libcerf/work/libcerf-1.4" && /usr/bin/make -j2 -w all |
|---|
| 433 | :info:build make: Entering directory `/sandbox/var/macports/build/_sandbox_trunk_dports_math_libcerf/libcerf/work/libcerf-1.4' |
|---|
| 434 | :info:build /usr/bin/make all-recursive |
|---|
| 435 | :info:build make[1]: Entering directory `/sandbox/var/macports/build/_sandbox_trunk_dports_math_libcerf/libcerf/work/libcerf-1.4' |
|---|
| 436 | :info:build Making all in lib |
|---|
| 437 | :info:build make[2]: Entering directory `/sandbox/var/macports/build/_sandbox_trunk_dports_math_libcerf/libcerf/work/libcerf-1.4/lib' |
|---|
| 438 | :info:build make[2]: Nothing to be done for `all'. |
|---|
| 439 | :info:build make[2]: Leaving directory `/sandbox/var/macports/build/_sandbox_trunk_dports_math_libcerf/libcerf/work/libcerf-1.4/lib' |
|---|
| 440 | :info:build Making all in man |
|---|
| 441 | :info:build make[2]: Entering directory `/sandbox/var/macports/build/_sandbox_trunk_dports_math_libcerf/libcerf/work/libcerf-1.4/man' |
|---|
| 442 | :info:build pod2man -s 3 -c "libcerf manual" erfcx.pod > erfcx.3 |
|---|
| 443 | :info:build pod2man -s 3 -c "libcerf manual" erfcx.pod > cerfcx.3 |
|---|
| 444 | :info:build /bin/sh: /usr/bin/pod2man: Permission denied |
|---|
| 445 | :info:build make[2]: *** [erfcx.3] Error 126 |
|---|
| 446 | :info:build make[2]: *** Waiting for unfinished jobs.... |
|---|
| 447 | :info:build /bin/sh: /usr/bin/pod2man: Permission denied |
|---|
| 448 | :info:build make[2]: *** [cerfcx.3] Error 126 |
|---|
| 449 | :info:build make[2]: Leaving directory `/sandbox/var/macports/build/_sandbox_trunk_dports_math_libcerf/libcerf/work/libcerf-1.4/man' |
|---|
| 450 | :info:build make[1]: *** [all-recursive] Error 1 |
|---|
| 451 | :info:build make[1]: Leaving directory `/sandbox/var/macports/build/_sandbox_trunk_dports_math_libcerf/libcerf/work/libcerf-1.4' |
|---|
| 452 | :info:build make: *** [all] Error 2 |
|---|
| 453 | :info:build make: Leaving directory `/sandbox/var/macports/build/_sandbox_trunk_dports_math_libcerf/libcerf/work/libcerf-1.4' |
|---|
| 454 | :info:build Command failed: cd "/sandbox/var/macports/build/_sandbox_trunk_dports_math_libcerf/libcerf/work/libcerf-1.4" && /usr/bin/make -j2 -w all |
|---|
| 455 | :info:build Exit code: 2 |
|---|
| 456 | :error:build Failed to build libcerf: command execution failed |
|---|
| 457 | :debug:build Error code: CHILDSTATUS 99779 2 |
|---|
| 458 | :debug:build Backtrace: command execution failed |
|---|
| 459 | :debug:build while executing |
|---|
| 460 | :debug:build "system {*}$notty {*}$nice $fullcmdstring" |
|---|
| 461 | :debug:build invoked from within |
|---|
| 462 | :debug:build "command_exec build" |
|---|
| 463 | :debug:build (procedure "portbuild::build_main" line 8) |
|---|
| 464 | :debug:build invoked from within |
|---|
| 465 | :debug:build "$procedure $targetname" |
|---|
| 466 | :error:build See /sandbox/var/macports/logs/_sandbox_trunk_dports_math_libcerf/libcerf/main.log for details. |
|---|
| 467 | version:1 |
|---|
| 468 | :debug:main libcerf has no conflicts |
|---|
| 469 | :debug:main Executing org.macports.main (libcerf) |
|---|
| 470 | :debug:main dropping privileges: euid changed to 506, egid changed to 503. |
|---|
| 471 | :debug:main Skipping completed org.macports.archivefetch (libcerf) |
|---|
| 472 | :debug:main Privilege de-escalation not attempted as not running as root. |
|---|
| 473 | :debug:main Skipping completed org.macports.fetch (libcerf) |
|---|
| 474 | :debug:main Privilege de-escalation not attempted as not running as root. |
|---|
| 475 | :debug:main Skipping completed org.macports.checksum (libcerf) |
|---|
| 476 | :debug:main Privilege de-escalation not attempted as not running as root. |
|---|
| 477 | :debug:main Skipping completed org.macports.extract (libcerf) |
|---|
| 478 | :debug:main Privilege de-escalation not attempted as not running as root. |
|---|
| 479 | :debug:main Skipping completed org.macports.patch (libcerf) |
|---|
| 480 | :debug:main Privilege de-escalation not attempted as not running as root. |
|---|
| 481 | :debug:main Skipping completed org.macports.configure (libcerf) |
|---|
| 482 | :debug:main Privilege de-escalation not attempted as not running as root. |
|---|
| 483 | :debug:build build phase started at Fri May 27 19:50:12 EDT 2016 |
|---|
| 484 | :notice:build ---> Building libcerf |
|---|
| 485 | :debug:build Executing org.macports.build (libcerf) |
|---|
| 486 | :debug:build Environment: |
|---|
| 487 | :debug:build CC_PRINT_OPTIONS='YES' |
|---|
| 488 | :debug:build CC_PRINT_OPTIONS_FILE='/sandbox/var/macports/build/_sandbox_trunk_dports_math_libcerf/libcerf/work/.CC_PRINT_OPTIONS' |
|---|
| 489 | :debug:build CPATH='/sandbox/include' |
|---|
| 490 | :debug:build LIBRARY_PATH='/sandbox/lib' |
|---|
| 491 | :debug:build MACOSX_DEPLOYMENT_TARGET='10.6' |
|---|
| 492 | :info:build Executing: cd "/sandbox/var/macports/build/_sandbox_trunk_dports_math_libcerf/libcerf/work/libcerf-1.4" && /usr/bin/make -j2 -w all |
|---|
| 493 | :debug:build system: cd "/sandbox/var/macports/build/_sandbox_trunk_dports_math_libcerf/libcerf/work/libcerf-1.4" && /usr/bin/make -j2 -w all |
|---|
| 494 | :info:build make: Entering directory `/sandbox/var/macports/build/_sandbox_trunk_dports_math_libcerf/libcerf/work/libcerf-1.4' |
|---|
| 495 | :info:build /usr/bin/make all-recursive |
|---|
| 496 | :info:build make[1]: Entering directory `/sandbox/var/macports/build/_sandbox_trunk_dports_math_libcerf/libcerf/work/libcerf-1.4' |
|---|
| 497 | :info:build Making all in lib |
|---|
| 498 | :info:build make[2]: Entering directory `/sandbox/var/macports/build/_sandbox_trunk_dports_math_libcerf/libcerf/work/libcerf-1.4/lib' |
|---|
| 499 | :info:build make[2]: Nothing to be done for `all'. |
|---|
| 500 | :info:build make[2]: Leaving directory `/sandbox/var/macports/build/_sandbox_trunk_dports_math_libcerf/libcerf/work/libcerf-1.4/lib' |
|---|
| 501 | :info:build Making all in man |
|---|
| 502 | :info:build make[2]: Entering directory `/sandbox/var/macports/build/_sandbox_trunk_dports_math_libcerf/libcerf/work/libcerf-1.4/man' |
|---|
| 503 | :info:build pod2man -s 3 -c "libcerf manual" erfi.pod > erfi.3 |
|---|
| 504 | :info:build pod2man -s 3 -c "libcerf manual" erfi.pod > cerfi.3 |
|---|
| 505 | :info:build /bin/sh: /usr/bin/pod2man: Permission denied |
|---|
| 506 | :info:build make[2]: *** [cerfi.3] Error 126 |
|---|
| 507 | :info:build make[2]: *** Waiting for unfinished jobs.... |
|---|
| 508 | :info:build /bin/sh: /usr/bin/pod2man: Permission denied |
|---|
| 509 | :info:build make[2]: *** [erfi.3] Error 126 |
|---|
| 510 | :info:build make[2]: Leaving directory `/sandbox/var/macports/build/_sandbox_trunk_dports_math_libcerf/libcerf/work/libcerf-1.4/man' |
|---|
| 511 | :info:build make[1]: *** [all-recursive] Error 1 |
|---|
| 512 | :info:build make[1]: Leaving directory `/sandbox/var/macports/build/_sandbox_trunk_dports_math_libcerf/libcerf/work/libcerf-1.4' |
|---|
| 513 | :info:build make: *** [all] Error 2 |
|---|
| 514 | :info:build make: Leaving directory `/sandbox/var/macports/build/_sandbox_trunk_dports_math_libcerf/libcerf/work/libcerf-1.4' |
|---|
| 515 | :info:build Command failed: cd "/sandbox/var/macports/build/_sandbox_trunk_dports_math_libcerf/libcerf/work/libcerf-1.4" && /usr/bin/make -j2 -w all |
|---|
| 516 | :info:build Exit code: 2 |
|---|
| 517 | :error:build Failed to build libcerf: command execution failed |
|---|
| 518 | :debug:build Error code: CHILDSTATUS 99836 2 |
|---|
| 519 | :debug:build Backtrace: command execution failed |
|---|
| 520 | :debug:build while executing |
|---|
| 521 | :debug:build "system {*}$notty {*}$nice $fullcmdstring" |
|---|
| 522 | :debug:build invoked from within |
|---|
| 523 | :debug:build "command_exec build" |
|---|
| 524 | :debug:build (procedure "portbuild::build_main" line 8) |
|---|
| 525 | :debug:build invoked from within |
|---|
| 526 | :debug:build "$procedure $targetname" |
|---|
| 527 | :error:build See /sandbox/var/macports/logs/_sandbox_trunk_dports_math_libcerf/libcerf/main.log for details. |
|---|