| 1 | version:1 |
|---|
| 2 | :debug:main epoch: in tree: 0 installed: 0 |
|---|
| 3 | :debug:main xz 5.2.2_0 exists in the ports tree |
|---|
| 4 | :debug:main xz 5.2.2_0 is the latest installed |
|---|
| 5 | :debug:main xz 5.2.2_0 is active |
|---|
| 6 | :debug:main Merging existing variants '' into variants |
|---|
| 7 | :debug:main new fully merged portvariants: |
|---|
| 8 | :debug:main Changing to port directory: /opt/local/var/macports/sources/nue.de.rsync.macports.org/macports/release/tarballs/ports/archivers/xz |
|---|
| 9 | :debug:main OS darwin/9.8.0 (Mac OS X 10.5) arch powerpc |
|---|
| 10 | :debug:main adding the default universal variant |
|---|
| 11 | :debug:main Reading variant descriptions from /opt/local/var/macports/sources/nue.de.rsync.macports.org/macports/release/tarballs/ports/_resources/port1.0/variant_descriptions.conf |
|---|
| 12 | :debug:main Running callback portconfigure::add_automatic_compiler_dependencies |
|---|
| 13 | :debug:main Finished running callback portconfigure::add_automatic_compiler_dependencies |
|---|
| 14 | :debug:main Running callback portbuild::add_automatic_buildsystem_dependencies |
|---|
| 15 | :debug:main Finished running callback portbuild::add_automatic_buildsystem_dependencies |
|---|
| 16 | :debug:main No need to upgrade! xz 5.2.2_0 >= xz 5.2.2_0 |
|---|
| 17 | :debug:main epoch: in tree: 0 installed: 0 |
|---|
| 18 | :debug:main libiconv 1.14_0 exists in the ports tree |
|---|
| 19 | :debug:main libiconv 1.14_0 is the latest installed |
|---|
| 20 | :debug:main libiconv 1.14_0 is active |
|---|
| 21 | :debug:main Merging existing variants '' into variants |
|---|
| 22 | :debug:main new fully merged portvariants: |
|---|
| 23 | :debug:main Changing to port directory: /opt/local/var/macports/sources/nue.de.rsync.macports.org/macports/release/tarballs/ports/textproc/libiconv |
|---|
| 24 | :debug:main OS darwin/9.8.0 (Mac OS X 10.5) arch powerpc |
|---|
| 25 | :debug:main Reading variant descriptions from /opt/local/var/macports/sources/nue.de.rsync.macports.org/macports/release/tarballs/ports/_resources/port1.0/variant_descriptions.conf |
|---|
| 26 | :debug:main Sourcing PortGroup muniversal 1.0 from /opt/local/var/macports/sources/nue.de.rsync.macports.org/macports/release/tarballs/ports/_resources/port1.0/group/muniversal-1.0.tcl |
|---|
| 27 | :debug:main universal variant already exists, so not adding the default one |
|---|
| 28 | :debug:main Running callback portconfigure::add_automatic_compiler_dependencies |
|---|
| 29 | :debug:main Finished running callback portconfigure::add_automatic_compiler_dependencies |
|---|
| 30 | :debug:main Running callback portbuild::add_automatic_buildsystem_dependencies |
|---|
| 31 | :debug:main Finished running callback portbuild::add_automatic_buildsystem_dependencies |
|---|
| 32 | :debug:main No need to upgrade! libiconv 1.14_0 >= libiconv 1.14_0 |
|---|
| 33 | :debug:main epoch: in tree: 2 installed: 2 |
|---|
| 34 | :debug:main gettext 0.19.8.1_0 exists in the ports tree |
|---|
| 35 | :debug:main gettext 0.19.8.1_0 is the latest installed |
|---|
| 36 | :debug:main gettext 0.19.8.1_0 is active |
|---|
| 37 | :debug:main Merging existing variants '' into variants |
|---|
| 38 | :debug:main new fully merged portvariants: |
|---|
| 39 | :debug:main Changing to port directory: /opt/local/var/macports/sources/nue.de.rsync.macports.org/macports/release/tarballs/ports/devel/gettext |
|---|
| 40 | :debug:main OS darwin/9.8.0 (Mac OS X 10.5) arch powerpc |
|---|
| 41 | :debug:main Sourcing PortGroup compiler_blacklist_versions 1.0 from /opt/local/var/macports/sources/nue.de.rsync.macports.org/macports/release/tarballs/ports/_resources/port1.0/group/compiler_blacklist_versions-1.0.tcl |
|---|
| 42 | :debug:main Reading variant descriptions from /opt/local/var/macports/sources/nue.de.rsync.macports.org/macports/release/tarballs/ports/_resources/port1.0/variant_descriptions.conf |
|---|
| 43 | :debug:main Sourcing PortGroup muniversal 1.0 from /opt/local/var/macports/sources/nue.de.rsync.macports.org/macports/release/tarballs/ports/_resources/port1.0/group/muniversal-1.0.tcl |
|---|
| 44 | :debug:main compiler clang blacklisted because it's not installed or it doesn't work |
|---|
| 45 | :debug:main universal variant already exists, so not adding the default one |
|---|
| 46 | :debug:main Running callback portconfigure::add_automatic_compiler_dependencies |
|---|
| 47 | :debug:main Finished running callback portconfigure::add_automatic_compiler_dependencies |
|---|
| 48 | :debug:main Running callback portbuild::add_automatic_buildsystem_dependencies |
|---|
| 49 | :debug:main Finished running callback portbuild::add_automatic_buildsystem_dependencies |
|---|
| 50 | :debug:main No need to upgrade! gettext 0.19.8.1_0 >= gettext 0.19.8.1_0 |
|---|
| 51 | :debug:main epoch: in tree: 0 installed: 0 |
|---|
| 52 | :debug:main expat 2.2.0_0 exists in the ports tree |
|---|
| 53 | :debug:main expat 2.2.0_0 is the latest installed |
|---|
| 54 | :debug:main expat 2.2.0_0 is active |
|---|
| 55 | :debug:main Merging existing variants '' into variants |
|---|
| 56 | :debug:main new fully merged portvariants: |
|---|
| 57 | :debug:main Changing to port directory: /opt/local/var/macports/sources/nue.de.rsync.macports.org/macports/release/tarballs/ports/textproc/expat |
|---|
| 58 | :debug:main OS darwin/9.8.0 (Mac OS X 10.5) arch powerpc |
|---|
| 59 | :debug:main adding the default universal variant |
|---|
| 60 | :debug:main Reading variant descriptions from /opt/local/var/macports/sources/nue.de.rsync.macports.org/macports/release/tarballs/ports/_resources/port1.0/variant_descriptions.conf |
|---|
| 61 | :debug:main Running callback portconfigure::add_automatic_compiler_dependencies |
|---|
| 62 | :debug:main Finished running callback portconfigure::add_automatic_compiler_dependencies |
|---|
| 63 | :debug:main Running callback portbuild::add_automatic_buildsystem_dependencies |
|---|
| 64 | :debug:main Finished running callback portbuild::add_automatic_buildsystem_dependencies |
|---|
| 65 | :debug:main No need to upgrade! expat 2.2.0_0 >= expat 2.2.0_0 |
|---|
| 66 | :debug:main epoch: in tree: 0 installed: 0 |
|---|
| 67 | :debug:main ncurses 6.0_0 exists in the ports tree |
|---|
| 68 | :debug:main ncurses 6.0_0 is the latest installed |
|---|
| 69 | :debug:main ncurses 6.0_0 is active |
|---|
| 70 | :debug:main Merging existing variants '' into variants |
|---|
| 71 | :debug:main new fully merged portvariants: |
|---|
| 72 | :debug:main Changing to port directory: /opt/local/var/macports/sources/nue.de.rsync.macports.org/macports/release/tarballs/ports/devel/ncurses |
|---|
| 73 | :debug:main OS darwin/9.8.0 (Mac OS X 10.5) arch powerpc |
|---|
| 74 | :debug:main adding the default universal variant |
|---|
| 75 | :debug:main Reading variant descriptions from /opt/local/var/macports/sources/nue.de.rsync.macports.org/macports/release/tarballs/ports/_resources/port1.0/variant_descriptions.conf |
|---|
| 76 | :debug:main Running callback portconfigure::add_automatic_compiler_dependencies |
|---|
| 77 | :debug:main Finished running callback portconfigure::add_automatic_compiler_dependencies |
|---|
| 78 | :debug:main Running callback portbuild::add_automatic_buildsystem_dependencies |
|---|
| 79 | :debug:main Finished running callback portbuild::add_automatic_buildsystem_dependencies |
|---|
| 80 | :debug:main No need to upgrade! ncurses 6.0_0 >= ncurses 6.0_0 |
|---|
| 81 | :debug:main epoch: in tree: 0 installed: 0 |
|---|
| 82 | :debug:main pkgconfig 0.29.1_0 exists in the ports tree |
|---|
| 83 | :debug:main pkgconfig 0.29.1_0 is the latest installed |
|---|
| 84 | :debug:main pkgconfig 0.29.1_0 is active |
|---|
| 85 | :debug:main Merging existing variants '' into variants |
|---|
| 86 | :debug:main new fully merged portvariants: |
|---|
| 87 | :debug:main Changing to port directory: /opt/local/var/macports/sources/nue.de.rsync.macports.org/macports/release/tarballs/ports/devel/pkgconfig |
|---|
| 88 | :debug:main OS darwin/9.8.0 (Mac OS X 10.5) arch powerpc |
|---|
| 89 | :debug:main adding the default universal variant |
|---|
| 90 | :debug:main Reading variant descriptions from /opt/local/var/macports/sources/nue.de.rsync.macports.org/macports/release/tarballs/ports/_resources/port1.0/variant_descriptions.conf |
|---|
| 91 | :debug:main Running callback portconfigure::add_automatic_compiler_dependencies |
|---|
| 92 | :debug:main Finished running callback portconfigure::add_automatic_compiler_dependencies |
|---|
| 93 | :debug:main Running callback portbuild::add_automatic_buildsystem_dependencies |
|---|
| 94 | :debug:main Finished running callback portbuild::add_automatic_buildsystem_dependencies |
|---|
| 95 | :debug:main No need to upgrade! pkgconfig 0.29.1_0 >= pkgconfig 0.29.1_0 |
|---|
| 96 | :debug:main epoch: in tree: 1 installed: 1 |
|---|
| 97 | :debug:main clang-3.4 3.4.2_12 exists in the ports tree |
|---|
| 98 | :debug:main clang-3.4 3.4.2_12 +analyzer is the latest installed |
|---|
| 99 | :debug:main clang-3.4 3.4.2_12 +analyzer is active |
|---|
| 100 | :debug:main Merging existing variants '+analyzer' into variants |
|---|
| 101 | :debug:main new fully merged portvariants: analyzer + |
|---|
| 102 | :debug:main Changing to port directory: /opt/local/var/macports/sources/nue.de.rsync.macports.org/macports/release/tarballs/ports/lang/llvm-3.4 |
|---|
| 103 | :debug:main OS darwin/9.8.0 (Mac OS X 10.5) arch powerpc |
|---|
| 104 | :debug:main Sourcing PortGroup select 1.0 from /opt/local/var/macports/sources/nue.de.rsync.macports.org/macports/release/tarballs/ports/_resources/port1.0/group/select-1.0.tcl |
|---|
| 105 | :debug:main Sourcing PortGroup compiler_blacklist_versions 1.0 from /opt/local/var/macports/sources/nue.de.rsync.macports.org/macports/release/tarballs/ports/_resources/port1.0/group/compiler_blacklist_versions-1.0.tcl |
|---|
| 106 | :debug:main compiler gcc-4.2 5577 blacklisted because it matches {gcc-4.2 <= 5577} |
|---|
| 107 | :debug:main compiler clang blacklisted because it's not installed or it doesn't work |
|---|
| 108 | :debug:main Reading variant descriptions from /opt/local/var/macports/sources/nue.de.rsync.macports.org/macports/release/tarballs/ports/_resources/port1.0/variant_descriptions.conf |
|---|
| 109 | :debug:main universal variant already exists, so not adding the default one |
|---|
| 110 | :debug:main Executing variant analyzer provides analyzer |
|---|
| 111 | :debug:main Running callback portconfigure::add_automatic_compiler_dependencies |
|---|
| 112 | :debug:main Chosen compiler apple-gcc-4.2 is provided by a port, adding dependency |
|---|
| 113 | :debug:main Adding depends_build port:apple-gcc42 |
|---|
| 114 | :debug:main Adding depends_skip_archcheck apple-gcc42 |
|---|
| 115 | :debug:main Finished running callback portconfigure::add_automatic_compiler_dependencies |
|---|
| 116 | :debug:main Running callback portbuild::add_automatic_buildsystem_dependencies |
|---|
| 117 | :debug:main Finished running callback portbuild::add_automatic_buildsystem_dependencies |
|---|
| 118 | :debug:main No need to upgrade! clang-3.4 3.4.2_12 >= clang-3.4 3.4.2_12 |
|---|
| 119 | :debug:main epoch: in tree: 0 installed: 0 |
|---|
| 120 | :debug:main libxml2 2.9.4_0 exists in the ports tree |
|---|
| 121 | :debug:main libxml2 2.9.4_0 is the latest installed |
|---|
| 122 | :debug:main libxml2 2.9.4_0 is active |
|---|
| 123 | :debug:main Merging existing variants '' into variants |
|---|
| 124 | :debug:main new fully merged portvariants: |
|---|
| 125 | :debug:main Changing to port directory: /opt/local/var/macports/sources/nue.de.rsync.macports.org/macports/release/tarballs/ports/textproc/libxml2 |
|---|
| 126 | :debug:main OS darwin/9.8.0 (Mac OS X 10.5) arch powerpc |
|---|
| 127 | :debug:main adding the default universal variant |
|---|
| 128 | :debug:main Reading variant descriptions from /opt/local/var/macports/sources/nue.de.rsync.macports.org/macports/release/tarballs/ports/_resources/port1.0/variant_descriptions.conf |
|---|
| 129 | :debug:main Running callback portconfigure::add_automatic_compiler_dependencies |
|---|
| 130 | :debug:main Finished running callback portconfigure::add_automatic_compiler_dependencies |
|---|
| 131 | :debug:main Running callback portbuild::add_automatic_buildsystem_dependencies |
|---|
| 132 | :debug:main Finished running callback portbuild::add_automatic_buildsystem_dependencies |
|---|
| 133 | :debug:main No need to upgrade! libxml2 2.9.4_0 >= libxml2 2.9.4_0 |
|---|
| 134 | :debug:main epoch: in tree: 0 installed: 0 |
|---|
| 135 | :debug:main zlib 1.2.8_0 exists in the ports tree |
|---|
| 136 | :debug:main zlib 1.2.8_0 is the latest installed |
|---|
| 137 | :debug:main zlib 1.2.8_0 is active |
|---|
| 138 | :debug:main Merging existing variants '' into variants |
|---|
| 139 | :debug:main new fully merged portvariants: |
|---|
| 140 | :debug:main Changing to port directory: /opt/local/var/macports/sources/nue.de.rsync.macports.org/macports/release/tarballs/ports/archivers/zlib |
|---|
| 141 | :debug:main OS darwin/9.8.0 (Mac OS X 10.5) arch powerpc |
|---|
| 142 | :debug:main Sourcing PortGroup xcodeversion 1.0 from /opt/local/var/macports/sources/nue.de.rsync.macports.org/macports/release/tarballs/ports/_resources/port1.0/group/xcodeversion-1.0.tcl |
|---|
| 143 | :debug:main adding the default universal variant |
|---|
| 144 | :debug:main Reading variant descriptions from /opt/local/var/macports/sources/nue.de.rsync.macports.org/macports/release/tarballs/ports/_resources/port1.0/variant_descriptions.conf |
|---|
| 145 | :debug:main Running callback portconfigure::add_automatic_compiler_dependencies |
|---|
| 146 | :debug:main Finished running callback portconfigure::add_automatic_compiler_dependencies |
|---|
| 147 | :debug:main Running callback portbuild::add_automatic_buildsystem_dependencies |
|---|
| 148 | :debug:main Finished running callback portbuild::add_automatic_buildsystem_dependencies |
|---|
| 149 | :debug:main No need to upgrade! zlib 1.2.8_0 >= zlib 1.2.8_0 |
|---|
| 150 | :debug:main epoch: in tree: 1 installed: 1 |
|---|
| 151 | :debug:main llvm-3.4 3.4.2_11 exists in the ports tree |
|---|
| 152 | :debug:main llvm-3.4 3.4.2_11 is the latest installed |
|---|
| 153 | :debug:main llvm-3.4 3.4.2_11 is active |
|---|
| 154 | :debug:main Merging existing variants '' into variants |
|---|
| 155 | :debug:main new fully merged portvariants: |
|---|
| 156 | :debug:main Changing to port directory: /opt/local/var/macports/sources/nue.de.rsync.macports.org/macports/release/tarballs/ports/lang/llvm-3.4 |
|---|
| 157 | :debug:main OS darwin/9.8.0 (Mac OS X 10.5) arch powerpc |
|---|
| 158 | :debug:main Sourcing PortGroup select 1.0 from /opt/local/var/macports/sources/nue.de.rsync.macports.org/macports/release/tarballs/ports/_resources/port1.0/group/select-1.0.tcl |
|---|
| 159 | :debug:main Sourcing PortGroup compiler_blacklist_versions 1.0 from /opt/local/var/macports/sources/nue.de.rsync.macports.org/macports/release/tarballs/ports/_resources/port1.0/group/compiler_blacklist_versions-1.0.tcl |
|---|
| 160 | :debug:main compiler gcc-4.2 5577 blacklisted because it matches {gcc-4.2 <= 5577} |
|---|
| 161 | :debug:main compiler clang blacklisted because it's not installed or it doesn't work |
|---|
| 162 | :debug:main Reading variant descriptions from /opt/local/var/macports/sources/nue.de.rsync.macports.org/macports/release/tarballs/ports/_resources/port1.0/variant_descriptions.conf |
|---|
| 163 | :debug:main universal variant already exists, so not adding the default one |
|---|
| 164 | :debug:main Running callback portconfigure::add_automatic_compiler_dependencies |
|---|
| 165 | :debug:main Chosen compiler apple-gcc-4.2 is provided by a port, adding dependency |
|---|
| 166 | :debug:main Adding depends_build port:apple-gcc42 |
|---|
| 167 | :debug:main Adding depends_skip_archcheck apple-gcc42 |
|---|
| 168 | :debug:main Finished running callback portconfigure::add_automatic_compiler_dependencies |
|---|
| 169 | :debug:main Running callback portbuild::add_automatic_buildsystem_dependencies |
|---|
| 170 | :debug:main Finished running callback portbuild::add_automatic_buildsystem_dependencies |
|---|
| 171 | :debug:main No need to upgrade! llvm-3.4 3.4.2_11 >= llvm-3.4 3.4.2_11 |
|---|
| 172 | :debug:main epoch: in tree: 0 installed: 0 |
|---|
| 173 | :debug:main libffi 3.2.1_0 exists in the ports tree |
|---|
| 174 | :debug:main libffi 3.2.1_0 is the latest installed |
|---|
| 175 | :debug:main libffi 3.2.1_0 is active |
|---|
| 176 | :debug:main Merging existing variants '' into variants |
|---|
| 177 | :debug:main new fully merged portvariants: |
|---|
| 178 | :debug:main Changing to port directory: /opt/local/var/macports/sources/nue.de.rsync.macports.org/macports/release/tarballs/ports/devel/libffi |
|---|
| 179 | :debug:main OS darwin/9.8.0 (Mac OS X 10.5) arch powerpc |
|---|
| 180 | :debug:main Reading variant descriptions from /opt/local/var/macports/sources/nue.de.rsync.macports.org/macports/release/tarballs/ports/_resources/port1.0/variant_descriptions.conf |
|---|
| 181 | :debug:main Sourcing PortGroup muniversal 1.0 from /opt/local/var/macports/sources/nue.de.rsync.macports.org/macports/release/tarballs/ports/_resources/port1.0/group/muniversal-1.0.tcl |
|---|
| 182 | :debug:main universal variant already exists, so not adding the default one |
|---|
| 183 | :debug:main Running callback portconfigure::add_automatic_compiler_dependencies |
|---|
| 184 | :debug:main Finished running callback portconfigure::add_automatic_compiler_dependencies |
|---|
| 185 | :debug:main Running callback portbuild::add_automatic_buildsystem_dependencies |
|---|
| 186 | :debug:main Finished running callback portbuild::add_automatic_buildsystem_dependencies |
|---|
| 187 | :debug:main No need to upgrade! libffi 3.2.1_0 >= libffi 3.2.1_0 |
|---|
| 188 | :debug:main epoch: in tree: 0 installed: 0 |
|---|
| 189 | :debug:main perl5 5.24.0_0 exists in the ports tree |
|---|
| 190 | :debug:main perl5 5.24.0_0 +perl5_24 is the latest installed |
|---|
| 191 | :debug:main perl5 5.24.0_0 +perl5_24 is active |
|---|
| 192 | :debug:main Merging existing variants '+perl5_24' into variants |
|---|
| 193 | :debug:main new fully merged portvariants: perl5_24 + |
|---|
| 194 | :debug:main Changing to port directory: /opt/local/var/macports/sources/nue.de.rsync.macports.org/macports/release/tarballs/ports/lang/perl5 |
|---|
| 195 | :debug:main OS darwin/9.8.0 (Mac OS X 10.5) arch powerpc |
|---|
| 196 | :debug:main Re-registering default for configure.universal_args |
|---|
| 197 | :debug:main Sourcing PortGroup perl5 1.0 from /opt/local/var/macports/sources/nue.de.rsync.macports.org/macports/release/tarballs/ports/_resources/port1.0/group/perl5-1.0.tcl |
|---|
| 198 | :debug:main universal_variant is false, so not adding the default universal variant |
|---|
| 199 | :debug:main Executing variant perl5_24 provides perl5_24 |
|---|
| 200 | :debug:main Running callback portconfigure::add_automatic_compiler_dependencies |
|---|
| 201 | :debug:main Finished running callback portconfigure::add_automatic_compiler_dependencies |
|---|
| 202 | :debug:main Running callback portbuild::add_automatic_buildsystem_dependencies |
|---|
| 203 | :debug:main Finished running callback portbuild::add_automatic_buildsystem_dependencies |
|---|
| 204 | :debug:main No need to upgrade! perl5 5.24.0_0 >= perl5 5.24.0_0 |
|---|
| 205 | :debug:main epoch: in tree: 0 installed: 0 |
|---|
| 206 | :debug:main perl5.24 5.24.0_0 exists in the ports tree |
|---|
| 207 | :debug:main perl5.24 5.24.0_0 is the latest installed |
|---|
| 208 | :debug:main perl5.24 5.24.0_0 is active |
|---|
| 209 | :debug:main Merging existing variants '' into variants |
|---|
| 210 | :debug:main new fully merged portvariants: |
|---|
| 211 | :debug:main Changing to port directory: /opt/local/var/macports/sources/nue.de.rsync.macports.org/macports/release/tarballs/ports/lang/perl5 |
|---|
| 212 | :debug:main OS darwin/9.8.0 (Mac OS X 10.5) arch powerpc |
|---|
| 213 | :debug:main Re-registering default for configure.universal_args |
|---|
| 214 | :debug:main Sourcing PortGroup perl5 1.0 from /opt/local/var/macports/sources/nue.de.rsync.macports.org/macports/release/tarballs/ports/_resources/port1.0/group/perl5-1.0.tcl |
|---|
| 215 | :debug:main adding the default universal variant |
|---|
| 216 | :debug:main Reading variant descriptions from /opt/local/var/macports/sources/nue.de.rsync.macports.org/macports/release/tarballs/ports/_resources/port1.0/variant_descriptions.conf |
|---|
| 217 | :debug:main Running callback portconfigure::add_automatic_compiler_dependencies |
|---|
| 218 | :debug:main Finished running callback portconfigure::add_automatic_compiler_dependencies |
|---|
| 219 | :debug:main Running callback portbuild::add_automatic_buildsystem_dependencies |
|---|
| 220 | :debug:main Finished running callback portbuild::add_automatic_buildsystem_dependencies |
|---|
| 221 | :debug:main No need to upgrade! perl5.24 5.24.0_0 >= perl5.24 5.24.0_0 |
|---|
| 222 | :debug:main epoch: in tree: 0 installed: 0 |
|---|
| 223 | :debug:main gdbm 1.12_0 exists in the ports tree |
|---|
| 224 | :debug:main gdbm 1.12_0 is the latest installed |
|---|
| 225 | :debug:main gdbm 1.12_0 is active |
|---|
| 226 | :debug:main Merging existing variants '' into variants |
|---|
| 227 | :debug:main new fully merged portvariants: |
|---|
| 228 | :debug:main Changing to port directory: /opt/local/var/macports/sources/nue.de.rsync.macports.org/macports/release/tarballs/ports/databases/gdbm |
|---|
| 229 | :debug:main OS darwin/9.8.0 (Mac OS X 10.5) arch powerpc |
|---|
| 230 | :debug:main adding the default universal variant |
|---|
| 231 | :debug:main Reading variant descriptions from /opt/local/var/macports/sources/nue.de.rsync.macports.org/macports/release/tarballs/ports/_resources/port1.0/variant_descriptions.conf |
|---|
| 232 | :debug:main Running callback portconfigure::add_automatic_compiler_dependencies |
|---|
| 233 | :debug:main Finished running callback portconfigure::add_automatic_compiler_dependencies |
|---|
| 234 | :debug:main Running callback portbuild::add_automatic_buildsystem_dependencies |
|---|
| 235 | :debug:main Finished running callback portbuild::add_automatic_buildsystem_dependencies |
|---|
| 236 | :debug:main No need to upgrade! gdbm 1.12_0 >= gdbm 1.12_0 |
|---|
| 237 | :debug:main epoch: in tree: 0 installed: 0 |
|---|
| 238 | :debug:main llvm_select 2_0 exists in the ports tree |
|---|
| 239 | :debug:main llvm_select 2_0 is the latest installed |
|---|
| 240 | :debug:main llvm_select 2_0 is active |
|---|
| 241 | :debug:main Merging existing variants '' into variants |
|---|
| 242 | :debug:main new fully merged portvariants: |
|---|
| 243 | :debug:main Changing to port directory: /opt/local/var/macports/sources/nue.de.rsync.macports.org/macports/release/tarballs/ports/sysutils/llvm_select |
|---|
| 244 | :debug:main OS darwin/9.8.0 (Mac OS X 10.5) arch powerpc |
|---|
| 245 | :debug:main Sourcing PortGroup select 1.0 from /opt/local/var/macports/sources/nue.de.rsync.macports.org/macports/release/tarballs/ports/_resources/port1.0/group/select-1.0.tcl |
|---|
| 246 | :debug:main universal_variant is false, so not adding the default universal variant |
|---|
| 247 | :debug:main Running callback portconfigure::add_automatic_compiler_dependencies |
|---|
| 248 | :debug:main Finished running callback portconfigure::add_automatic_compiler_dependencies |
|---|
| 249 | :debug:main Running callback portbuild::add_automatic_buildsystem_dependencies |
|---|
| 250 | :debug:main Finished running callback portbuild::add_automatic_buildsystem_dependencies |
|---|
| 251 | :debug:main No need to upgrade! llvm_select 2_0 >= llvm_select 2_0 |
|---|
| 252 | :debug:main epoch: in tree: 2 installed: 2 |
|---|
| 253 | :debug:main python27 2.7.13_0 exists in the ports tree |
|---|
| 254 | :debug:main python27 2.7.13_0 +ucs4 is the latest installed |
|---|
| 255 | :debug:main python27 2.7.13_0 +ucs4 is active |
|---|
| 256 | :debug:main Merging existing variants '+ucs4' into variants |
|---|
| 257 | :debug:main new fully merged portvariants: ucs4 + |
|---|
| 258 | :debug:main Changing to port directory: /opt/local/var/macports/sources/nue.de.rsync.macports.org/macports/release/tarballs/ports/lang/python27 |
|---|
| 259 | :debug:main OS darwin/9.8.0 (Mac OS X 10.5) arch powerpc |
|---|
| 260 | :debug:main Sourcing PortGroup select 1.0 from /opt/local/var/macports/sources/nue.de.rsync.macports.org/macports/release/tarballs/ports/_resources/port1.0/group/select-1.0.tcl |
|---|
| 261 | :debug:main Reading variant descriptions from /opt/local/var/macports/sources/nue.de.rsync.macports.org/macports/release/tarballs/ports/_resources/port1.0/variant_descriptions.conf |
|---|
| 262 | :debug:main universal variant already exists, so not adding the default one |
|---|
| 263 | :debug:main Executing variant ucs4 provides ucs4 |
|---|
| 264 | :debug:main Running callback portconfigure::add_automatic_compiler_dependencies |
|---|
| 265 | :debug:main Finished running callback portconfigure::add_automatic_compiler_dependencies |
|---|
| 266 | :debug:main Running callback portbuild::add_automatic_buildsystem_dependencies |
|---|
| 267 | :debug:main Finished running callback portbuild::add_automatic_buildsystem_dependencies |
|---|
| 268 | :debug:main No need to upgrade! python27 2.7.13_0 >= python27 2.7.13_0 |
|---|
| 269 | :debug:main epoch: in tree: 1 installed: 1 |
|---|
| 270 | :debug:main openssl 1.0.2j_0 exists in the ports tree |
|---|
| 271 | :debug:main openssl 1.0.2j_0 is the latest installed |
|---|
| 272 | :debug:main openssl 1.0.2j_0 is active |
|---|
| 273 | :debug:main Merging existing variants '' into variants |
|---|
| 274 | :debug:main new fully merged portvariants: |
|---|
| 275 | :debug:main Changing to port directory: /opt/local/var/macports/sources/nue.de.rsync.macports.org/macports/release/tarballs/ports/devel/openssl |
|---|
| 276 | :debug:main OS darwin/9.8.0 (Mac OS X 10.5) arch powerpc |
|---|
| 277 | :debug:main Reading variant descriptions from /opt/local/var/macports/sources/nue.de.rsync.macports.org/macports/release/tarballs/ports/_resources/port1.0/variant_descriptions.conf |
|---|
| 278 | :debug:main Sourcing PortGroup muniversal 1.0 from /opt/local/var/macports/sources/nue.de.rsync.macports.org/macports/release/tarballs/ports/_resources/port1.0/group/muniversal-1.0.tcl |
|---|
| 279 | :debug:main universal variant already exists, so not adding the default one |
|---|
| 280 | :debug:main Running callback portconfigure::add_automatic_compiler_dependencies |
|---|
| 281 | :debug:main Finished running callback portconfigure::add_automatic_compiler_dependencies |
|---|
| 282 | :debug:main Running callback portbuild::add_automatic_buildsystem_dependencies |
|---|
| 283 | :debug:main Finished running callback portbuild::add_automatic_buildsystem_dependencies |
|---|
| 284 | :debug:main No need to upgrade! openssl 1.0.2j_0 >= openssl 1.0.2j_0 |
|---|
| 285 | :debug:main epoch: in tree: 0 installed: 0 |
|---|
| 286 | :debug:main sqlite3 3.15.2_2 exists in the ports tree |
|---|
| 287 | :debug:main sqlite3 3.15.2_2 is the latest installed |
|---|
| 288 | :debug:main sqlite3 3.15.2_2 is active |
|---|
| 289 | :debug:main Merging existing variants '' into variants |
|---|
| 290 | :debug:main new fully merged portvariants: |
|---|
| 291 | :debug:main Changing to port directory: /opt/local/var/macports/sources/nue.de.rsync.macports.org/macports/release/tarballs/ports/databases/sqlite3 |
|---|
| 292 | :debug:main OS darwin/9.8.0 (Mac OS X 10.5) arch powerpc |
|---|
| 293 | :debug:main adding the default universal variant |
|---|
| 294 | :debug:main Reading variant descriptions from /opt/local/var/macports/sources/nue.de.rsync.macports.org/macports/release/tarballs/ports/_resources/port1.0/variant_descriptions.conf |
|---|
| 295 | :debug:main Running callback portconfigure::add_automatic_compiler_dependencies |
|---|
| 296 | :debug:main Finished running callback portconfigure::add_automatic_compiler_dependencies |
|---|
| 297 | :debug:main Running callback portbuild::add_automatic_buildsystem_dependencies |
|---|
| 298 | :debug:main Finished running callback portbuild::add_automatic_buildsystem_dependencies |
|---|
| 299 | :debug:main No need to upgrade! sqlite3 3.15.2_2 >= sqlite3 3.15.2_2 |
|---|
| 300 | :debug:main epoch: in tree: 20090923 installed: 20090923 |
|---|
| 301 | :debug:main libedit 20160903-3.1_1 exists in the ports tree |
|---|
| 302 | :debug:main libedit 20160903-3.1_1 is the latest installed |
|---|
| 303 | :debug:main libedit 20160903-3.1_1 is active |
|---|
| 304 | :debug:main Merging existing variants '' into variants |
|---|
| 305 | :debug:main new fully merged portvariants: |
|---|
| 306 | :debug:main Changing to port directory: /opt/local/var/macports/sources/nue.de.rsync.macports.org/macports/release/tarballs/ports/devel/libedit |
|---|
| 307 | :debug:main OS darwin/9.8.0 (Mac OS X 10.5) arch powerpc |
|---|
| 308 | :debug:main Reading variant descriptions from /opt/local/var/macports/sources/nue.de.rsync.macports.org/macports/release/tarballs/ports/_resources/port1.0/variant_descriptions.conf |
|---|
| 309 | :debug:main Sourcing PortGroup muniversal 1.0 from /opt/local/var/macports/sources/nue.de.rsync.macports.org/macports/release/tarballs/ports/_resources/port1.0/group/muniversal-1.0.tcl |
|---|
| 310 | :debug:main universal variant already exists, so not adding the default one |
|---|
| 311 | :debug:main Running callback portconfigure::add_automatic_compiler_dependencies |
|---|
| 312 | :debug:main Finished running callback portconfigure::add_automatic_compiler_dependencies |
|---|
| 313 | :debug:main Running callback portbuild::add_automatic_buildsystem_dependencies |
|---|
| 314 | :debug:main Finished running callback portbuild::add_automatic_buildsystem_dependencies |
|---|
| 315 | :debug:main No need to upgrade! libedit 20160903-3.1_1 >= libedit 20160903-3.1_1 |
|---|
| 316 | :debug:main epoch: in tree: 0 installed: 0 |
|---|
| 317 | :debug:main db48 4.8.30_4 exists in the ports tree |
|---|
| 318 | :debug:main db48 4.8.30_4 +java is the latest installed |
|---|
| 319 | :debug:main db48 4.8.30_4 +java is active |
|---|
| 320 | :debug:main Merging existing variants '+java' into variants |
|---|
| 321 | :debug:main new fully merged portvariants: java + |
|---|
| 322 | :debug:main Changing to port directory: /opt/local/var/macports/sources/nue.de.rsync.macports.org/macports/release/tarballs/ports/databases/db48 |
|---|
| 323 | :debug:main OS darwin/9.8.0 (Mac OS X 10.5) arch powerpc |
|---|
| 324 | :debug:main Reading variant descriptions from /opt/local/var/macports/sources/nue.de.rsync.macports.org/macports/release/tarballs/ports/_resources/port1.0/variant_descriptions.conf |
|---|
| 325 | :debug:main Sourcing PortGroup muniversal 1.0 from /opt/local/var/macports/sources/nue.de.rsync.macports.org/macports/release/tarballs/ports/_resources/port1.0/group/muniversal-1.0.tcl |
|---|
| 326 | :debug:main universal variant already exists, so not adding the default one |
|---|
| 327 | :debug:main Executing variant java provides java |
|---|
| 328 | :debug:main Running callback portconfigure::add_automatic_compiler_dependencies |
|---|
| 329 | :debug:main Finished running callback portconfigure::add_automatic_compiler_dependencies |
|---|
| 330 | :debug:main Running callback portbuild::add_automatic_buildsystem_dependencies |
|---|
| 331 | :debug:main Finished running callback portbuild::add_automatic_buildsystem_dependencies |
|---|
| 332 | :debug:main No need to upgrade! db48 4.8.30_4 >= db48 4.8.30_4 |
|---|
| 333 | :debug:main epoch: in tree: 0 installed: 0 |
|---|
| 334 | :debug:main bzip2 1.0.6_0 exists in the ports tree |
|---|
| 335 | :debug:main bzip2 1.0.6_0 is the latest installed |
|---|
| 336 | :debug:main bzip2 1.0.6_0 is active |
|---|
| 337 | :debug:main Merging existing variants '' into variants |
|---|
| 338 | :debug:main new fully merged portvariants: |
|---|
| 339 | :debug:main Changing to port directory: /opt/local/var/macports/sources/nue.de.rsync.macports.org/macports/release/tarballs/ports/archivers/bzip2 |
|---|
| 340 | :debug:main OS darwin/9.8.0 (Mac OS X 10.5) arch powerpc |
|---|
| 341 | :debug:main Reading variant descriptions from /opt/local/var/macports/sources/nue.de.rsync.macports.org/macports/release/tarballs/ports/_resources/port1.0/variant_descriptions.conf |
|---|
| 342 | :debug:main universal variant already exists, so not adding the default one |
|---|
| 343 | :debug:main Running callback portconfigure::add_automatic_compiler_dependencies |
|---|
| 344 | :debug:main Finished running callback portconfigure::add_automatic_compiler_dependencies |
|---|
| 345 | :debug:main Running callback portbuild::add_automatic_buildsystem_dependencies |
|---|
| 346 | :debug:main Finished running callback portbuild::add_automatic_buildsystem_dependencies |
|---|
| 347 | :debug:main No need to upgrade! bzip2 1.0.6_0 >= bzip2 1.0.6_0 |
|---|
| 348 | :debug:main epoch: in tree: 0 installed: 0 |
|---|
| 349 | :debug:main python_select 0.3_7 exists in the ports tree |
|---|
| 350 | :debug:main python_select 0.3_7 is the latest installed |
|---|
| 351 | :debug:main python_select 0.3_7 is active |
|---|
| 352 | :debug:main Merging existing variants '' into variants |
|---|
| 353 | :debug:main new fully merged portvariants: |
|---|
| 354 | :debug:main Changing to port directory: /opt/local/var/macports/sources/nue.de.rsync.macports.org/macports/release/tarballs/ports/sysutils/python_select |
|---|
| 355 | :debug:main OS darwin/9.8.0 (Mac OS X 10.5) arch powerpc |
|---|
| 356 | :debug:main Sourcing PortGroup select 1.0 from /opt/local/var/macports/sources/nue.de.rsync.macports.org/macports/release/tarballs/ports/_resources/port1.0/group/select-1.0.tcl |
|---|
| 357 | :debug:main universal_variant is false, so not adding the default universal variant |
|---|
| 358 | :debug:main Running callback portconfigure::add_automatic_compiler_dependencies |
|---|
| 359 | :debug:main Finished running callback portconfigure::add_automatic_compiler_dependencies |
|---|
| 360 | :debug:main Running callback portbuild::add_automatic_buildsystem_dependencies |
|---|
| 361 | :debug:main Finished running callback portbuild::add_automatic_buildsystem_dependencies |
|---|
| 362 | :debug:main No need to upgrade! python_select 0.3_7 >= python_select 0.3_7 |
|---|
| 363 | :debug:main epoch: in tree: 0 installed: 0 |
|---|
| 364 | :debug:main python2_select 0.0_2 exists in the ports tree |
|---|
| 365 | :debug:main python2_select 0.0_2 is the latest installed |
|---|
| 366 | :debug:main python2_select 0.0_2 is active |
|---|
| 367 | :debug:main Merging existing variants '' into variants |
|---|
| 368 | :debug:main new fully merged portvariants: |
|---|
| 369 | :debug:main Changing to port directory: /opt/local/var/macports/sources/nue.de.rsync.macports.org/macports/release/tarballs/ports/sysutils/python2_select |
|---|
| 370 | :debug:main OS darwin/9.8.0 (Mac OS X 10.5) arch powerpc |
|---|
| 371 | :debug:main Sourcing PortGroup select 1.0 from /opt/local/var/macports/sources/nue.de.rsync.macports.org/macports/release/tarballs/ports/_resources/port1.0/group/select-1.0.tcl |
|---|
| 372 | :debug:main universal_variant is false, so not adding the default universal variant |
|---|
| 373 | :debug:main Running callback portconfigure::add_automatic_compiler_dependencies |
|---|
| 374 | :debug:main Finished running callback portconfigure::add_automatic_compiler_dependencies |
|---|
| 375 | :debug:main Running callback portbuild::add_automatic_buildsystem_dependencies |
|---|
| 376 | :debug:main Finished running callback portbuild::add_automatic_buildsystem_dependencies |
|---|
| 377 | :debug:main No need to upgrade! python2_select 0.0_2 >= python2_select 0.0_2 |
|---|
| 378 | :debug:main epoch: in tree: 0 installed: 0 |
|---|
| 379 | :debug:main clang_select 2_0 exists in the ports tree |
|---|
| 380 | :debug:main clang_select 2_0 is the latest installed |
|---|
| 381 | :debug:main clang_select 2_0 is active |
|---|
| 382 | :debug:main Merging existing variants '' into variants |
|---|
| 383 | :debug:main new fully merged portvariants: |
|---|
| 384 | :debug:main Changing to port directory: /opt/local/var/macports/sources/nue.de.rsync.macports.org/macports/release/tarballs/ports/sysutils/clang_select |
|---|
| 385 | :debug:main OS darwin/9.8.0 (Mac OS X 10.5) arch powerpc |
|---|
| 386 | :debug:main Sourcing PortGroup select 1.0 from /opt/local/var/macports/sources/nue.de.rsync.macports.org/macports/release/tarballs/ports/_resources/port1.0/group/select-1.0.tcl |
|---|
| 387 | :debug:main universal_variant is false, so not adding the default universal variant |
|---|
| 388 | :debug:main Running callback portconfigure::add_automatic_compiler_dependencies |
|---|
| 389 | :debug:main Finished running callback portconfigure::add_automatic_compiler_dependencies |
|---|
| 390 | :debug:main Running callback portbuild::add_automatic_buildsystem_dependencies |
|---|
| 391 | :debug:main Finished running callback portbuild::add_automatic_buildsystem_dependencies |
|---|
| 392 | :debug:main No need to upgrade! clang_select 2_0 >= clang_select 2_0 |
|---|
| 393 | :debug:main epoch: in tree: 2 installed: 2 |
|---|
| 394 | :debug:main ld64 3_0 exists in the ports tree |
|---|
| 395 | :debug:main ld64 3_0 +ld64_127 is the latest installed |
|---|
| 396 | :debug:main ld64 3_0 +ld64_127 is active |
|---|
| 397 | :debug:main Merging existing variants '+ld64_127' into variants |
|---|
| 398 | :debug:main new fully merged portvariants: ld64_127 + |
|---|
| 399 | :debug:main Changing to port directory: /opt/local/var/macports/sources/nue.de.rsync.macports.org/macports/release/tarballs/ports/devel/ld64 |
|---|
| 400 | :debug:main OS darwin/9.8.0 (Mac OS X 10.5) arch powerpc |
|---|
| 401 | :debug:main Sourcing PortGroup compiler_blacklist_versions 1.0 from /opt/local/var/macports/sources/nue.de.rsync.macports.org/macports/release/tarballs/ports/_resources/port1.0/group/compiler_blacklist_versions-1.0.tcl |
|---|
| 402 | :debug:main Reading variant descriptions from /opt/local/var/macports/sources/nue.de.rsync.macports.org/macports/release/tarballs/ports/_resources/port1.0/variant_descriptions.conf |
|---|
| 403 | :debug:main universal variant already exists, so not adding the default one |
|---|
| 404 | :debug:main Executing variant ld64_127 provides ld64_127 |
|---|
| 405 | :debug:main Running callback portconfigure::add_automatic_compiler_dependencies |
|---|
| 406 | :debug:main Finished running callback portconfigure::add_automatic_compiler_dependencies |
|---|
| 407 | :debug:main Running callback portbuild::add_automatic_buildsystem_dependencies |
|---|
| 408 | :debug:main Finished running callback portbuild::add_automatic_buildsystem_dependencies |
|---|
| 409 | :debug:main No need to upgrade! ld64 3_0 >= ld64 3_0 |
|---|
| 410 | :debug:main epoch: in tree: 2 installed: 2 |
|---|
| 411 | :debug:main ld64-127 127.2_14 exists in the ports tree |
|---|
| 412 | :debug:main ld64-127 127.2_14 +llvm34 is the latest installed |
|---|
| 413 | :debug:main ld64-127 127.2_14 +llvm34 is active |
|---|
| 414 | :debug:main Merging existing variants '+llvm34' into variants |
|---|
| 415 | :debug:main new fully merged portvariants: llvm34 + |
|---|
| 416 | :debug:main Changing to port directory: /opt/local/var/macports/sources/nue.de.rsync.macports.org/macports/release/tarballs/ports/devel/ld64 |
|---|
| 417 | :debug:main OS darwin/9.8.0 (Mac OS X 10.5) arch powerpc |
|---|
| 418 | :debug:main Sourcing PortGroup compiler_blacklist_versions 1.0 from /opt/local/var/macports/sources/nue.de.rsync.macports.org/macports/release/tarballs/ports/_resources/port1.0/group/compiler_blacklist_versions-1.0.tcl |
|---|
| 419 | :debug:main Reading variant descriptions from /opt/local/var/macports/sources/nue.de.rsync.macports.org/macports/release/tarballs/ports/_resources/port1.0/variant_descriptions.conf |
|---|
| 420 | :debug:main universal variant already exists, so not adding the default one |
|---|
| 421 | :debug:main Executing variant llvm34 provides llvm34 |
|---|
| 422 | :debug:main Running callback portconfigure::add_automatic_compiler_dependencies |
|---|
| 423 | :debug:main Finished running callback portconfigure::add_automatic_compiler_dependencies |
|---|
| 424 | :debug:main Running callback portbuild::add_automatic_buildsystem_dependencies |
|---|
| 425 | :debug:main Finished running callback portbuild::add_automatic_buildsystem_dependencies |
|---|
| 426 | :debug:main No need to upgrade! ld64-127 127.2_14 >= ld64-127 127.2_14 |
|---|
| 427 | :debug:main epoch: in tree: 2 installed: 2 |
|---|
| 428 | :debug:main atk 2.22.0_0 exists in the ports tree |
|---|
| 429 | :debug:main atk 2.22.0_0 is the latest installed |
|---|
| 430 | :debug:main atk 2.22.0_0 is active |
|---|
| 431 | :debug:main Merging existing variants '' into variants |
|---|
| 432 | :debug:main new fully merged portvariants: |
|---|
| 433 | :debug:main Changing to port directory: /opt/local/var/macports/sources/nue.de.rsync.macports.org/macports/release/tarballs/ports/devel/atk |
|---|
| 434 | :debug:main OS darwin/9.8.0 (Mac OS X 10.5) arch powerpc |
|---|
| 435 | :debug:main Sourcing PortGroup gobject_introspection 1.0 from /opt/local/var/macports/sources/nue.de.rsync.macports.org/macports/release/tarballs/ports/_resources/port1.0/group/gobject_introspection-1.0.tcl |
|---|
| 436 | :debug:main adding the default universal variant |
|---|
| 437 | :debug:main Reading variant descriptions from /opt/local/var/macports/sources/nue.de.rsync.macports.org/macports/release/tarballs/ports/_resources/port1.0/variant_descriptions.conf |
|---|
| 438 | :debug:main Running callback portconfigure::add_automatic_compiler_dependencies |
|---|
| 439 | :debug:main Finished running callback portconfigure::add_automatic_compiler_dependencies |
|---|
| 440 | :debug:main Running callback portbuild::add_automatic_buildsystem_dependencies |
|---|
| 441 | :debug:main Finished running callback portbuild::add_automatic_buildsystem_dependencies |
|---|
| 442 | :debug:main No need to upgrade! atk 2.22.0_0 >= atk 2.22.0_0 |
|---|
| 443 | :debug:main epoch: in tree: 0 installed: 0 |
|---|
| 444 | :debug:main glib2 2.50.2_0 exists in the ports tree |
|---|
| 445 | :debug:main glib2 2.50.2_0 is the latest installed |
|---|
| 446 | :debug:main glib2 2.50.2_0 is active |
|---|
| 447 | :debug:main Merging existing variants '' into variants |
|---|
| 448 | :debug:main new fully merged portvariants: |
|---|
| 449 | :debug:main Changing to port directory: /opt/local/var/macports/sources/nue.de.rsync.macports.org/macports/release/tarballs/ports/devel/glib2 |
|---|
| 450 | :debug:main OS darwin/9.8.0 (Mac OS X 10.5) arch powerpc |
|---|
| 451 | :debug:main Sourcing PortGroup compiler_blacklist_versions 1.0 from /opt/local/var/macports/sources/nue.de.rsync.macports.org/macports/release/tarballs/ports/_resources/port1.0/group/compiler_blacklist_versions-1.0.tcl |
|---|
| 452 | :debug:main compiler clang blacklisted because it's not installed or it doesn't work |
|---|
| 453 | :debug:main adding the default universal variant |
|---|
| 454 | :debug:main Reading variant descriptions from /opt/local/var/macports/sources/nue.de.rsync.macports.org/macports/release/tarballs/ports/_resources/port1.0/variant_descriptions.conf |
|---|
| 455 | :debug:main Running callback portconfigure::add_automatic_compiler_dependencies |
|---|
| 456 | :debug:main Finished running callback portconfigure::add_automatic_compiler_dependencies |
|---|
| 457 | :debug:main Running callback portbuild::add_automatic_buildsystem_dependencies |
|---|
| 458 | :debug:main Finished running callback portbuild::add_automatic_buildsystem_dependencies |
|---|
| 459 | :debug:main No need to upgrade! glib2 2.50.2_0 >= glib2 2.50.2_0 |
|---|
| 460 | :debug:main epoch: in tree: 0 installed: 0 |
|---|
| 461 | :debug:main pcre 8.39_0 exists in the ports tree |
|---|
| 462 | :debug:main pcre 8.39_0 is the latest installed |
|---|
| 463 | :debug:main pcre 8.39_0 is active |
|---|
| 464 | :debug:main Merging existing variants '' into variants |
|---|
| 465 | :debug:main new fully merged portvariants: |
|---|
| 466 | :debug:main Changing to port directory: /opt/local/var/macports/sources/nue.de.rsync.macports.org/macports/release/tarballs/ports/devel/pcre |
|---|
| 467 | :debug:main OS darwin/9.8.0 (Mac OS X 10.5) arch powerpc |
|---|
| 468 | :debug:main adding the default universal variant |
|---|
| 469 | :debug:main Reading variant descriptions from /opt/local/var/macports/sources/nue.de.rsync.macports.org/macports/release/tarballs/ports/_resources/port1.0/variant_descriptions.conf |
|---|
| 470 | :debug:main Running callback portconfigure::add_automatic_compiler_dependencies |
|---|
| 471 | :debug:main Finished running callback portconfigure::add_automatic_compiler_dependencies |
|---|
| 472 | :debug:main Running callback portbuild::add_automatic_buildsystem_dependencies |
|---|
| 473 | :debug:main Finished running callback portbuild::add_automatic_buildsystem_dependencies |
|---|
| 474 | :debug:main No need to upgrade! pcre 8.39_0 >= pcre 8.39_0 |
|---|
| 475 | :debug:main epoch: in tree: 0 installed: 0 |
|---|
| 476 | :debug:main gobject-introspection 1.50.0_0 exists in the ports tree |
|---|
| 477 | :debug:main gobject-introspection 1.50.0_0 +python_ucs4 is the latest installed |
|---|
| 478 | :debug:main gobject-introspection 1.50.0_0 +python_ucs4 is active |
|---|
| 479 | :debug:main Merging existing variants '+python_ucs4' into variants |
|---|
| 480 | :debug:main new fully merged portvariants: python_ucs4 + |
|---|
| 481 | :debug:main Changing to port directory: /opt/local/var/macports/sources/nue.de.rsync.macports.org/macports/release/tarballs/ports/gnome/gobject-introspection |
|---|
| 482 | :debug:main OS darwin/9.8.0 (Mac OS X 10.5) arch powerpc |
|---|
| 483 | :debug:main Sourcing PortGroup active_variants 1.1 from /opt/local/var/macports/sources/nue.de.rsync.macports.org/macports/release/tarballs/ports/_resources/port1.0/group/active_variants-1.1.tcl |
|---|
| 484 | :debug:main python27 is installed with the following variants: +ucs4 |
|---|
| 485 | :debug:main required: ucs4, forbidden: |
|---|
| 486 | :debug:main accepted |
|---|
| 487 | :debug:main adding the default universal variant |
|---|
| 488 | :debug:main Reading variant descriptions from /opt/local/var/macports/sources/nue.de.rsync.macports.org/macports/release/tarballs/ports/_resources/port1.0/variant_descriptions.conf |
|---|
| 489 | :debug:main Executing variant python_ucs4 provides python_ucs4 |
|---|
| 490 | :debug:main Running callback portconfigure::add_automatic_compiler_dependencies |
|---|
| 491 | :debug:main Finished running callback portconfigure::add_automatic_compiler_dependencies |
|---|
| 492 | :debug:main Running callback portbuild::add_automatic_buildsystem_dependencies |
|---|
| 493 | :debug:main Finished running callback portbuild::add_automatic_buildsystem_dependencies |
|---|
| 494 | :debug:main No need to upgrade! gobject-introspection 1.50.0_0 >= gobject-introspection 1.50.0_0 |
|---|
| 495 | :debug:main epoch: in tree: 0 installed: 0 |
|---|
| 496 | :debug:main cairo 1.14.8_0 exists in the ports tree |
|---|
| 497 | :debug:main cairo 1.14.8_0 +quartz+x11 is the latest installed |
|---|
| 498 | :debug:main cairo 1.14.8_0 +quartz+x11 is active |
|---|
| 499 | :debug:main Merging existing variants '+quartz+x11' into variants |
|---|
| 500 | :debug:main new fully merged portvariants: x11 + quartz + |
|---|
| 501 | :debug:main Changing to port directory: /opt/local/var/macports/sources/nue.de.rsync.macports.org/macports/release/tarballs/ports/graphics/cairo |
|---|
| 502 | :debug:main OS darwin/9.8.0 (Mac OS X 10.5) arch powerpc |
|---|
| 503 | :debug:main Sourcing PortGroup compiler_blacklist_versions 1.0 from /opt/local/var/macports/sources/nue.de.rsync.macports.org/macports/release/tarballs/ports/_resources/port1.0/group/compiler_blacklist_versions-1.0.tcl |
|---|
| 504 | :debug:main Reading variant descriptions from /opt/local/var/macports/sources/nue.de.rsync.macports.org/macports/release/tarballs/ports/_resources/port1.0/variant_descriptions.conf |
|---|
| 505 | :debug:main Sourcing PortGroup muniversal 1.0 from /opt/local/var/macports/sources/nue.de.rsync.macports.org/macports/release/tarballs/ports/_resources/port1.0/group/muniversal-1.0.tcl |
|---|
| 506 | :debug:main Sourcing PortGroup xcodeversion 1.0 from /opt/local/var/macports/sources/nue.de.rsync.macports.org/macports/release/tarballs/ports/_resources/port1.0/group/xcodeversion-1.0.tcl |
|---|
| 507 | :debug:main compiler clang blacklisted because it's not installed or it doesn't work |
|---|
| 508 | :debug:main universal variant already exists, so not adding the default one |
|---|
| 509 | :debug:main Executing variant quartz provides quartz |
|---|
| 510 | :debug:main Executing variant x11 provides x11 |
|---|
| 511 | :debug:main Running callback portconfigure::add_automatic_compiler_dependencies |
|---|
| 512 | :debug:main Finished running callback portconfigure::add_automatic_compiler_dependencies |
|---|
| 513 | :debug:main Running callback portbuild::add_automatic_buildsystem_dependencies |
|---|
| 514 | :debug:main Finished running callback portbuild::add_automatic_buildsystem_dependencies |
|---|
| 515 | :debug:main No need to upgrade! cairo 1.14.8_0 >= cairo 1.14.8_0 |
|---|
| 516 | :debug:main epoch: in tree: 0 installed: 0 |
|---|
| 517 | :debug:main libpixman 0.34.0_0 exists in the ports tree |
|---|
| 518 | :debug:main libpixman 0.34.0_0 is the latest installed |
|---|
| 519 | :debug:main libpixman 0.34.0_0 is active |
|---|
| 520 | :debug:main Merging existing variants '' into variants |
|---|
| 521 | :debug:main new fully merged portvariants: |
|---|
| 522 | :debug:main Changing to port directory: /opt/local/var/macports/sources/nue.de.rsync.macports.org/macports/release/tarballs/ports/graphics/libpixman |
|---|
| 523 | :debug:main OS darwin/9.8.0 (Mac OS X 10.5) arch powerpc |
|---|
| 524 | :debug:main Sourcing PortGroup compiler_blacklist_versions 1.0 from /opt/local/var/macports/sources/nue.de.rsync.macports.org/macports/release/tarballs/ports/_resources/port1.0/group/compiler_blacklist_versions-1.0.tcl |
|---|
| 525 | :debug:main Reading variant descriptions from /opt/local/var/macports/sources/nue.de.rsync.macports.org/macports/release/tarballs/ports/_resources/port1.0/variant_descriptions.conf |
|---|
| 526 | :debug:main Sourcing PortGroup muniversal 1.0 from /opt/local/var/macports/sources/nue.de.rsync.macports.org/macports/release/tarballs/ports/_resources/port1.0/group/muniversal-1.0.tcl |
|---|
| 527 | :debug:main compiler clang blacklisted because it's not installed or it doesn't work |
|---|
| 528 | :debug:main universal variant already exists, so not adding the default one |
|---|
| 529 | :debug:main Running callback portconfigure::add_automatic_compiler_dependencies |
|---|
| 530 | :debug:main Finished running callback portconfigure::add_automatic_compiler_dependencies |
|---|
| 531 | :debug:main Running callback portbuild::add_automatic_buildsystem_dependencies |
|---|
| 532 | :debug:main Finished running callback portbuild::add_automatic_buildsystem_dependencies |
|---|
| 533 | :debug:main No need to upgrade! libpixman 0.34.0_0 >= libpixman 0.34.0_0 |
|---|
| 534 | :debug:main epoch: in tree: 0 installed: 0 |
|---|
| 535 | :debug:main fontconfig 2.12.1_1 exists in the ports tree |
|---|
| 536 | :debug:main fontconfig 2.12.1_1 is the latest installed |
|---|
| 537 | :debug:main fontconfig 2.12.1_1 is active |
|---|
| 538 | :debug:main Merging existing variants '' into variants |
|---|
| 539 | :debug:main new fully merged portvariants: |
|---|
| 540 | :debug:main Changing to port directory: /opt/local/var/macports/sources/nue.de.rsync.macports.org/macports/release/tarballs/ports/graphics/fontconfig |
|---|
| 541 | :debug:main OS darwin/9.8.0 (Mac OS X 10.5) arch powerpc |
|---|
| 542 | :debug:main Reading variant descriptions from /opt/local/var/macports/sources/nue.de.rsync.macports.org/macports/release/tarballs/ports/_resources/port1.0/variant_descriptions.conf |
|---|
| 543 | :debug:main Sourcing PortGroup muniversal 1.0 from /opt/local/var/macports/sources/nue.de.rsync.macports.org/macports/release/tarballs/ports/_resources/port1.0/group/muniversal-1.0.tcl |
|---|
| 544 | :debug:main universal variant already exists, so not adding the default one |
|---|
| 545 | :debug:main Running callback portconfigure::add_automatic_compiler_dependencies |
|---|
| 546 | :debug:main Finished running callback portconfigure::add_automatic_compiler_dependencies |
|---|
| 547 | :debug:main Running callback portbuild::add_automatic_buildsystem_dependencies |
|---|
| 548 | :debug:main Finished running callback portbuild::add_automatic_buildsystem_dependencies |
|---|
| 549 | :debug:main No need to upgrade! fontconfig 2.12.1_1 >= fontconfig 2.12.1_1 |
|---|
| 550 | :debug:main epoch: in tree: 0 installed: 0 |
|---|
| 551 | :debug:main freetype 2.7_0 exists in the ports tree |
|---|
| 552 | :debug:main freetype 2.7_0 is the latest installed |
|---|
| 553 | :debug:main freetype 2.7_0 is active |
|---|
| 554 | :debug:main Merging existing variants '' into variants |
|---|
| 555 | :debug:main new fully merged portvariants: |
|---|
| 556 | :debug:main Changing to port directory: /opt/local/var/macports/sources/nue.de.rsync.macports.org/macports/release/tarballs/ports/print/freetype |
|---|
| 557 | :debug:main OS darwin/9.8.0 (Mac OS X 10.5) arch powerpc |
|---|
| 558 | :debug:main Reading variant descriptions from /opt/local/var/macports/sources/nue.de.rsync.macports.org/macports/release/tarballs/ports/_resources/port1.0/variant_descriptions.conf |
|---|
| 559 | :debug:main Sourcing PortGroup muniversal 1.0 from /opt/local/var/macports/sources/nue.de.rsync.macports.org/macports/release/tarballs/ports/_resources/port1.0/group/muniversal-1.0.tcl |
|---|
| 560 | :debug:main universal variant already exists, so not adding the default one |
|---|
| 561 | :debug:main Running callback portconfigure::add_automatic_compiler_dependencies |
|---|
| 562 | :debug:main Finished running callback portconfigure::add_automatic_compiler_dependencies |
|---|
| 563 | :debug:main Running callback portbuild::add_automatic_buildsystem_dependencies |
|---|
| 564 | :debug:main Finished running callback portbuild::add_automatic_buildsystem_dependencies |
|---|
| 565 | :debug:main No need to upgrade! freetype 2.7_0 >= freetype 2.7_0 |
|---|
| 566 | :debug:main epoch: in tree: 0 installed: 0 |
|---|
| 567 | :debug:main libpng 1.6.26_0 exists in the ports tree |
|---|
| 568 | :debug:main libpng 1.6.26_0 is the latest installed |
|---|
| 569 | :debug:main libpng 1.6.26_0 is active |
|---|
| 570 | :debug:main Merging existing variants '' into variants |
|---|
| 571 | :debug:main new fully merged portvariants: |
|---|
| 572 | :debug:main Changing to port directory: /opt/local/var/macports/sources/nue.de.rsync.macports.org/macports/release/tarballs/ports/graphics/libpng |
|---|
| 573 | :debug:main OS darwin/9.8.0 (Mac OS X 10.5) arch powerpc |
|---|
| 574 | :debug:main adding the default universal variant |
|---|
| 575 | :debug:main Reading variant descriptions from /opt/local/var/macports/sources/nue.de.rsync.macports.org/macports/release/tarballs/ports/_resources/port1.0/variant_descriptions.conf |
|---|
| 576 | :debug:main Running callback portconfigure::add_automatic_compiler_dependencies |
|---|
| 577 | :debug:main Finished running callback portconfigure::add_automatic_compiler_dependencies |
|---|
| 578 | :debug:main Running callback portbuild::add_automatic_buildsystem_dependencies |
|---|
| 579 | :debug:main Finished running callback portbuild::add_automatic_buildsystem_dependencies |
|---|
| 580 | :debug:main No need to upgrade! libpng 1.6.26_0 >= libpng 1.6.26_0 |
|---|
| 581 | :debug:main epoch: in tree: 0 installed: 0 |
|---|
| 582 | :debug:main xrender 0.9.10_0 exists in the ports tree |
|---|
| 583 | :debug:main xrender 0.9.10_0 is the latest installed |
|---|
| 584 | :debug:main xrender 0.9.10_0 is active |
|---|
| 585 | :debug:main Merging existing variants '' into variants |
|---|
| 586 | :debug:main new fully merged portvariants: |
|---|
| 587 | :debug:main Changing to port directory: /opt/local/var/macports/sources/nue.de.rsync.macports.org/macports/release/tarballs/ports/x11/xrender |
|---|
| 588 | :debug:main OS darwin/9.8.0 (Mac OS X 10.5) arch powerpc |
|---|
| 589 | :debug:main adding the default universal variant |
|---|
| 590 | :debug:main Reading variant descriptions from /opt/local/var/macports/sources/nue.de.rsync.macports.org/macports/release/tarballs/ports/_resources/port1.0/variant_descriptions.conf |
|---|
| 591 | :debug:main Running callback portconfigure::add_automatic_compiler_dependencies |
|---|
| 592 | :debug:main Finished running callback portconfigure::add_automatic_compiler_dependencies |
|---|
| 593 | :debug:main Running callback portbuild::add_automatic_buildsystem_dependencies |
|---|
| 594 | :debug:main Finished running callback portbuild::add_automatic_buildsystem_dependencies |
|---|
| 595 | :debug:main No need to upgrade! xrender 0.9.10_0 >= xrender 0.9.10_0 |
|---|
| 596 | :debug:main epoch: in tree: 0 installed: 0 |
|---|
| 597 | :debug:main xorg-libX11 1.6.4_0 exists in the ports tree |
|---|
| 598 | :debug:main xorg-libX11 1.6.4_0 is the latest installed |
|---|
| 599 | :debug:main xorg-libX11 1.6.4_0 is active |
|---|
| 600 | :debug:main Merging existing variants '' into variants |
|---|
| 601 | :debug:main new fully merged portvariants: |
|---|
| 602 | :debug:main Changing to port directory: /opt/local/var/macports/sources/nue.de.rsync.macports.org/macports/release/tarballs/ports/x11/xorg-libX11 |
|---|
| 603 | :debug:main OS darwin/9.8.0 (Mac OS X 10.5) arch powerpc |
|---|
| 604 | :debug:main adding the default universal variant |
|---|
| 605 | :debug:main Reading variant descriptions from /opt/local/var/macports/sources/nue.de.rsync.macports.org/macports/release/tarballs/ports/_resources/port1.0/variant_descriptions.conf |
|---|
| 606 | :debug:main Running callback portconfigure::add_automatic_compiler_dependencies |
|---|
| 607 | :debug:main Finished running callback portconfigure::add_automatic_compiler_dependencies |
|---|
| 608 | :debug:main Running callback portbuild::add_automatic_buildsystem_dependencies |
|---|
| 609 | :debug:main Finished running callback portbuild::add_automatic_buildsystem_dependencies |
|---|
| 610 | :debug:main No need to upgrade! xorg-libX11 1.6.4_0 >= xorg-libX11 1.6.4_0 |
|---|
| 611 | :debug:main epoch: in tree: 0 installed: 0 |
|---|
| 612 | :debug:main xorg-libXdmcp 1.1.2_0 exists in the ports tree |
|---|
| 613 | :debug:main xorg-libXdmcp 1.1.2_0 is the latest installed |
|---|
| 614 | :debug:main xorg-libXdmcp 1.1.2_0 is active |
|---|
| 615 | :debug:main Merging existing variants '' into variants |
|---|
| 616 | :debug:main new fully merged portvariants: |
|---|
| 617 | :debug:main Changing to port directory: /opt/local/var/macports/sources/nue.de.rsync.macports.org/macports/release/tarballs/ports/x11/xorg-libXdmcp |
|---|
| 618 | :debug:main OS darwin/9.8.0 (Mac OS X 10.5) arch powerpc |
|---|
| 619 | :debug:main adding the default universal variant |
|---|
| 620 | :debug:main Reading variant descriptions from /opt/local/var/macports/sources/nue.de.rsync.macports.org/macports/release/tarballs/ports/_resources/port1.0/variant_descriptions.conf |
|---|
| 621 | :debug:main Running callback portconfigure::add_automatic_compiler_dependencies |
|---|
| 622 | :debug:main Finished running callback portconfigure::add_automatic_compiler_dependencies |
|---|
| 623 | :debug:main Running callback portbuild::add_automatic_buildsystem_dependencies |
|---|
| 624 | :debug:main Finished running callback portbuild::add_automatic_buildsystem_dependencies |
|---|
| 625 | :debug:main No need to upgrade! xorg-libXdmcp 1.1.2_0 >= xorg-libXdmcp 1.1.2_0 |
|---|
| 626 | :debug:main epoch: in tree: 0 installed: 0 |
|---|
| 627 | :debug:main xorg-libXau 1.0.8_0 exists in the ports tree |
|---|
| 628 | :debug:main xorg-libXau 1.0.8_0 is the latest installed |
|---|
| 629 | :debug:main xorg-libXau 1.0.8_0 is active |
|---|
| 630 | :debug:main Merging existing variants '' into variants |
|---|
| 631 | :debug:main new fully merged portvariants: |
|---|
| 632 | :debug:main Changing to port directory: /opt/local/var/macports/sources/nue.de.rsync.macports.org/macports/release/tarballs/ports/x11/xorg-libXau |
|---|
| 633 | :debug:main OS darwin/9.8.0 (Mac OS X 10.5) arch powerpc |
|---|
| 634 | :debug:main adding the default universal variant |
|---|
| 635 | :debug:main Reading variant descriptions from /opt/local/var/macports/sources/nue.de.rsync.macports.org/macports/release/tarballs/ports/_resources/port1.0/variant_descriptions.conf |
|---|
| 636 | :debug:main Running callback portconfigure::add_automatic_compiler_dependencies |
|---|
| 637 | :debug:main Finished running callback portconfigure::add_automatic_compiler_dependencies |
|---|
| 638 | :debug:main Running callback portbuild::add_automatic_buildsystem_dependencies |
|---|
| 639 | :debug:main Finished running callback portbuild::add_automatic_buildsystem_dependencies |
|---|
| 640 | :debug:main No need to upgrade! xorg-libXau 1.0.8_0 >= xorg-libXau 1.0.8_0 |
|---|
| 641 | :debug:main epoch: in tree: 0 installed: 0 |
|---|
| 642 | :debug:main xorg-xproto 7.0.31_0 exists in the ports tree |
|---|
| 643 | :debug:main xorg-xproto 7.0.31_0 is the latest installed |
|---|
| 644 | :debug:main xorg-xproto 7.0.31_0 is active |
|---|
| 645 | :debug:main Merging existing variants '' into variants |
|---|
| 646 | :debug:main new fully merged portvariants: |
|---|
| 647 | :debug:main Changing to port directory: /opt/local/var/macports/sources/nue.de.rsync.macports.org/macports/release/tarballs/ports/x11/xorg-xproto |
|---|
| 648 | :debug:main OS darwin/9.8.0 (Mac OS X 10.5) arch powerpc |
|---|
| 649 | :debug:main only one arch supported, so not adding the default universal variant |
|---|
| 650 | :debug:main Running callback portconfigure::add_automatic_compiler_dependencies |
|---|
| 651 | :debug:main Finished running callback portconfigure::add_automatic_compiler_dependencies |
|---|
| 652 | :debug:main Running callback portbuild::add_automatic_buildsystem_dependencies |
|---|
| 653 | :debug:main Finished running callback portbuild::add_automatic_buildsystem_dependencies |
|---|
| 654 | :debug:main No need to upgrade! xorg-xproto 7.0.31_0 >= xorg-xproto 7.0.31_0 |
|---|
| 655 | :debug:main epoch: in tree: 0 installed: 0 |
|---|
| 656 | :debug:main xorg-libxcb 1.12_2 exists in the ports tree |
|---|
| 657 | :debug:main xorg-libxcb 1.12_2 +python27 is the latest installed |
|---|
| 658 | :debug:main xorg-libxcb 1.12_2 +python27 is active |
|---|
| 659 | :debug:main Merging existing variants '+python27' into variants |
|---|
| 660 | :debug:main new fully merged portvariants: python27 + |
|---|
| 661 | :debug:main Changing to port directory: /opt/local/var/macports/sources/nue.de.rsync.macports.org/macports/release/tarballs/ports/x11/xorg-libxcb |
|---|
| 662 | :debug:main OS darwin/9.8.0 (Mac OS X 10.5) arch powerpc |
|---|
| 663 | :debug:main adding the default universal variant |
|---|
| 664 | :debug:main Reading variant descriptions from /opt/local/var/macports/sources/nue.de.rsync.macports.org/macports/release/tarballs/ports/_resources/port1.0/variant_descriptions.conf |
|---|
| 665 | :debug:main Executing variant python27 provides python27 |
|---|
| 666 | :debug:main Running callback portconfigure::add_automatic_compiler_dependencies |
|---|
| 667 | :debug:main Finished running callback portconfigure::add_automatic_compiler_dependencies |
|---|
| 668 | :debug:main Running callback portbuild::add_automatic_buildsystem_dependencies |
|---|
| 669 | :debug:main Finished running callback portbuild::add_automatic_buildsystem_dependencies |
|---|
| 670 | :debug:main No need to upgrade! xorg-libxcb 1.12_2 >= xorg-libxcb 1.12_2 |
|---|
| 671 | :debug:main epoch: in tree: 0 installed: 0 |
|---|
| 672 | :debug:main xorg-xcb-proto 1.12_1 exists in the ports tree |
|---|
| 673 | :debug:main xorg-xcb-proto 1.12_1 +python27 is the latest installed |
|---|
| 674 | :debug:main xorg-xcb-proto 1.12_1 +python27 is active |
|---|
| 675 | :debug:main Merging existing variants '+python27' into variants |
|---|
| 676 | :debug:main new fully merged portvariants: python27 + |
|---|
| 677 | :debug:main Changing to port directory: /opt/local/var/macports/sources/nue.de.rsync.macports.org/macports/release/tarballs/ports/x11/xorg-xcb-proto |
|---|
| 678 | :debug:main OS darwin/9.8.0 (Mac OS X 10.5) arch powerpc |
|---|
| 679 | :debug:main only one arch supported, so not adding the default universal variant |
|---|
| 680 | :debug:main Executing variant python27 provides python27 |
|---|
| 681 | :debug:main Running callback portconfigure::add_automatic_compiler_dependencies |
|---|
| 682 | :debug:main Finished running callback portconfigure::add_automatic_compiler_dependencies |
|---|
| 683 | :debug:main Running callback portbuild::add_automatic_buildsystem_dependencies |
|---|
| 684 | :debug:main Finished running callback portbuild::add_automatic_buildsystem_dependencies |
|---|
| 685 | :debug:main No need to upgrade! xorg-xcb-proto 1.12_1 >= xorg-xcb-proto 1.12_1 |
|---|
| 686 | :debug:main epoch: in tree: 0 installed: 0 |
|---|
| 687 | :debug:main xorg-libpthread-stubs 0.3_0 exists in the ports tree |
|---|
| 688 | :debug:main xorg-libpthread-stubs 0.3_0 is the latest installed |
|---|
| 689 | :debug:main xorg-libpthread-stubs 0.3_0 is active |
|---|
| 690 | :debug:main Merging existing variants '' into variants |
|---|
| 691 | :debug:main new fully merged portvariants: |
|---|
| 692 | :debug:main Changing to port directory: /opt/local/var/macports/sources/nue.de.rsync.macports.org/macports/release/tarballs/ports/x11/xorg-libpthread-stubs |
|---|
| 693 | :debug:main OS darwin/9.8.0 (Mac OS X 10.5) arch powerpc |
|---|
| 694 | :debug:main only one arch supported, so not adding the default universal variant |
|---|
| 695 | :debug:main Running callback portconfigure::add_automatic_compiler_dependencies |
|---|
| 696 | :debug:main Finished running callback portconfigure::add_automatic_compiler_dependencies |
|---|
| 697 | :debug:main Running callback portbuild::add_automatic_buildsystem_dependencies |
|---|
| 698 | :debug:main Finished running callback portbuild::add_automatic_buildsystem_dependencies |
|---|
| 699 | :debug:main No need to upgrade! xorg-libpthread-stubs 0.3_0 >= xorg-libpthread-stubs 0.3_0 |
|---|
| 700 | :debug:main epoch: in tree: 0 installed: 0 |
|---|
| 701 | :debug:main xorg-kbproto 1.0.7_0 exists in the ports tree |
|---|
| 702 | :debug:main xorg-kbproto 1.0.7_0 is the latest installed |
|---|
| 703 | :debug:main xorg-kbproto 1.0.7_0 is active |
|---|
| 704 | :debug:main Merging existing variants '' into variants |
|---|
| 705 | :debug:main new fully merged portvariants: |
|---|
| 706 | :debug:main Changing to port directory: /opt/local/var/macports/sources/nue.de.rsync.macports.org/macports/release/tarballs/ports/x11/xorg-kbproto |
|---|
| 707 | :debug:main OS darwin/9.8.0 (Mac OS X 10.5) arch powerpc |
|---|
| 708 | :debug:main only one arch supported, so not adding the default universal variant |
|---|
| 709 | :debug:main Running callback portconfigure::add_automatic_compiler_dependencies |
|---|
| 710 | :debug:main Finished running callback portconfigure::add_automatic_compiler_dependencies |
|---|
| 711 | :debug:main Running callback portbuild::add_automatic_buildsystem_dependencies |
|---|
| 712 | :debug:main Finished running callback portbuild::add_automatic_buildsystem_dependencies |
|---|
| 713 | :debug:main No need to upgrade! xorg-kbproto 1.0.7_0 >= xorg-kbproto 1.0.7_0 |
|---|
| 714 | :debug:main epoch: in tree: 0 installed: 0 |
|---|
| 715 | :debug:main xorg-renderproto 0.11.1_0 exists in the ports tree |
|---|
| 716 | :debug:main xorg-renderproto 0.11.1_0 is the latest installed |
|---|
| 717 | :debug:main xorg-renderproto 0.11.1_0 is active |
|---|
| 718 | :debug:main Merging existing variants '' into variants |
|---|
| 719 | :debug:main new fully merged portvariants: |
|---|
| 720 | :debug:main Changing to port directory: /opt/local/var/macports/sources/nue.de.rsync.macports.org/macports/release/tarballs/ports/x11/xorg-renderproto |
|---|
| 721 | :debug:main OS darwin/9.8.0 (Mac OS X 10.5) arch powerpc |
|---|
| 722 | :debug:main only one arch supported, so not adding the default universal variant |
|---|
| 723 | :debug:main Running callback portconfigure::add_automatic_compiler_dependencies |
|---|
| 724 | :debug:main Finished running callback portconfigure::add_automatic_compiler_dependencies |
|---|
| 725 | :debug:main Running callback portbuild::add_automatic_buildsystem_dependencies |
|---|
| 726 | :debug:main Finished running callback portbuild::add_automatic_buildsystem_dependencies |
|---|
| 727 | :debug:main No need to upgrade! xorg-renderproto 0.11.1_0 >= xorg-renderproto 0.11.1_0 |
|---|
| 728 | :debug:main epoch: in tree: 0 installed: 0 |
|---|
| 729 | :debug:main xorg-libXext 1.3.3_0 exists in the ports tree |
|---|
| 730 | :debug:main xorg-libXext 1.3.3_0 is the latest installed |
|---|
| 731 | :debug:main xorg-libXext 1.3.3_0 is active |
|---|
| 732 | :debug:main Merging existing variants '' into variants |
|---|
| 733 | :debug:main new fully merged portvariants: |
|---|
| 734 | :debug:main Changing to port directory: /opt/local/var/macports/sources/nue.de.rsync.macports.org/macports/release/tarballs/ports/x11/xorg-libXext |
|---|
| 735 | :debug:main OS darwin/9.8.0 (Mac OS X 10.5) arch powerpc |
|---|
| 736 | :debug:main adding the default universal variant |
|---|
| 737 | :debug:main Reading variant descriptions from /opt/local/var/macports/sources/nue.de.rsync.macports.org/macports/release/tarballs/ports/_resources/port1.0/variant_descriptions.conf |
|---|
| 738 | :debug:main Running callback portconfigure::add_automatic_compiler_dependencies |
|---|
| 739 | :debug:main Finished running callback portconfigure::add_automatic_compiler_dependencies |
|---|
| 740 | :debug:main Running callback portbuild::add_automatic_buildsystem_dependencies |
|---|
| 741 | :debug:main Finished running callback portbuild::add_automatic_buildsystem_dependencies |
|---|
| 742 | :debug:main No need to upgrade! xorg-libXext 1.3.3_0 >= xorg-libXext 1.3.3_0 |
|---|
| 743 | :debug:main epoch: in tree: 0 installed: 0 |
|---|
| 744 | :debug:main xorg-xextproto 7.3.0_0 exists in the ports tree |
|---|
| 745 | :debug:main xorg-xextproto 7.3.0_0 is the latest installed |
|---|
| 746 | :debug:main xorg-xextproto 7.3.0_0 is active |
|---|
| 747 | :debug:main Merging existing variants '' into variants |
|---|
| 748 | :debug:main new fully merged portvariants: |
|---|
| 749 | :debug:main Changing to port directory: /opt/local/var/macports/sources/nue.de.rsync.macports.org/macports/release/tarballs/ports/x11/xorg-xextproto |
|---|
| 750 | :debug:main OS darwin/9.8.0 (Mac OS X 10.5) arch powerpc |
|---|
| 751 | :debug:main only one arch supported, so not adding the default universal variant |
|---|
| 752 | :debug:main Running callback portconfigure::add_automatic_compiler_dependencies |
|---|
| 753 | :debug:main Finished running callback portconfigure::add_automatic_compiler_dependencies |
|---|
| 754 | :debug:main Running callback portbuild::add_automatic_buildsystem_dependencies |
|---|
| 755 | :debug:main Finished running callback portbuild::add_automatic_buildsystem_dependencies |
|---|
| 756 | :debug:main No need to upgrade! xorg-xextproto 7.3.0_0 >= xorg-xextproto 7.3.0_0 |
|---|
| 757 | :debug:main epoch: in tree: 0 installed: 0 |
|---|
| 758 | :debug:main xorg-xcb-util 0.4.0_0 exists in the ports tree |
|---|
| 759 | :debug:main xorg-xcb-util 0.4.0_0 is the latest installed |
|---|
| 760 | :debug:main xorg-xcb-util 0.4.0_0 is active |
|---|
| 761 | :debug:main Merging existing variants '' into variants |
|---|
| 762 | :debug:main new fully merged portvariants: |
|---|
| 763 | :debug:main Changing to port directory: /opt/local/var/macports/sources/nue.de.rsync.macports.org/macports/release/tarballs/ports/x11/xorg-xcb-util |
|---|
| 764 | :debug:main OS darwin/9.8.0 (Mac OS X 10.5) arch powerpc |
|---|
| 765 | :debug:main adding the default universal variant |
|---|
| 766 | :debug:main Reading variant descriptions from /opt/local/var/macports/sources/nue.de.rsync.macports.org/macports/release/tarballs/ports/_resources/port1.0/variant_descriptions.conf |
|---|
| 767 | :debug:main Running callback portconfigure::add_automatic_compiler_dependencies |
|---|
| 768 | :debug:main Finished running callback portconfigure::add_automatic_compiler_dependencies |
|---|
| 769 | :debug:main Running callback portbuild::add_automatic_buildsystem_dependencies |
|---|
| 770 | :debug:main Finished running callback portbuild::add_automatic_buildsystem_dependencies |
|---|
| 771 | :debug:main No need to upgrade! xorg-xcb-util 0.4.0_0 >= xorg-xcb-util 0.4.0_0 |
|---|
| 772 | :debug:main epoch: in tree: 0 installed: 0 |
|---|
| 773 | :debug:main py27-mako 1.0.6_0 exists in the ports tree |
|---|
| 774 | :debug:main py27-mako 1.0.6_0 is the latest installed |
|---|
| 775 | :debug:main py27-mako 1.0.6_0 is active |
|---|
| 776 | :debug:main Merging existing variants '' into variants |
|---|
| 777 | :debug:main new fully merged portvariants: |
|---|
| 778 | :debug:main Changing to port directory: /opt/local/var/macports/sources/nue.de.rsync.macports.org/macports/release/tarballs/ports/python/py-mako |
|---|
| 779 | :debug:main OS darwin/9.8.0 (Mac OS X 10.5) arch powerpc |
|---|
| 780 | :debug:main Re-registering default for build.cmd |
|---|
| 781 | :debug:main Re-registering default for destroot.cmd |
|---|
| 782 | :debug:main Re-registering default for destroot.destdir |
|---|
| 783 | :debug:main Sourcing PortGroup python 1.0 from /opt/local/var/macports/sources/nue.de.rsync.macports.org/macports/release/tarballs/ports/_resources/port1.0/group/python-1.0.tcl |
|---|
| 784 | :debug:main only one arch supported, so not adding the default universal variant |
|---|
| 785 | :debug:main Running callback portconfigure::add_automatic_compiler_dependencies |
|---|
| 786 | :debug:main Finished running callback portconfigure::add_automatic_compiler_dependencies |
|---|
| 787 | :debug:main Running callback portbuild::add_automatic_buildsystem_dependencies |
|---|
| 788 | :debug:main Finished running callback portbuild::add_automatic_buildsystem_dependencies |
|---|
| 789 | :debug:main No need to upgrade! py27-mako 1.0.6_0 >= py27-mako 1.0.6_0 |
|---|
| 790 | :debug:main epoch: in tree: 0 installed: 0 |
|---|
| 791 | :debug:main py27-setuptools 32.3.0_0 exists in the ports tree |
|---|
| 792 | :debug:main py27-setuptools 32.3.0_0 is the latest installed |
|---|
| 793 | :debug:main py27-setuptools 32.3.0_0 is active |
|---|
| 794 | :debug:main Merging existing variants '' into variants |
|---|
| 795 | :debug:main new fully merged portvariants: |
|---|
| 796 | :debug:main Changing to port directory: /opt/local/var/macports/sources/nue.de.rsync.macports.org/macports/release/tarballs/ports/python/py-setuptools |
|---|
| 797 | :debug:main OS darwin/9.8.0 (Mac OS X 10.5) arch powerpc |
|---|
| 798 | :debug:main Re-registering default for build.cmd |
|---|
| 799 | :debug:main Re-registering default for destroot.cmd |
|---|
| 800 | :debug:main Re-registering default for destroot.destdir |
|---|
| 801 | :debug:main Sourcing PortGroup python 1.0 from /opt/local/var/macports/sources/nue.de.rsync.macports.org/macports/release/tarballs/ports/_resources/port1.0/group/python-1.0.tcl |
|---|
| 802 | :debug:main only one arch supported, so not adding the default universal variant |
|---|
| 803 | :debug:main Running callback portconfigure::add_automatic_compiler_dependencies |
|---|
| 804 | :debug:main Finished running callback portconfigure::add_automatic_compiler_dependencies |
|---|
| 805 | :debug:main Running callback portbuild::add_automatic_buildsystem_dependencies |
|---|
| 806 | :debug:main Finished running callback portbuild::add_automatic_buildsystem_dependencies |
|---|
| 807 | :debug:main No need to upgrade! py27-setuptools 32.3.0_0 >= py27-setuptools 32.3.0_0 |
|---|
| 808 | :debug:main epoch: in tree: 0 installed: 0 |
|---|
| 809 | :debug:main py27-beaker 1.7.0_0 exists in the ports tree |
|---|
| 810 | :debug:main py27-beaker 1.7.0_0 is the latest installed |
|---|
| 811 | :debug:main py27-beaker 1.7.0_0 is active |
|---|
| 812 | :debug:main Merging existing variants '' into variants |
|---|
| 813 | :debug:main new fully merged portvariants: |
|---|
| 814 | :debug:main Changing to port directory: /opt/local/var/macports/sources/nue.de.rsync.macports.org/macports/release/tarballs/ports/python/py-beaker |
|---|
| 815 | :debug:main OS darwin/9.8.0 (Mac OS X 10.5) arch powerpc |
|---|
| 816 | :debug:main Re-registering default for build.cmd |
|---|
| 817 | :debug:main Re-registering default for destroot.cmd |
|---|
| 818 | :debug:main Re-registering default for destroot.destdir |
|---|
| 819 | :debug:main Sourcing PortGroup python 1.0 from /opt/local/var/macports/sources/nue.de.rsync.macports.org/macports/release/tarballs/ports/_resources/port1.0/group/python-1.0.tcl |
|---|
| 820 | :debug:main only one arch supported, so not adding the default universal variant |
|---|
| 821 | :debug:main Running callback portconfigure::add_automatic_compiler_dependencies |
|---|
| 822 | :debug:main Finished running callback portconfigure::add_automatic_compiler_dependencies |
|---|
| 823 | :debug:main Running callback portbuild::add_automatic_buildsystem_dependencies |
|---|
| 824 | :debug:main Finished running callback portbuild::add_automatic_buildsystem_dependencies |
|---|
| 825 | :debug:main No need to upgrade! py27-beaker 1.7.0_0 >= py27-beaker 1.7.0_0 |
|---|
| 826 | :debug:main epoch: in tree: 0 installed: 0 |
|---|
| 827 | :debug:main py27-markupsafe 0.23_0 exists in the ports tree |
|---|
| 828 | :debug:main py27-markupsafe 0.23_0 is the latest installed |
|---|
| 829 | :debug:main py27-markupsafe 0.23_0 is active |
|---|
| 830 | :debug:main Merging existing variants '' into variants |
|---|
| 831 | :debug:main new fully merged portvariants: |
|---|
| 832 | :debug:main Changing to port directory: /opt/local/var/macports/sources/nue.de.rsync.macports.org/macports/release/tarballs/ports/python/py-markupsafe |
|---|
| 833 | :debug:main OS darwin/9.8.0 (Mac OS X 10.5) arch powerpc |
|---|
| 834 | :debug:main Re-registering default for build.cmd |
|---|
| 835 | :debug:main Re-registering default for destroot.cmd |
|---|
| 836 | :debug:main Re-registering default for destroot.destdir |
|---|
| 837 | :debug:main Sourcing PortGroup python 1.0 from /opt/local/var/macports/sources/nue.de.rsync.macports.org/macports/release/tarballs/ports/_resources/port1.0/group/python-1.0.tcl |
|---|
| 838 | :debug:main adding the default universal variant |
|---|
| 839 | :debug:main Reading variant descriptions from /opt/local/var/macports/sources/nue.de.rsync.macports.org/macports/release/tarballs/ports/_resources/port1.0/variant_descriptions.conf |
|---|
| 840 | :debug:main Running callback portconfigure::add_automatic_compiler_dependencies |
|---|
| 841 | :debug:main Finished running callback portconfigure::add_automatic_compiler_dependencies |
|---|
| 842 | :debug:main Running callback portbuild::add_automatic_buildsystem_dependencies |
|---|
| 843 | :debug:main Finished running callback portbuild::add_automatic_buildsystem_dependencies |
|---|
| 844 | :debug:main No need to upgrade! py27-markupsafe 0.23_0 >= py27-markupsafe 0.23_0 |
|---|
| 845 | :debug:main epoch: in tree: 0 installed: 0 |
|---|
| 846 | :debug:main libtool 2.4.6_2 exists in the ports tree |
|---|
| 847 | :debug:main libtool 2.4.6_2 is the latest installed |
|---|
| 848 | :debug:main libtool 2.4.6_2 is active |
|---|
| 849 | :debug:main Merging existing variants '' into variants |
|---|
| 850 | :debug:main new fully merged portvariants: |
|---|
| 851 | :debug:main Changing to port directory: /opt/local/var/macports/sources/nue.de.rsync.macports.org/macports/release/tarballs/ports/devel/libtool |
|---|
| 852 | :debug:main OS darwin/9.8.0 (Mac OS X 10.5) arch powerpc |
|---|
| 853 | :debug:main adding the default universal variant |
|---|
| 854 | :debug:main Reading variant descriptions from /opt/local/var/macports/sources/nue.de.rsync.macports.org/macports/release/tarballs/ports/_resources/port1.0/variant_descriptions.conf |
|---|
| 855 | :debug:main Running callback portconfigure::add_automatic_compiler_dependencies |
|---|
| 856 | :debug:main Finished running callback portconfigure::add_automatic_compiler_dependencies |
|---|
| 857 | :debug:main Running callback portbuild::add_automatic_buildsystem_dependencies |
|---|
| 858 | :debug:main Finished running callback portbuild::add_automatic_buildsystem_dependencies |
|---|
| 859 | :debug:main No need to upgrade! libtool 2.4.6_2 >= libtool 2.4.6_2 |
|---|
| 860 | :debug:main epoch: in tree: 1 installed: 1 |
|---|
| 861 | :debug:main pango 1.40.3_1 exists in the ports tree |
|---|
| 862 | :debug:main pango 1.40.3_1 +quartz+x11 is the latest installed |
|---|
| 863 | :debug:main pango 1.40.3_1 +quartz+x11 is active |
|---|
| 864 | :debug:main Merging existing variants '+quartz+x11' into variants |
|---|
| 865 | :debug:main new fully merged portvariants: x11 + quartz + |
|---|
| 866 | :debug:main Changing to port directory: /opt/local/var/macports/sources/nue.de.rsync.macports.org/macports/release/tarballs/ports/x11/pango |
|---|
| 867 | :debug:main OS darwin/9.8.0 (Mac OS X 10.5) arch powerpc |
|---|
| 868 | :debug:main Sourcing PortGroup active_variants 1.1 from /opt/local/var/macports/sources/nue.de.rsync.macports.org/macports/release/tarballs/ports/_resources/port1.0/group/active_variants-1.1.tcl |
|---|
| 869 | :debug:main Sourcing PortGroup gobject_introspection 1.0 from /opt/local/var/macports/sources/nue.de.rsync.macports.org/macports/release/tarballs/ports/_resources/port1.0/group/gobject_introspection-1.0.tcl |
|---|
| 870 | :debug:main Reading variant descriptions from /opt/local/var/macports/sources/nue.de.rsync.macports.org/macports/release/tarballs/ports/_resources/port1.0/variant_descriptions.conf |
|---|
| 871 | :debug:main adding the default universal variant |
|---|
| 872 | :debug:main Executing variant quartz provides quartz |
|---|
| 873 | :debug:main Executing variant x11 provides x11 |
|---|
| 874 | :debug:main Running callback portconfigure::add_automatic_compiler_dependencies |
|---|
| 875 | :debug:main Finished running callback portconfigure::add_automatic_compiler_dependencies |
|---|
| 876 | :debug:main Running callback portbuild::add_automatic_buildsystem_dependencies |
|---|
| 877 | :debug:main Finished running callback portbuild::add_automatic_buildsystem_dependencies |
|---|
| 878 | :debug:main No need to upgrade! pango 1.40.3_1 >= pango 1.40.3_1 |
|---|
| 879 | :debug:main epoch: in tree: 0 installed: 0 |
|---|
| 880 | :debug:main harfbuzz 1.3.4_0 exists in the ports tree |
|---|
| 881 | :debug:main harfbuzz 1.3.4_0 is the latest installed |
|---|
| 882 | :debug:main harfbuzz 1.3.4_0 is active |
|---|
| 883 | :debug:main Merging existing variants '' into variants |
|---|
| 884 | :debug:main new fully merged portvariants: |
|---|
| 885 | :debug:main Changing to port directory: /opt/local/var/macports/sources/nue.de.rsync.macports.org/macports/release/tarballs/ports/graphics/harfbuzz |
|---|
| 886 | :debug:main OS darwin/9.8.0 (Mac OS X 10.5) arch powerpc |
|---|
| 887 | :debug:main adding the default universal variant |
|---|
| 888 | :debug:main Reading variant descriptions from /opt/local/var/macports/sources/nue.de.rsync.macports.org/macports/release/tarballs/ports/_resources/port1.0/variant_descriptions.conf |
|---|
| 889 | :debug:main Running callback portconfigure::add_automatic_compiler_dependencies |
|---|
| 890 | :debug:main Finished running callback portconfigure::add_automatic_compiler_dependencies |
|---|
| 891 | :debug:main Running callback portbuild::add_automatic_buildsystem_dependencies |
|---|
| 892 | :debug:main Finished running callback portbuild::add_automatic_buildsystem_dependencies |
|---|
| 893 | :debug:main No need to upgrade! harfbuzz 1.3.4_0 >= harfbuzz 1.3.4_0 |
|---|
| 894 | :debug:main epoch: in tree: 0 installed: 0 |
|---|
| 895 | :debug:main graphite2 1.3.9_0 exists in the ports tree |
|---|
| 896 | :debug:main graphite2 1.3.9_0 is the latest installed |
|---|
| 897 | :debug:main graphite2 1.3.9_0 is active |
|---|
| 898 | :debug:main Merging existing variants '' into variants |
|---|
| 899 | :debug:main new fully merged portvariants: |
|---|
| 900 | :debug:main Changing to port directory: /opt/local/var/macports/sources/nue.de.rsync.macports.org/macports/release/tarballs/ports/graphics/graphite2 |
|---|
| 901 | :debug:main OS darwin/9.8.0 (Mac OS X 10.5) arch powerpc |
|---|
| 902 | :debug:main Re-registering default for configure.dir |
|---|
| 903 | :debug:main Re-registering default for configure.pre_args |
|---|
| 904 | :debug:main Re-registering default for build.dir |
|---|
| 905 | :debug:main Re-registering default for destroot.target |
|---|
| 906 | :debug:main Sourcing PortGroup cmake 1.0 from /opt/local/var/macports/sources/nue.de.rsync.macports.org/macports/release/tarballs/ports/_resources/port1.0/group/cmake-1.0.tcl |
|---|
| 907 | :debug:main Reading variant descriptions from /opt/local/var/macports/sources/nue.de.rsync.macports.org/macports/release/tarballs/ports/_resources/port1.0/variant_descriptions.conf |
|---|
| 908 | :debug:main Sourcing PortGroup muniversal 1.0 from /opt/local/var/macports/sources/nue.de.rsync.macports.org/macports/release/tarballs/ports/_resources/port1.0/group/muniversal-1.0.tcl |
|---|
| 909 | :debug:main universal variant already exists, so not adding the default one |
|---|
| 910 | :debug:main Running callback portconfigure::add_automatic_compiler_dependencies |
|---|
| 911 | :debug:main Finished running callback portconfigure::add_automatic_compiler_dependencies |
|---|
| 912 | :debug:main Running callback portbuild::add_automatic_buildsystem_dependencies |
|---|
| 913 | :debug:main Finished running callback portbuild::add_automatic_buildsystem_dependencies |
|---|
| 914 | :debug:main No need to upgrade! graphite2 1.3.9_0 >= graphite2 1.3.9_0 |
|---|
| 915 | :debug:main epoch: in tree: 0 installed: 0 |
|---|
| 916 | :debug:main Xft2 2.3.2_0 exists in the ports tree |
|---|
| 917 | :debug:main Xft2 2.3.2_0 is the latest installed |
|---|
| 918 | :debug:main Xft2 2.3.2_0 is active |
|---|
| 919 | :debug:main Merging existing variants '' into variants |
|---|
| 920 | :debug:main new fully merged portvariants: |
|---|
| 921 | :debug:main Changing to port directory: /opt/local/var/macports/sources/nue.de.rsync.macports.org/macports/release/tarballs/ports/x11/Xft2 |
|---|
| 922 | :debug:main OS darwin/9.8.0 (Mac OS X 10.5) arch powerpc |
|---|
| 923 | :debug:main adding the default universal variant |
|---|
| 924 | :debug:main Reading variant descriptions from /opt/local/var/macports/sources/nue.de.rsync.macports.org/macports/release/tarballs/ports/_resources/port1.0/variant_descriptions.conf |
|---|
| 925 | :debug:main Running callback portconfigure::add_automatic_compiler_dependencies |
|---|
| 926 | :debug:main Finished running callback portconfigure::add_automatic_compiler_dependencies |
|---|
| 927 | :debug:main Running callback portbuild::add_automatic_buildsystem_dependencies |
|---|
| 928 | :debug:main Finished running callback portbuild::add_automatic_buildsystem_dependencies |
|---|
| 929 | :debug:main No need to upgrade! Xft2 2.3.2_0 >= Xft2 2.3.2_0 |
|---|
| 930 | :debug:main epoch: in tree: 2 installed: 2 |
|---|
| 931 | :debug:main gdk-pixbuf2 2.36.2_0 exists in the ports tree |
|---|
| 932 | :debug:main gdk-pixbuf2 2.36.2_0 is the latest installed |
|---|
| 933 | :debug:main gdk-pixbuf2 2.36.2_0 is active |
|---|
| 934 | :debug:main Merging existing variants '-x11' into variants |
|---|
| 935 | :debug:main new fully merged portvariants: x11 - |
|---|
| 936 | :debug:main Changing to port directory: /opt/local/var/macports/sources/nue.de.rsync.macports.org/macports/release/tarballs/ports/graphics/gdk-pixbuf2 |
|---|
| 937 | :debug:main OS darwin/9.8.0 (Mac OS X 10.5) arch powerpc |
|---|
| 938 | :debug:main Sourcing PortGroup gobject_introspection 1.0 from /opt/local/var/macports/sources/nue.de.rsync.macports.org/macports/release/tarballs/ports/_resources/port1.0/group/gobject_introspection-1.0.tcl |
|---|
| 939 | :debug:main Reading variant descriptions from /opt/local/var/macports/sources/nue.de.rsync.macports.org/macports/release/tarballs/ports/_resources/port1.0/variant_descriptions.conf |
|---|
| 940 | :debug:main adding the default universal variant |
|---|
| 941 | :debug:main Running callback portconfigure::add_automatic_compiler_dependencies |
|---|
| 942 | :debug:main Finished running callback portconfigure::add_automatic_compiler_dependencies |
|---|
| 943 | :debug:main Running callback portbuild::add_automatic_buildsystem_dependencies |
|---|
| 944 | :debug:main Finished running callback portbuild::add_automatic_buildsystem_dependencies |
|---|
| 945 | :debug:main No need to upgrade! gdk-pixbuf2 2.36.2_0 >= gdk-pixbuf2 2.36.2_0 |
|---|
| 946 | :debug:main epoch: in tree: 0 installed: 0 |
|---|
| 947 | :debug:main shared-mime-info 1.7_2 exists in the ports tree |
|---|
| 948 | :debug:main shared-mime-info 1.7_2 is the latest installed |
|---|
| 949 | :debug:main shared-mime-info 1.7_2 is active |
|---|
| 950 | :debug:main Merging existing variants '' into variants |
|---|
| 951 | :debug:main new fully merged portvariants: |
|---|
| 952 | :debug:main Changing to port directory: /opt/local/var/macports/sources/nue.de.rsync.macports.org/macports/release/tarballs/ports/devel/shared-mime-info |
|---|
| 953 | :debug:main OS darwin/9.8.0 (Mac OS X 10.5) arch powerpc |
|---|
| 954 | :debug:main adding the default universal variant |
|---|
| 955 | :debug:main Reading variant descriptions from /opt/local/var/macports/sources/nue.de.rsync.macports.org/macports/release/tarballs/ports/_resources/port1.0/variant_descriptions.conf |
|---|
| 956 | :debug:main Running callback portconfigure::add_automatic_compiler_dependencies |
|---|
| 957 | :debug:main Finished running callback portconfigure::add_automatic_compiler_dependencies |
|---|
| 958 | :debug:main Running callback portbuild::add_automatic_buildsystem_dependencies |
|---|
| 959 | :debug:main Finished running callback portbuild::add_automatic_buildsystem_dependencies |
|---|
| 960 | :debug:main No need to upgrade! shared-mime-info 1.7_2 >= shared-mime-info 1.7_2 |
|---|
| 961 | :debug:main epoch: in tree: 0 installed: 0 |
|---|
| 962 | :debug:main jasper 2.0.6_2 exists in the ports tree |
|---|
| 963 | :debug:main jasper 2.0.6_2 is the latest installed |
|---|
| 964 | :debug:main jasper 2.0.6_2 is active |
|---|
| 965 | :debug:main Merging existing variants '' into variants |
|---|
| 966 | :debug:main new fully merged portvariants: |
|---|
| 967 | :debug:main Changing to port directory: /opt/local/var/macports/sources/nue.de.rsync.macports.org/macports/release/tarballs/ports/graphics/jasper |
|---|
| 968 | :debug:main OS darwin/9.8.0 (Mac OS X 10.5) arch powerpc |
|---|
| 969 | :debug:main Re-registering default for configure.dir |
|---|
| 970 | :debug:main Re-registering default for configure.pre_args |
|---|
| 971 | :debug:main Re-registering default for build.dir |
|---|
| 972 | :debug:main Re-registering default for destroot.target |
|---|
| 973 | :debug:main Sourcing PortGroup cmake 1.0 from /opt/local/var/macports/sources/nue.de.rsync.macports.org/macports/release/tarballs/ports/_resources/port1.0/group/cmake-1.0.tcl |
|---|
| 974 | :debug:main adding the default universal variant |
|---|
| 975 | :debug:main Reading variant descriptions from /opt/local/var/macports/sources/nue.de.rsync.macports.org/macports/release/tarballs/ports/_resources/port1.0/variant_descriptions.conf |
|---|
| 976 | :debug:main Running callback portconfigure::add_automatic_compiler_dependencies |
|---|
| 977 | :debug:main Finished running callback portconfigure::add_automatic_compiler_dependencies |
|---|
| 978 | :debug:main Running callback portbuild::add_automatic_buildsystem_dependencies |
|---|
| 979 | :debug:main Finished running callback portbuild::add_automatic_buildsystem_dependencies |
|---|
| 980 | :debug:main No need to upgrade! jasper 2.0.6_2 >= jasper 2.0.6_2 |
|---|
| 981 | :debug:main epoch: in tree: 0 installed: 0 |
|---|
| 982 | :debug:main jpeg 9b_0 exists in the ports tree |
|---|
| 983 | :debug:main jpeg 9b_0 is the latest installed |
|---|
| 984 | :debug:main jpeg 9b_0 is active |
|---|
| 985 | :debug:main Merging existing variants '' into variants |
|---|
| 986 | :debug:main new fully merged portvariants: |
|---|
| 987 | :debug:main Changing to port directory: /opt/local/var/macports/sources/nue.de.rsync.macports.org/macports/release/tarballs/ports/graphics/jpeg |
|---|
| 988 | :debug:main OS darwin/9.8.0 (Mac OS X 10.5) arch powerpc |
|---|
| 989 | :debug:main adding the default universal variant |
|---|
| 990 | :debug:main Reading variant descriptions from /opt/local/var/macports/sources/nue.de.rsync.macports.org/macports/release/tarballs/ports/_resources/port1.0/variant_descriptions.conf |
|---|
| 991 | :debug:main Running callback portconfigure::add_automatic_compiler_dependencies |
|---|
| 992 | :debug:main Finished running callback portconfigure::add_automatic_compiler_dependencies |
|---|
| 993 | :debug:main Running callback portbuild::add_automatic_buildsystem_dependencies |
|---|
| 994 | :debug:main Finished running callback portbuild::add_automatic_buildsystem_dependencies |
|---|
| 995 | :debug:main No need to upgrade! jpeg 9b_0 >= jpeg 9b_0 |
|---|
| 996 | :debug:main epoch: in tree: 0 installed: 0 |
|---|
| 997 | :debug:main tiff 4.0.7_0 exists in the ports tree |
|---|
| 998 | :debug:main tiff 4.0.7_0 is the latest installed |
|---|
| 999 | :debug:main tiff 4.0.7_0 is active |
|---|
| 1000 | :debug:main Merging existing variants '' into variants |
|---|
| 1001 | :debug:main new fully merged portvariants: |
|---|
| 1002 | :debug:main Changing to port directory: /opt/local/var/macports/sources/nue.de.rsync.macports.org/macports/release/tarballs/ports/graphics/tiff |
|---|
| 1003 | :debug:main OS darwin/9.8.0 (Mac OS X 10.5) arch powerpc |
|---|
| 1004 | :debug:main Sourcing PortGroup xcodeversion 1.0 from /opt/local/var/macports/sources/nue.de.rsync.macports.org/macports/release/tarballs/ports/_resources/port1.0/group/xcodeversion-1.0.tcl |
|---|
| 1005 | :debug:main Reading variant descriptions from /opt/local/var/macports/sources/nue.de.rsync.macports.org/macports/release/tarballs/ports/_resources/port1.0/variant_descriptions.conf |
|---|
| 1006 | :debug:main Sourcing PortGroup muniversal 1.0 from /opt/local/var/macports/sources/nue.de.rsync.macports.org/macports/release/tarballs/ports/_resources/port1.0/group/muniversal-1.0.tcl |
|---|
| 1007 | :debug:main universal variant already exists, so not adding the default one |
|---|
| 1008 | :debug:main Running callback portconfigure::add_automatic_compiler_dependencies |
|---|
| 1009 | :debug:main Finished running callback portconfigure::add_automatic_compiler_dependencies |
|---|
| 1010 | :debug:main Running callback portbuild::add_automatic_buildsystem_dependencies |
|---|
| 1011 | :debug:main Finished running callback portbuild::add_automatic_buildsystem_dependencies |
|---|
| 1012 | :debug:main No need to upgrade! tiff 4.0.7_0 >= tiff 4.0.7_0 |
|---|
| 1013 | :debug:main epoch: in tree: 0 installed: 0 |
|---|
| 1014 | :debug:main libepoxy 1.3.1_3 exists in the ports tree |
|---|
| 1015 | :debug:main libepoxy 1.3.1_3 +python35 is the latest installed |
|---|
| 1016 | :debug:main libepoxy 1.3.1_3 +python35 is active |
|---|
| 1017 | :debug:main Merging existing variants '+python35' into variants |
|---|
| 1018 | :debug:main new fully merged portvariants: python35 + |
|---|
| 1019 | :debug:main Changing to port directory: /opt/local/var/macports/sources/nue.de.rsync.macports.org/macports/release/tarballs/ports/graphics/libepoxy |
|---|
| 1020 | :debug:main OS darwin/9.8.0 (Mac OS X 10.5) arch powerpc |
|---|
| 1021 | :debug:main Sourcing PortGroup github 1.0 from /opt/local/var/macports/sources/nue.de.rsync.macports.org/macports/release/tarballs/ports/_resources/port1.0/group/github-1.0.tcl |
|---|
| 1022 | :debug:main adding the default universal variant |
|---|
| 1023 | :debug:main Reading variant descriptions from /opt/local/var/macports/sources/nue.de.rsync.macports.org/macports/release/tarballs/ports/_resources/port1.0/variant_descriptions.conf |
|---|
| 1024 | :debug:main Executing variant python35 provides python35 |
|---|
| 1025 | :debug:main Running callback portconfigure::add_automatic_compiler_dependencies |
|---|
| 1026 | :debug:main Finished running callback portconfigure::add_automatic_compiler_dependencies |
|---|
| 1027 | :debug:main Running callback portbuild::add_automatic_buildsystem_dependencies |
|---|
| 1028 | :debug:main Finished running callback portbuild::add_automatic_buildsystem_dependencies |
|---|
| 1029 | :debug:main No need to upgrade! libepoxy 1.3.1_3 >= libepoxy 1.3.1_3 |
|---|
| 1030 | :debug:main epoch: in tree: 20160627 installed: 20160627 |
|---|
| 1031 | :debug:main python35 3.5.2_2 exists in the ports tree |
|---|
| 1032 | :debug:main python35 3.5.2_2 is the latest installed |
|---|
| 1033 | :debug:main python35 3.5.2_2 is active |
|---|
| 1034 | :debug:main Merging existing variants '' into variants |
|---|
| 1035 | :debug:main new fully merged portvariants: |
|---|
| 1036 | :debug:main Changing to port directory: /opt/local/var/macports/sources/nue.de.rsync.macports.org/macports/release/tarballs/ports/lang/python35 |
|---|
| 1037 | :debug:main OS darwin/9.8.0 (Mac OS X 10.5) arch powerpc |
|---|
| 1038 | :debug:main Sourcing PortGroup select 1.0 from /opt/local/var/macports/sources/nue.de.rsync.macports.org/macports/release/tarballs/ports/_resources/port1.0/group/select-1.0.tcl |
|---|
| 1039 | :debug:main Reading variant descriptions from /opt/local/var/macports/sources/nue.de.rsync.macports.org/macports/release/tarballs/ports/_resources/port1.0/variant_descriptions.conf |
|---|
| 1040 | :debug:main universal variant already exists, so not adding the default one |
|---|
| 1041 | :debug:main Running callback portconfigure::add_automatic_compiler_dependencies |
|---|
| 1042 | :debug:main Finished running callback portconfigure::add_automatic_compiler_dependencies |
|---|
| 1043 | :debug:main Running callback portbuild::add_automatic_buildsystem_dependencies |
|---|
| 1044 | :debug:main Finished running callback portbuild::add_automatic_buildsystem_dependencies |
|---|
| 1045 | :debug:main No need to upgrade! python35 3.5.2_2 >= python35 3.5.2_2 |
|---|
| 1046 | :debug:main epoch: in tree: 0 installed: 0 |
|---|
| 1047 | :debug:main python3_select 0.0_1 exists in the ports tree |
|---|
| 1048 | :debug:main python3_select 0.0_1 is the latest installed |
|---|
| 1049 | :debug:main python3_select 0.0_1 is active |
|---|
| 1050 | :debug:main Merging existing variants '' into variants |
|---|
| 1051 | :debug:main new fully merged portvariants: |
|---|
| 1052 | :debug:main Changing to port directory: /opt/local/var/macports/sources/nue.de.rsync.macports.org/macports/release/tarballs/ports/sysutils/python3_select |
|---|
| 1053 | :debug:main OS darwin/9.8.0 (Mac OS X 10.5) arch powerpc |
|---|
| 1054 | :debug:main Sourcing PortGroup select 1.0 from /opt/local/var/macports/sources/nue.de.rsync.macports.org/macports/release/tarballs/ports/_resources/port1.0/group/select-1.0.tcl |
|---|
| 1055 | :debug:main universal_variant is false, so not adding the default universal variant |
|---|
| 1056 | :debug:main Running callback portconfigure::add_automatic_compiler_dependencies |
|---|
| 1057 | :debug:main Finished running callback portconfigure::add_automatic_compiler_dependencies |
|---|
| 1058 | :debug:main Running callback portbuild::add_automatic_buildsystem_dependencies |
|---|
| 1059 | :debug:main Finished running callback portbuild::add_automatic_buildsystem_dependencies |
|---|
| 1060 | :debug:main No need to upgrade! python3_select 0.0_1 >= python3_select 0.0_1 |
|---|
| 1061 | :debug:main epoch: in tree: 0 installed: 0 |
|---|
| 1062 | :debug:main hicolor-icon-theme 0.15_0 exists in the ports tree |
|---|
| 1063 | :debug:main hicolor-icon-theme 0.15_0 is the latest installed |
|---|
| 1064 | :debug:main hicolor-icon-theme 0.15_0 is active |
|---|
| 1065 | :debug:main Merging existing variants '' into variants |
|---|
| 1066 | :debug:main new fully merged portvariants: |
|---|
| 1067 | :debug:main Changing to port directory: /opt/local/var/macports/sources/nue.de.rsync.macports.org/macports/release/tarballs/ports/gnome/hicolor-icon-theme |
|---|
| 1068 | :debug:main OS darwin/9.8.0 (Mac OS X 10.5) arch powerpc |
|---|
| 1069 | :debug:main only one arch supported, so not adding the default universal variant |
|---|
| 1070 | :debug:main Running callback portconfigure::add_automatic_compiler_dependencies |
|---|
| 1071 | :debug:main Finished running callback portconfigure::add_automatic_compiler_dependencies |
|---|
| 1072 | :debug:main Running callback portbuild::add_automatic_buildsystem_dependencies |
|---|
| 1073 | :debug:main Finished running callback portbuild::add_automatic_buildsystem_dependencies |
|---|
| 1074 | :debug:main No need to upgrade! hicolor-icon-theme 0.15_0 >= hicolor-icon-theme 0.15_0 |
|---|
| 1075 | :msg:main ---> Computing dependencies for gtk3:msg:main |
|---|
| 1076 | :debug:main gtk3 has no conflicts |
|---|
| 1077 | :debug:main Searching for dependency: xz |
|---|
| 1078 | :debug:main Found Dependency: receipt exists for xz |
|---|
| 1079 | :debug:main Searching for dependency: pkgconfig |
|---|
| 1080 | :debug:main Found Dependency: receipt exists for pkgconfig |
|---|
| 1081 | :debug:main Searching for dependency: clang-3.4 |
|---|
| 1082 | :debug:main Found Dependency: receipt exists for clang-3.4 |
|---|
| 1083 | :debug:main Searching for dependency: atk |
|---|
| 1084 | :debug:main Found Dependency: receipt exists for atk |
|---|
| 1085 | :debug:main Searching for dependency: pango |
|---|
| 1086 | :debug:main Found Dependency: receipt exists for pango |
|---|
| 1087 | :debug:main Searching for dependency: gdk-pixbuf2 |
|---|
| 1088 | :debug:main Found Dependency: receipt exists for gdk-pixbuf2 |
|---|
| 1089 | :debug:main Searching for dependency: glib2 |
|---|
| 1090 | :debug:main Found Dependency: receipt exists for glib2 |
|---|
| 1091 | :debug:main Searching for dependency: gobject-introspection |
|---|
| 1092 | :debug:main Found Dependency: receipt exists for gobject-introspection |
|---|
| 1093 | :debug:main Searching for dependency: libepoxy |
|---|
| 1094 | :debug:main Found Dependency: receipt exists for libepoxy |
|---|
| 1095 | :debug:main Searching for dependency: shared-mime-info |
|---|
| 1096 | :debug:main Found Dependency: receipt exists for shared-mime-info |
|---|
| 1097 | :debug:main Searching for dependency: hicolor-icon-theme |
|---|
| 1098 | :debug:main Found Dependency: receipt exists for hicolor-icon-theme |
|---|
| 1099 | :debug:main Executing org.macports.main (gtk3) |
|---|
| 1100 | :debug:main changing euid/egid - current euid: 0 - current egid: 0 |
|---|
| 1101 | :debug:main egid changed to: 502 |
|---|
| 1102 | :debug:main euid changed to: 502 |
|---|
| 1103 | :debug:archivefetch archivefetch phase started at Wed Dec 28 22:46:50 CET 2016 |
|---|
| 1104 | :msg:archivefetch ---> Fetching archive for gtk3 |
|---|
| 1105 | :debug:archivefetch Executing proc-pre-org.macports.archivefetch-archivefetch-0 |
|---|
| 1106 | :debug:archivefetch Active variants check for archivefetch-type install considers depends_lib depends_run: atk pango gdk-pixbuf2 glib2 gobject-introspection libepoxy shared-mime-info hicolor-icon-theme |
|---|
| 1107 | :debug:archivefetch Ignoring active_variants requirement for cairo because archivefetch-type install only considers depends_lib depends_run and those do not contain cairo |
|---|
| 1108 | :debug:archivefetch Checking pango for active variants for depspec 'path:lib/pkgconfig/pango.pc:pango' |
|---|
| 1109 | :debug:archivefetch pango is installed with the following variants: +quartz+x11 |
|---|
| 1110 | :debug:archivefetch required: quartz, forbidden: |
|---|
| 1111 | :debug:archivefetch accepted |
|---|
| 1112 | :debug:archivefetch Checking gdk-pixbuf2 for active variants for depspec 'port:gdk-pixbuf2' |
|---|
| 1113 | :debug:archivefetch gdk-pixbuf2 is installed with the following variants: |
|---|
| 1114 | :debug:archivefetch required: , forbidden: x11 |
|---|
| 1115 | :debug:archivefetch accepted |
|---|
| 1116 | :debug:archivefetch Executing org.macports.archivefetch (gtk3) |
|---|
| 1117 | :debug:archivefetch euid/egid changed to: 0/0 |
|---|
| 1118 | :debug:archivefetch chowned /opt/local/var/macports/incoming to macports |
|---|
| 1119 | :debug:archivefetch euid/egid changed to: 502/502 |
|---|
| 1120 | :info:archivefetch ---> gtk3-3.22.5_0+quartz.darwin_9.ppc.tbz2 doesn't seem to exist in /opt/local/var/macports/incoming/verified |
|---|
| 1121 | :msg:archivefetch ---> Attempting to fetch gtk3-3.22.5_0+quartz.darwin_9.ppc.tbz2 from http://packages.macports.org/gtk3 |
|---|
| 1122 | :debug:archivefetch Fetching archive failed: The requested URL returned error: 404 |
|---|
| 1123 | :msg:archivefetch ---> Attempting to fetch gtk3-3.22.5_0+quartz.darwin_9.ppc.tbz2 from http://nue.de.packages.macports.org/gtk3 |
|---|
| 1124 | :debug:archivefetch Fetching archive failed: The requested URL returned error: 404 |
|---|
| 1125 | :msg:archivefetch ---> Attempting to fetch gtk3-3.22.5_0+quartz.darwin_9.ppc.tbz2 from http://lil.fr.packages.macports.org/gtk3 |
|---|
| 1126 | :debug:archivefetch Fetching archive failed: The requested URL returned error: 404 |
|---|
| 1127 | :debug:archivefetch Privilege de-escalation not attempted as not running as root. |
|---|
| 1128 | :debug:fetch fetch phase started at Wed Dec 28 22:47:10 CET 2016 |
|---|
| 1129 | :notice:fetch ---> Fetching distfiles for gtk3 |
|---|
| 1130 | :debug:fetch Executing org.macports.fetch (gtk3) |
|---|
| 1131 | :debug:fetch Privilege de-escalation not attempted as not running as root. |
|---|
| 1132 | :debug:checksum checksum phase started at Wed Dec 28 22:47:10 CET 2016 |
|---|
| 1133 | :notice:checksum ---> Verifying checksums for gtk3 |
|---|
| 1134 | :debug:checksum Executing org.macports.checksum (gtk3) |
|---|
| 1135 | :info:checksum ---> Checksumming gtk+-3.22.5.tar.xz |
|---|
| 1136 | :debug:checksum Calculated (rmd160) is 80d7917bccc5a7eedde03e6efb8791be28f86053 |
|---|
| 1137 | :debug:checksum Correct (rmd160) checksum for gtk+-3.22.5.tar.xz |
|---|
| 1138 | :debug:checksum Calculated (sha256) is 693fa0ac643c59ccd51db99cabe476b4e0a41fd4f0c3c8b3e3ef38f94b2e7334 |
|---|
| 1139 | :debug:checksum Correct (sha256) checksum for gtk+-3.22.5.tar.xz |
|---|
| 1140 | :debug:checksum Privilege de-escalation not attempted as not running as root. |
|---|
| 1141 | :debug:extract extract phase started at Wed Dec 28 22:47:12 CET 2016 |
|---|
| 1142 | :notice:extract ---> Extracting gtk3 |
|---|
| 1143 | :debug:extract setting option extract.cmd to /sw/bin/xz |
|---|
| 1144 | :debug:extract Executing proc-pre-org.macports.extract-extract-0 |
|---|
| 1145 | :debug:extract Executing org.macports.extract (gtk3) |
|---|
| 1146 | :info:extract ---> Extracting gtk+-3.22.5.tar.xz |
|---|
| 1147 | :debug:extract setting option extract.args to '/opt/local/var/macports/distfiles/gtk3/gtk+-3.22.5.tar.xz' |
|---|
| 1148 | :debug:extract Environment: |
|---|
| 1149 | CC_PRINT_OPTIONS='YES' |
|---|
| 1150 | CC_PRINT_OPTIONS_FILE='/opt/local/var/macports/build/_opt_local_var_macports_sources_nue.de.rsync.macports.org_macports_release_tarballs_ports_gnome_gtk3/gtk3/work/.CC_PRINT_OPTIONS' |
|---|
| 1151 | CPATH='/opt/local/include' |
|---|
| 1152 | LIBRARY_PATH='/opt/local/lib' |
|---|
| 1153 | MACOSX_DEPLOYMENT_TARGET='10.5' |
|---|
| 1154 | :debug:extract Assembled command: 'cd "/opt/local/var/macports/build/_opt_local_var_macports_sources_nue.de.rsync.macports.org_macports_release_tarballs_ports_gnome_gtk3/gtk3/work" && /sw/bin/xz -dc '/opt/local/var/macports/distfiles/gtk3/gtk+-3.22.5.tar.xz' | /usr/bin/gnutar --no-same-owner -xf -' |
|---|
| 1155 | :debug:extract Executing command line: cd "/opt/local/var/macports/build/_opt_local_var_macports_sources_nue.de.rsync.macports.org_macports_release_tarballs_ports_gnome_gtk3/gtk3/work" && /sw/bin/xz -dc '/opt/local/var/macports/distfiles/gtk3/gtk+-3.22.5.tar.xz' | /usr/bin/gnutar --no-same-owner -xf - |
|---|
| 1156 | :debug:extract euid/egid changed to: 0/0 |
|---|
| 1157 | :debug:extract chowned /opt/local/var/macports/build/_opt_local_var_macports_sources_nue.de.rsync.macports.org_macports_release_tarballs_ports_gnome_gtk3/gtk3/work to macports |
|---|
| 1158 | :debug:extract euid/egid changed to: 502/502 |
|---|
| 1159 | :debug:extract Privilege de-escalation not attempted as not running as root. |
|---|
| 1160 | :debug:patch patch phase started at Wed Dec 28 22:47:38 CET 2016 |
|---|
| 1161 | :debug:patch Executing org.macports.patch (gtk3) |
|---|
| 1162 | :notice:patch ---> Applying patches to gtk3 |
|---|
| 1163 | :info:patch ---> Applying nawk.patch |
|---|
| 1164 | :debug:patch Environment: |
|---|
| 1165 | CC_PRINT_OPTIONS='YES' |
|---|
| 1166 | CC_PRINT_OPTIONS_FILE='/opt/local/var/macports/build/_opt_local_var_macports_sources_nue.de.rsync.macports.org_macports_release_tarballs_ports_gnome_gtk3/gtk3/work/.CC_PRINT_OPTIONS' |
|---|
| 1167 | CPATH='/opt/local/include' |
|---|
| 1168 | LIBRARY_PATH='/opt/local/lib' |
|---|
| 1169 | MACOSX_DEPLOYMENT_TARGET='10.5' |
|---|
| 1170 | :debug:patch Assembled command: 'cd "/opt/local/var/macports/build/_opt_local_var_macports_sources_nue.de.rsync.macports.org_macports_release_tarballs_ports_gnome_gtk3/gtk3/work/gtk+-3.22.5" && /usr/bin/patch -p0' |
|---|
| 1171 | :debug:patch Executing command line: cd "/opt/local/var/macports/build/_opt_local_var_macports_sources_nue.de.rsync.macports.org_macports_release_tarballs_ports_gnome_gtk3/gtk3/work/gtk+-3.22.5" && /usr/bin/patch -p0 < '/opt/local/var/macports/sources/nue.de.rsync.macports.org/macports/release/tarballs/ports/gnome/gtk3/files/nawk.patch' |
|---|
| 1172 | :info:patch patching file configure |
|---|
| 1173 | :info:patch ---> Applying O_CLOEXEC-10.6-and-earlier.patch |
|---|
| 1174 | :debug:patch Environment: |
|---|
| 1175 | CC_PRINT_OPTIONS='YES' |
|---|
| 1176 | CC_PRINT_OPTIONS_FILE='/opt/local/var/macports/build/_opt_local_var_macports_sources_nue.de.rsync.macports.org_macports_release_tarballs_ports_gnome_gtk3/gtk3/work/.CC_PRINT_OPTIONS' |
|---|
| 1177 | CPATH='/opt/local/include' |
|---|
| 1178 | LIBRARY_PATH='/opt/local/lib' |
|---|
| 1179 | MACOSX_DEPLOYMENT_TARGET='10.5' |
|---|
| 1180 | :debug:patch Assembled command: 'cd "/opt/local/var/macports/build/_opt_local_var_macports_sources_nue.de.rsync.macports.org_macports_release_tarballs_ports_gnome_gtk3/gtk3/work/gtk+-3.22.5" && /usr/bin/patch -p0' |
|---|
| 1181 | :debug:patch Executing command line: cd "/opt/local/var/macports/build/_opt_local_var_macports_sources_nue.de.rsync.macports.org_macports_release_tarballs_ports_gnome_gtk3/gtk3/work/gtk+-3.22.5" && /usr/bin/patch -p0 < '/opt/local/var/macports/sources/nue.de.rsync.macports.org/macports/release/tarballs/ports/gnome/gtk3/files/O_CLOEXEC-10.6-and-earlier.patch' |
|---|
| 1182 | :info:patch patching file gtk/gtkprintoperation-portal.c |
|---|
| 1183 | :info:patch ---> Applying patch-gdk_quartz_gdkcursor-quartz-10_6_compat.diff |
|---|
| 1184 | :debug:patch Environment: |
|---|
| 1185 | CC_PRINT_OPTIONS='YES' |
|---|
| 1186 | CC_PRINT_OPTIONS_FILE='/opt/local/var/macports/build/_opt_local_var_macports_sources_nue.de.rsync.macports.org_macports_release_tarballs_ports_gnome_gtk3/gtk3/work/.CC_PRINT_OPTIONS' |
|---|
| 1187 | CPATH='/opt/local/include' |
|---|
| 1188 | LIBRARY_PATH='/opt/local/lib' |
|---|
| 1189 | MACOSX_DEPLOYMENT_TARGET='10.5' |
|---|
| 1190 | :debug:patch Assembled command: 'cd "/opt/local/var/macports/build/_opt_local_var_macports_sources_nue.de.rsync.macports.org_macports_release_tarballs_ports_gnome_gtk3/gtk3/work/gtk+-3.22.5" && /usr/bin/patch -p0' |
|---|
| 1191 | :debug:patch Executing command line: cd "/opt/local/var/macports/build/_opt_local_var_macports_sources_nue.de.rsync.macports.org_macports_release_tarballs_ports_gnome_gtk3/gtk3/work/gtk+-3.22.5" && /usr/bin/patch -p0 < '/opt/local/var/macports/sources/nue.de.rsync.macports.org/macports/release/tarballs/ports/gnome/gtk3/files/patch-gdk_quartz_gdkcursor-quartz-10_6_compat.diff' |
|---|
| 1192 | :info:patch patching file gdk/quartz/gdkcursor-quartz.c |
|---|
| 1193 | :debug:patch Privilege de-escalation not attempted as not running as root. |
|---|
| 1194 | :debug:configure configure phase started at Wed Dec 28 22:47:38 CET 2016 |
|---|
| 1195 | :notice:configure ---> Configuring gtk3 |
|---|
| 1196 | :debug:configure Using compiler 'MacPorts Clang 3.4' |
|---|
| 1197 | :debug:configure Executing proc-pre-org.macports.configure-configure-0 |
|---|
| 1198 | :debug:configure Active variants check for source-type install considers depends_fetch depends_extract depends_lib depends_build depends_run: xz atk pango gdk-pixbuf2 glib2 gobject-introspection libepoxy pkgconfig clang-3.4 shared-mime-info hicolor-icon-theme |
|---|
| 1199 | :debug:configure Ignoring active_variants requirement for cairo because source-type install only considers depends_fetch depends_extract depends_lib depends_build depends_run and those do not contain cairo |
|---|
| 1200 | :debug:configure Checking pango for active variants for depspec 'path:lib/pkgconfig/pango.pc:pango' |
|---|
| 1201 | :debug:configure pango is installed with the following variants: +quartz+x11 |
|---|
| 1202 | :debug:configure required: quartz, forbidden: |
|---|
| 1203 | :debug:configure accepted |
|---|
| 1204 | :debug:configure Checking gdk-pixbuf2 for active variants for depspec 'port:gdk-pixbuf2' |
|---|
| 1205 | :debug:configure gdk-pixbuf2 is installed with the following variants: |
|---|
| 1206 | :debug:configure required: , forbidden: x11 |
|---|
| 1207 | :debug:configure accepted |
|---|
| 1208 | :debug:configure Executing proc-pre-org.macports.configure-configure-1 |
|---|
| 1209 | :debug:configure Executing org.macports.configure (gtk3) |
|---|
| 1210 | :debug:configure Environment: |
|---|
| 1211 | CC='/opt/local/bin/clang-mp-3.4 -arch ppc' |
|---|
| 1212 | CC_PRINT_OPTIONS='YES' |
|---|
| 1213 | CC_PRINT_OPTIONS_FILE='/opt/local/var/macports/build/_opt_local_var_macports_sources_nue.de.rsync.macports.org_macports_release_tarballs_ports_gnome_gtk3/gtk3/work/.CC_PRINT_OPTIONS' |
|---|
| 1214 | CFLAGS='-pipe -Os -fstrict-aliasing -arch ppc' |
|---|
| 1215 | CPATH='/opt/local/include' |
|---|
| 1216 | CPPFLAGS='-I/opt/local/include -DX_LOCALE' |
|---|
| 1217 | CXX='/opt/local/bin/clang++-mp-3.4' |
|---|
| 1218 | CXXFLAGS='-pipe -Os -stdlib=libstdc++ -arch ppc' |
|---|
| 1219 | F77FLAGS='-m32' |
|---|
| 1220 | F90FLAGS='-pipe -Os -m32' |
|---|
| 1221 | FCFLAGS='-pipe -Os -m32' |
|---|
| 1222 | FFLAGS='-pipe -Os' |
|---|
| 1223 | INSTALL='/usr/bin/install -c' |
|---|
| 1224 | LDFLAGS='-L/opt/local/lib -Wl,-headerpad_max_install_names -arch ppc' |
|---|
| 1225 | LIBRARY_PATH='/opt/local/lib' |
|---|
| 1226 | MACOSX_DEPLOYMENT_TARGET='10.5' |
|---|
| 1227 | OBJC='/opt/local/bin/clang-mp-3.4' |
|---|
| 1228 | OBJCFLAGS='-pipe -Os -arch ppc' |
|---|
| 1229 | OBJCXX='/opt/local/bin/clang++-mp-3.4' |
|---|
| 1230 | OBJCXXFLAGS='-pipe -Os -stdlib=libstdc++ -arch ppc' |
|---|
| 1231 | :debug:configure Assembled command: 'cd "/opt/local/var/macports/build/_opt_local_var_macports_sources_nue.de.rsync.macports.org_macports_release_tarballs_ports_gnome_gtk3/gtk3/work/gtk+-3.22.5" && ./configure --prefix=/opt/local --enable-static --disable-glibtest --enable-introspection --disable-cloudprint --disable-mir-backend --disable-wayland-backend --disable-schemas-compile gio_can_sniff=yes --enable-quartz-backend' |
|---|
| 1232 | :debug:configure Executing command line: cd "/opt/local/var/macports/build/_opt_local_var_macports_sources_nue.de.rsync.macports.org_macports_release_tarballs_ports_gnome_gtk3/gtk3/work/gtk+-3.22.5" && ./configure --prefix=/opt/local --enable-static --disable-glibtest --enable-introspection --disable-cloudprint --disable-mir-backend --disable-wayland-backend --disable-schemas-compile gio_can_sniff=yes --enable-quartz-backend |
|---|
| 1233 | :info:configure checking build system type... powerpc-apple-darwin9.8.0 |
|---|
| 1234 | :info:configure checking host system type... powerpc-apple-darwin9.8.0 |
|---|
| 1235 | :info:configure checking for a BSD-compatible install... /usr/bin/install -c |
|---|
| 1236 | :info:configure checking whether build environment is sane... yes |
|---|
| 1237 | :info:configure checking for a thread-safe mkdir -p... /opt/local/bin/gmkdir -p |
|---|
| 1238 | :info:configure checking for gawk... gawk |
|---|
| 1239 | :info:configure checking whether make sets $(MAKE)... yes |
|---|
| 1240 | :info:configure checking whether make supports nested variables... yes |
|---|
| 1241 | :info:configure checking whether UID '502' is supported by ustar format... yes |
|---|
| 1242 | :info:configure checking whether GID '502' is supported by ustar format... yes |
|---|
| 1243 | :info:configure checking how to create a ustar tar archive... gnutar |
|---|
| 1244 | :info:configure checking whether to enable maintainer-specific portions of Makefiles... yes |
|---|
| 1245 | :info:configure checking whether make supports nested variables... (cached) yes |
|---|
| 1246 | :info:configure checking for gcc... /opt/local/bin/clang-mp-3.4 -arch ppc |
|---|
| 1247 | :info:configure checking whether the C compiler works... yes |
|---|
| 1248 | :info:configure checking for C compiler default output file name... a.out |
|---|
| 1249 | :info:configure checking for suffix of executables... |
|---|
| 1250 | :info:configure checking whether we are cross compiling... no |
|---|
| 1251 | :info:configure checking for suffix of object files... o |
|---|
| 1252 | :info:configure checking whether we are using the GNU C compiler... yes |
|---|
| 1253 | :info:configure checking whether /opt/local/bin/clang-mp-3.4 -arch ppc accepts -g... yes |
|---|
| 1254 | :info:configure checking for /opt/local/bin/clang-mp-3.4 -arch ppc option to accept ISO C89... none needed |
|---|
| 1255 | :info:configure checking whether /opt/local/bin/clang-mp-3.4 -arch ppc understands -c and -o together... yes |
|---|
| 1256 | :info:configure checking for style of include used by make... GNU |
|---|
| 1257 | :info:configure checking dependency style of /opt/local/bin/clang-mp-3.4 -arch ppc... gcc3 |
|---|
| 1258 | :info:configure checking how to run the C preprocessor... /opt/local/bin/clang-mp-3.4 -arch ppc -E |
|---|
| 1259 | :info:configure checking for gcc... gcc |
|---|
| 1260 | :info:configure checking whether we are using the GNU C compiler... (cached) yes |
|---|
| 1261 | :info:configure checking whether gcc accepts -g... yes |
|---|
| 1262 | :info:configure checking for gcc option to accept ISO C89... (cached) none needed |
|---|
| 1263 | :info:configure checking whether gcc understands -c and -o together... (cached) yes |
|---|
| 1264 | :info:configure checking dependency style of gcc... (cached) gcc3 |
|---|
| 1265 | :info:configure checking how to run the C preprocessor... gcc -E |
|---|
| 1266 | :info:configure checking whether /opt/local/bin/clang-mp-3.4 -arch ppc and cc understand -c and -o together... yes |
|---|
| 1267 | :info:configure checking whether make sets $(MAKE)... (cached) yes |
|---|
| 1268 | :info:configure checking for grep that handles long lines and -e... /opt/local/bin/grep |
|---|
| 1269 | :info:configure checking for egrep... /opt/local/bin/grep -E |
|---|
| 1270 | :info:configure checking for ANSI C header files... no |
|---|
| 1271 | :info:configure checking for sys/types.h... yes |
|---|
| 1272 | :info:configure checking for sys/stat.h... yes |
|---|
| 1273 | :info:configure checking for stdlib.h... yes |
|---|
| 1274 | :info:configure checking for string.h... yes |
|---|
| 1275 | :info:configure checking for memory.h... yes |
|---|
| 1276 | :info:configure checking for strings.h... yes |
|---|
| 1277 | :info:configure checking for inttypes.h... yes |
|---|
| 1278 | :info:configure checking for stdint.h... yes |
|---|
| 1279 | :info:configure checking for unistd.h... yes |
|---|
| 1280 | :info:configure checking minix/config.h usability... no |
|---|
| 1281 | :info:configure checking minix/config.h presence... no |
|---|
| 1282 | :info:configure checking for minix/config.h... no |
|---|
| 1283 | :info:configure checking whether it is safe to define __EXTENSIONS__... yes |
|---|
| 1284 | :info:configure checking for a sed that does not truncate output... /opt/local/bin/gsed |
|---|
| 1285 | :info:configure checking whether NLS is requested... yes |
|---|
| 1286 | :info:configure checking for msgfmt... /opt/local/bin/msgfmt |
|---|
| 1287 | :info:configure checking for gmsgfmt... /opt/local/bin/msgfmt |
|---|
| 1288 | :info:configure checking for xgettext... /opt/local/bin/xgettext |
|---|
| 1289 | :info:configure checking for msgmerge... /opt/local/bin/msgmerge |
|---|
| 1290 | :info:configure checking for ld used by /opt/local/bin/clang-mp-3.4 -arch ppc... /opt/local/libexec/llvm-3.4/bin/ld |
|---|
| 1291 | :info:configure checking if the linker (/opt/local/libexec/llvm-3.4/bin/ld) is GNU ld... no |
|---|
| 1292 | :info:configure checking for shared library run path origin... done |
|---|
| 1293 | :info:configure checking for CFPreferencesCopyAppValue... yes |
|---|
| 1294 | :info:configure checking for CFLocaleCopyCurrent... yes |
|---|
| 1295 | :info:configure checking for GNU gettext in libc... no |
|---|
| 1296 | :info:configure checking for iconv... yes |
|---|
| 1297 | :info:configure checking for working iconv... yes |
|---|
| 1298 | :info:configure checking how to link with libiconv... -liconv |
|---|
| 1299 | :info:configure checking for GNU gettext in libintl... no |
|---|
| 1300 | :info:configure checking whether to use NLS... no |
|---|
| 1301 | :info:configure checking for native Win32... no |
|---|
| 1302 | :info:configure checking whether we are using the GNU C++ compiler... yes |
|---|
| 1303 | :info:configure checking whether /opt/local/bin/clang++-mp-3.4 accepts -g... yes |
|---|
| 1304 | :info:configure checking dependency style of /opt/local/bin/clang++-mp-3.4... gcc3 |
|---|
| 1305 | :info:configure checking how to print strings... printf |
|---|
| 1306 | :info:configure checking for a sed that does not truncate output... (cached) /opt/local/bin/gsed |
|---|
| 1307 | :info:configure checking for fgrep... /opt/local/bin/grep -F |
|---|
| 1308 | :info:configure checking for ld used by /opt/local/bin/clang-mp-3.4 -arch ppc... /opt/local/libexec/llvm-3.4/bin/ld |
|---|
| 1309 | :info:configure checking if the linker (/opt/local/libexec/llvm-3.4/bin/ld) is GNU ld... no |
|---|
| 1310 | :info:configure checking for BSD- or MS-compatible name lister (nm)... /usr/bin/nm -p |
|---|
| 1311 | :info:configure checking the name lister (/usr/bin/nm -p) interface... BSD nm |
|---|
| 1312 | :info:configure checking whether ln -s works... yes |
|---|
| 1313 | :info:configure checking the maximum length of command line arguments... 196608 |
|---|
| 1314 | :info:configure checking how to convert powerpc-apple-darwin9.8.0 file names to powerpc-apple-darwin9.8.0 format... func_convert_file_noop |
|---|
| 1315 | :info:configure checking how to convert powerpc-apple-darwin9.8.0 file names to toolchain format... func_convert_file_noop |
|---|
| 1316 | :info:configure checking for /opt/local/libexec/llvm-3.4/bin/ld option to reload object files... -r |
|---|
| 1317 | :info:configure checking for objdump... no |
|---|
| 1318 | :info:configure checking how to recognize dependent libraries... pass_all |
|---|
| 1319 | :info:configure checking for dlltool... no |
|---|
| 1320 | :info:configure checking how to associate runtime and link libraries... printf %s\n |
|---|
| 1321 | :info:configure checking for ar... ar |
|---|
| 1322 | :info:configure checking for archiver @FILE support... no |
|---|
| 1323 | :info:configure checking for strip... strip |
|---|
| 1324 | :info:configure checking for ranlib... ranlib |
|---|
| 1325 | :info:configure checking command to parse /usr/bin/nm -p output from /opt/local/bin/clang-mp-3.4 -arch ppc object... ok |
|---|
| 1326 | :info:configure checking for sysroot... no |
|---|
| 1327 | :info:configure checking for a working dd... /bin/dd |
|---|
| 1328 | :info:configure checking how to truncate binary pipes... /bin/dd bs=4096 count=1 |
|---|
| 1329 | :info:configure checking for mt... no |
|---|
| 1330 | :info:configure checking if : is a manifest tool... no |
|---|
| 1331 | :info:configure checking for dsymutil... dsymutil |
|---|
| 1332 | :info:configure checking for nmedit... nmedit |
|---|
| 1333 | :info:configure checking for lipo... lipo |
|---|
| 1334 | :info:configure checking for otool... otool |
|---|
| 1335 | :info:configure checking for otool64... no |
|---|
| 1336 | :info:configure checking for -single_module linker flag... yes |
|---|
| 1337 | :info:configure checking for -exported_symbols_list linker flag... yes |
|---|
| 1338 | :info:configure checking for -force_load linker flag... yes |
|---|
| 1339 | :info:configure checking for dlfcn.h... yes |
|---|
| 1340 | :info:configure checking for objdir... .libs |
|---|
| 1341 | :info:configure checking if /opt/local/bin/clang-mp-3.4 -arch ppc supports -fno-rtti -fno-exceptions... yes |
|---|
| 1342 | :info:configure checking for /opt/local/bin/clang-mp-3.4 -arch ppc option to produce PIC... -fno-common -DPIC |
|---|
| 1343 | :info:configure checking if /opt/local/bin/clang-mp-3.4 -arch ppc PIC flag -fno-common -DPIC works... yes |
|---|
| 1344 | :info:configure checking if /opt/local/bin/clang-mp-3.4 -arch ppc static flag -static works... no |
|---|
| 1345 | :info:configure checking if /opt/local/bin/clang-mp-3.4 -arch ppc supports -c -o file.o... yes |
|---|
| 1346 | :info:configure checking if /opt/local/bin/clang-mp-3.4 -arch ppc supports -c -o file.o... (cached) yes |
|---|
| 1347 | :info:configure checking whether the /opt/local/bin/clang-mp-3.4 -arch ppc linker (/opt/local/libexec/llvm-3.4/bin/ld) supports shared libraries... yes |
|---|
| 1348 | :info:configure checking dynamic linker characteristics... darwin9.8.0 dyld |
|---|
| 1349 | :info:configure checking how to hardcode library paths into programs... immediate |
|---|
| 1350 | :info:configure checking whether stripping libraries is possible... yes |
|---|
| 1351 | :info:configure checking if libtool supports shared libraries... yes |
|---|
| 1352 | :info:configure checking whether to build shared libraries... yes |
|---|
| 1353 | :info:configure checking whether to build static libraries... yes |
|---|
| 1354 | :info:configure checking how to run the C++ preprocessor... /opt/local/bin/clang++-mp-3.4 -E |
|---|
| 1355 | :info:configure checking for ld used by /opt/local/bin/clang++-mp-3.4... /opt/local/libexec/llvm-3.4/bin/ld |
|---|
| 1356 | :info:configure checking if the linker (/opt/local/libexec/llvm-3.4/bin/ld) is GNU ld... no |
|---|
| 1357 | :info:configure checking whether the /opt/local/bin/clang++-mp-3.4 linker (/opt/local/libexec/llvm-3.4/bin/ld) supports shared libraries... yes |
|---|
| 1358 | :info:configure checking for /opt/local/bin/clang++-mp-3.4 option to produce PIC... -fno-common -DPIC |
|---|
| 1359 | :info:configure checking if /opt/local/bin/clang++-mp-3.4 PIC flag -fno-common -DPIC works... yes |
|---|
| 1360 | :info:configure checking if /opt/local/bin/clang++-mp-3.4 static flag -static works... no |
|---|
| 1361 | :info:configure checking if /opt/local/bin/clang++-mp-3.4 supports -c -o file.o... yes |
|---|
| 1362 | :info:configure checking if /opt/local/bin/clang++-mp-3.4 supports -c -o file.o... (cached) yes |
|---|
| 1363 | :info:configure checking whether the /opt/local/bin/clang++-mp-3.4 linker (/opt/local/libexec/llvm-3.4/bin/ld) supports shared libraries... yes |
|---|
| 1364 | :info:configure checking dynamic linker characteristics... darwin9.8.0 dyld |
|---|
| 1365 | :info:configure checking how to hardcode library paths into programs... immediate |
|---|
| 1366 | :info:configure configure: creating ./config.lt |
|---|
| 1367 | :info:configure config.lt: creating libtool |
|---|
| 1368 | :info:configure checking for special C compiler options needed for large files... no |
|---|
| 1369 | :info:configure checking for _FILE_OFFSET_BITS value needed for large files... no |
|---|
| 1370 | :info:configure checking dependency style of /opt/local/bin/clang-mp-3.4 -arch ppc... gcc3 |
|---|
| 1371 | :info:configure checking for nm... /usr/bin/nm -p |
|---|
| 1372 | :info:configure checking for some Win32 platform... no |
|---|
| 1373 | :info:configure checking for shm_open in -lrt... no |
|---|
| 1374 | :info:configure checking for posix_fallocate... no |
|---|
| 1375 | :info:configure checking for flockfile... yes |
|---|
| 1376 | :info:configure checking for _lock_file... no |
|---|
| 1377 | :info:configure checking for pkg-config... /opt/local/bin/pkg-config |
|---|
| 1378 | :info:configure checking pkg-config is at least version 0.9.0... yes |
|---|
| 1379 | :info:configure checking whether build environment is sane... yes |
|---|
| 1380 | :info:configure checking for BASE_DEPENDENCIES... yes |
|---|
| 1381 | :info:configure checking for CAIRO_BACKEND... yes |
|---|
| 1382 | :info:configure checking for GMODULE... yes |
|---|
| 1383 | :info:configure checking whether to write dependencies into .pc files... yes |
|---|
| 1384 | :info:configure checking for perl5... /opt/local/bin/perl5 |
|---|
| 1385 | :info:configure checking for lstat... yes |
|---|
| 1386 | :info:configure checking for mkstemp... yes |
|---|
| 1387 | :info:configure checking for localtime_r... yes |
|---|
| 1388 | :info:configure checking for _NL_TIME_FIRST_WEEKDAY... no |
|---|
| 1389 | :info:configure checking for _NL_MEASUREMENT_MEASUREMENT... no |
|---|
| 1390 | :info:configure checking for _NL_PAPER_HEIGHT... no |
|---|
| 1391 | :info:configure checking for _NL_PAPER_WIDTH... no |
|---|
| 1392 | :info:configure checking for extra flags to get ANSI library prototypes... none needed |
|---|
| 1393 | :info:configure checking for the BeOS... no |
|---|
| 1394 | :info:configure checking for HP-UX... no |
|---|
| 1395 | :info:configure checking for pkg-config... (cached) /opt/local/bin/pkg-config |
|---|
| 1396 | :info:configure checking pkg-config is at least version 0.16... yes |
|---|
| 1397 | :info:configure checking for GLIB - version >= 2.49.4... yes (version 2.50.2) |
|---|
| 1398 | :info:configure checking for pkg-config... /opt/local/bin/pkg-config |
|---|
| 1399 | :info:configure checking build system's pkg-config is at least version 0.16... yes |
|---|
| 1400 | :info:configure checking for bind_textdomain_codeset... yes |
|---|
| 1401 | :info:configure checking linux/memfd.h usability... no |
|---|
| 1402 | :info:configure checking linux/memfd.h presence... no |
|---|
| 1403 | :info:configure checking for linux/memfd.h... no |
|---|
| 1404 | :info:configure checking sys/mman.h usability... yes |
|---|
| 1405 | :info:configure checking sys/mman.h presence... yes |
|---|
| 1406 | :info:configure checking for sys/mman.h... yes |
|---|
| 1407 | :info:configure checking sys/time.h usability... yes |
|---|
| 1408 | :info:configure checking sys/time.h presence... yes |
|---|
| 1409 | :info:configure checking for sys/time.h... yes |
|---|
| 1410 | :info:configure checking for unistd.h... (cached) yes |
|---|
| 1411 | :info:configure checking ftw.h usability... yes |
|---|
| 1412 | :info:configure checking ftw.h presence... yes |
|---|
| 1413 | :info:configure checking for ftw.h... yes |
|---|
| 1414 | :info:configure checking for GNU ftw extensions... no |
|---|
| 1415 | :info:configure checking for stdlib.h... (cached) yes |
|---|
| 1416 | :info:configure checking for unistd.h... (cached) yes |
|---|
| 1417 | :info:configure checking for sys/param.h... yes |
|---|
| 1418 | :info:configure checking for getpagesize... yes |
|---|
| 1419 | :info:configure checking for working mmap... yes |
|---|
| 1420 | :info:configure checking for mallinfo... no |
|---|
| 1421 | :info:configure checking for getresuid... no |
|---|
| 1422 | :info:configure checking for uid_t in sys/types.h... yes |
|---|
| 1423 | :info:configure checking for round in -lm... yes |
|---|
| 1424 | :info:configure checking for round... yes |
|---|
| 1425 | :info:configure checking for rint... yes |
|---|
| 1426 | :info:configure checking for nearbyint... yes |
|---|
| 1427 | :info:configure checking for sincos... no |
|---|
| 1428 | :info:configure checking for exp2... yes |
|---|
| 1429 | :info:configure checking for log2... yes |
|---|
| 1430 | :info:configure checking whether isnan is declared... yes |
|---|
| 1431 | :info:configure checking whether isinf is declared... yes |
|---|
| 1432 | :info:configure checking crt_externs.h usability... yes |
|---|
| 1433 | :info:configure checking crt_externs.h presence... yes |
|---|
| 1434 | :info:configure checking for crt_externs.h... yes |
|---|
| 1435 | :info:configure checking for _NSGetEnviron... yes |
|---|
| 1436 | :info:configure checking whether to build dynamic modules... yes |
|---|
| 1437 | :info:configure checking whether dynamic modules work... yes |
|---|
| 1438 | :info:configure checking immodules to build... |
|---|
| 1439 | :info:configure checking sys/systeminfo.h usability... no |
|---|
| 1440 | :info:configure checking sys/systeminfo.h presence... no |
|---|
| 1441 | :info:configure checking for sys/systeminfo.h... no |
|---|
| 1442 | :info:configure checking sys/sysinfo.h usability... no |
|---|
| 1443 | :info:configure checking sys/sysinfo.h presence... no |
|---|
| 1444 | :info:configure checking for sys/sysinfo.h... no |
|---|
| 1445 | :info:configure checking Pango flags... -I/opt/local/include/pango-1.0 -I/opt/local/include/harfbuzz -I/opt/local/include -I/opt/local/include/pango-1.0 -I/opt/local/include/cairo -I/opt/local/include/glib-2.0 -I/opt/local/lib/glib-2.0/include -I/opt/local/include -I/opt/local/include/pixman-1 -I/opt/local/include -I/opt/local/include/freetype2 -I/opt/local/include -I/opt/local/include/freetype2 -I/opt/local/include/libpng16 -I/opt/local/include -L/opt/local/lib -lpangocairo-1.0 -lpango-1.0 -lgobject-2.0 -lglib-2.0 -lintl -lcairo |
|---|
| 1446 | :info:configure checking for GDK_DEP... yes |
|---|
| 1447 | :info:configure checking for ATK... yes |
|---|
| 1448 | :info:configure checking for GTK_DEP... yes |
|---|
| 1449 | :info:configure checking for library containing gethostent... none required |
|---|
| 1450 | :info:configure checking for library containing setsockopt... none required |
|---|
| 1451 | :info:configure checking for library containing connect... none required |
|---|
| 1452 | :info:configure checking for struct sockaddr_un.sun_len... yes |
|---|
| 1453 | :info:configure checking for cups-config... /usr/bin/cups-config |
|---|
| 1454 | :info:configure checking cups/cups.h usability... yes |
|---|
| 1455 | :info:configure checking cups/cups.h presence... yes |
|---|
| 1456 | :info:configure checking for cups/cups.h... yes |
|---|
| 1457 | :info:configure checking for httpGetAuthString... yes |
|---|
| 1458 | :info:configure checking libpapi... checking for papiServiceCreate in -lpapi... no |
|---|
| 1459 | :info:configure checking cairo-pdf.h usability... yes |
|---|
| 1460 | :info:configure checking cairo-pdf.h presence... yes |
|---|
| 1461 | :info:configure checking for cairo-pdf.h... yes |
|---|
| 1462 | :info:configure checking cairo-ps.h usability... yes |
|---|
| 1463 | :info:configure checking cairo-ps.h presence... yes |
|---|
| 1464 | :info:configure checking for cairo-ps.h... yes |
|---|
| 1465 | :info:configure checking cairo-svg.h usability... yes |
|---|
| 1466 | :info:configure checking cairo-svg.h presence... yes |
|---|
| 1467 | :info:configure checking for cairo-svg.h... yes |
|---|
| 1468 | :info:configure checking for pkg-config... (cached) /opt/local/bin/pkg-config |
|---|
| 1469 | :info:configure checking pkg-config is at least version 0.16... yes |
|---|
| 1470 | :info:configure checking for gobject-introspection... yes |
|---|
| 1471 | :info:configure checking whether to use colord... yes |
|---|
| 1472 | :info:configure checking for COLORD... no |
|---|
| 1473 | :info:configure checking for FONTDEMO... yes |
|---|
| 1474 | :info:configure checking for gtk-doc... yes |
|---|
| 1475 | :info:configure checking for gtkdoc-check... gtkdoc-check.test |
|---|
| 1476 | :info:configure checking for gtkdoc-check... /opt/local/bin/gtkdoc-check |
|---|
| 1477 | :info:configure checking for gtkdoc-rebase... /opt/local/bin/gtkdoc-rebase |
|---|
| 1478 | :info:configure checking for gtkdoc-mkpdf... /opt/local/bin/gtkdoc-mkpdf |
|---|
| 1479 | :info:configure checking whether to build gtk-doc documentation... no |
|---|
| 1480 | :info:configure checking for GTKDOC_DEPS... yes |
|---|
| 1481 | :info:configure checking for xsltproc... /opt/local/bin/xsltproc |
|---|
| 1482 | :info:configure checking for XML catalog (/etc/xml/catalog)... not found |
|---|
| 1483 | :info:configure checking for xmlcatalog... /opt/local/bin/xmlcatalog |
|---|
| 1484 | :info:configure checking for DocBook XML DTD V4.1.2 in XML catalog... not found |
|---|
| 1485 | :info:configure checking whether to generate man pages... no |
|---|
| 1486 | :info:configure checking for -fvisibility=hidden compiler flag... no |
|---|
| 1487 | :info:configure checking for -Bsymbolic-functions linker flag... no |
|---|
| 1488 | :info:configure checking that generated files are newer than configure... done |
|---|
| 1489 | :info:configure checking that generated files are newer than configure... done |
|---|
| 1490 | :info:configure configure: creating ./config.status |
|---|
| 1491 | :info:configure config.status: creating README |
|---|
| 1492 | :info:configure config.status: creating INSTALL |
|---|
| 1493 | :info:configure config.status: creating config.h.win32 |
|---|
| 1494 | :info:configure config.status: creating gtk-zip.sh |
|---|
| 1495 | :info:configure config.status: creating Makefile |
|---|
| 1496 | :info:configure config.status: creating gdk-3.0.pc |
|---|
| 1497 | :info:configure config.status: creating gtk+-3.0.pc |
|---|
| 1498 | :info:configure config.status: creating gtk+-unix-print-3.0.pc |
|---|
| 1499 | :info:configure config.status: creating gail-3.0.pc |
|---|
| 1500 | :info:configure config.status: creating m4macros/Makefile |
|---|
| 1501 | :info:configure config.status: creating po/Makefile.in |
|---|
| 1502 | :info:configure config.status: creating po-properties/Makefile.in |
|---|
| 1503 | :info:configure config.status: creating demos/Makefile |
|---|
| 1504 | :info:configure config.status: creating demos/gtk-demo/Makefile |
|---|
| 1505 | :info:configure config.status: creating demos/gtk-demo/geninclude.pl |
|---|
| 1506 | :info:configure config.status: creating demos/widget-factory/Makefile |
|---|
| 1507 | :info:configure config.status: creating demos/icon-browser/Makefile |
|---|
| 1508 | :info:configure config.status: creating examples/Makefile |
|---|
| 1509 | :info:configure config.status: creating examples/bp/Makefile |
|---|
| 1510 | :info:configure config.status: creating examples/application1/Makefile |
|---|
| 1511 | :info:configure config.status: creating examples/application2/Makefile |
|---|
| 1512 | :info:configure config.status: creating examples/application3/Makefile |
|---|
| 1513 | :info:configure config.status: creating examples/application4/Makefile |
|---|
| 1514 | :info:configure config.status: creating examples/application5/Makefile |
|---|
| 1515 | :info:configure config.status: creating examples/application6/Makefile |
|---|
| 1516 | :info:configure config.status: creating examples/application7/Makefile |
|---|
| 1517 | :info:configure config.status: creating examples/application8/Makefile |
|---|
| 1518 | :info:configure config.status: creating examples/application9/Makefile |
|---|
| 1519 | :info:configure config.status: creating examples/application10/Makefile |
|---|
| 1520 | :info:configure config.status: creating tests/Makefile |
|---|
| 1521 | :info:configure config.status: creating tests/visuals/Makefile |
|---|
| 1522 | :info:configure config.status: creating testsuite/Makefile |
|---|
| 1523 | :info:configure config.status: creating testsuite/a11y/Makefile |
|---|
| 1524 | :info:configure config.status: creating testsuite/a11y/state/Makefile |
|---|
| 1525 | :info:configure config.status: creating testsuite/css/Makefile |
|---|
| 1526 | :info:configure config.status: creating testsuite/css/parser/Makefile |
|---|
| 1527 | :info:configure config.status: creating testsuite/css/nodes/Makefile |
|---|
| 1528 | :info:configure config.status: creating testsuite/css/style/Makefile |
|---|
| 1529 | :info:configure config.status: creating testsuite/gdk/Makefile |
|---|
| 1530 | :info:configure config.status: creating testsuite/gtk/Makefile |
|---|
| 1531 | :info:configure config.status: creating testsuite/reftests/Makefile |
|---|
| 1532 | :info:configure config.status: creating testsuite/tools/Makefile |
|---|
| 1533 | :info:configure config.status: creating docs/Makefile |
|---|
| 1534 | :info:configure config.status: creating docs/reference/Makefile |
|---|
| 1535 | :info:configure config.status: creating docs/reference/gdk/Makefile |
|---|
| 1536 | :info:configure config.status: creating docs/reference/gdk/version.xml |
|---|
| 1537 | :info:configure config.status: creating docs/reference/gtk/Makefile |
|---|
| 1538 | :info:configure config.status: creating docs/reference/gtk/gtk3.types |
|---|
| 1539 | :info:configure config.status: creating docs/reference/gtk/version.xml |
|---|
| 1540 | :info:configure config.status: creating docs/reference/libgail-util/Makefile |
|---|
| 1541 | :info:configure config.status: creating docs/reference/libgail-util/version.xml |
|---|
| 1542 | :info:configure config.status: creating docs/tools/Makefile |
|---|
| 1543 | :info:configure config.status: creating build/Makefile |
|---|
| 1544 | :info:configure config.status: creating build/win32/Makefile |
|---|
| 1545 | :info:configure config.status: creating build/win32/vs9/Makefile |
|---|
| 1546 | :info:configure config.status: creating build/win32/vs9/gtk3-version-paths.vsprops |
|---|
| 1547 | :info:configure config.status: creating build/win32/vs10/Makefile |
|---|
| 1548 | :info:configure config.status: creating build/win32/vs10/gtk3-version-paths.props |
|---|
| 1549 | :info:configure config.status: creating build/win32/vs11/Makefile |
|---|
| 1550 | :info:configure config.status: creating build/win32/vs12/Makefile |
|---|
| 1551 | :info:configure config.status: creating build/win32/vs14/Makefile |
|---|
| 1552 | :info:configure config.status: creating gdk/Makefile |
|---|
| 1553 | :info:configure config.status: creating gdk/broadway/Makefile |
|---|
| 1554 | :info:configure config.status: creating gdk/x11/Makefile |
|---|
| 1555 | :info:configure config.status: creating gdk/win32/Makefile |
|---|
| 1556 | :info:configure config.status: creating gdk/win32/rc/Makefile |
|---|
| 1557 | :info:configure config.status: creating gdk/win32/rc/gdk.rc |
|---|
| 1558 | :info:configure config.status: creating gdk/quartz/Makefile |
|---|
| 1559 | :info:configure config.status: creating gdk/wayland/Makefile |
|---|
| 1560 | :info:configure config.status: creating gdk/mir/Makefile |
|---|
| 1561 | :info:configure config.status: creating gdk/gdkversionmacros.h |
|---|
| 1562 | :info:configure config.status: creating gtk/Makefile |
|---|
| 1563 | :info:configure config.status: creating gtk/makefile.msc |
|---|
| 1564 | :info:configure config.status: creating gtk/gtkversion.h |
|---|
| 1565 | :info:configure config.status: creating gtk/gtk-win32.rc.body |
|---|
| 1566 | :info:configure config.status: creating gtk/libgtk3.manifest |
|---|
| 1567 | :info:configure config.status: creating libgail-util/Makefile |
|---|
| 1568 | :info:configure config.status: creating modules/Makefile |
|---|
| 1569 | :info:configure config.status: creating modules/input/Makefile |
|---|
| 1570 | :info:configure config.status: creating modules/printbackends/Makefile |
|---|
| 1571 | :info:configure config.status: creating modules/printbackends/cups/Makefile |
|---|
| 1572 | :info:configure config.status: creating modules/printbackends/cloudprint/Makefile |
|---|
| 1573 | :info:configure config.status: creating modules/printbackends/lpr/Makefile |
|---|
| 1574 | :info:configure config.status: creating modules/printbackends/file/Makefile |
|---|
| 1575 | :info:configure config.status: creating modules/printbackends/papi/Makefile |
|---|
| 1576 | :info:configure config.status: creating modules/printbackends/test/Makefile |
|---|
| 1577 | :info:configure config.status: creating config.h |
|---|
| 1578 | :info:configure config.status: executing depfiles commands |
|---|
| 1579 | :info:configure config.status: executing po-directories commands |
|---|
| 1580 | :info:configure config.status: creating po/POTFILES |
|---|
| 1581 | :info:configure config.status: creating po/Makefile |
|---|
| 1582 | :info:configure config.status: creating po-properties/POTFILES |
|---|
| 1583 | :info:configure config.status: creating po-properties/Makefile |
|---|
| 1584 | :info:configure config.status: executing libtool commands |
|---|
| 1585 | :info:configure config.status: executing gdk/gdkconfig.h commands |
|---|
| 1586 | :info:configure |
|---|
| 1587 | :info:configure GTK+ 3.22.5 |
|---|
| 1588 | :info:configure =========== |
|---|
| 1589 | :info:configure |
|---|
| 1590 | :info:configure GDK backends: quartz |
|---|
| 1591 | :info:configure Print backends: file lpr cups |
|---|
| 1592 | :info:configure Dynamic modules: yes |
|---|
| 1593 | :info:configure Included immodules: none |
|---|
| 1594 | :info:configure colord support: no |
|---|
| 1595 | :info:configure Introspection: yes |
|---|
| 1596 | :info:configure Debugging: minimum |
|---|
| 1597 | :info:configure Documentation: no |
|---|
| 1598 | :debug:configure Privilege de-escalation not attempted as not running as root. |
|---|
| 1599 | :debug:build build phase started at Wed Dec 28 22:50:58 CET 2016 |
|---|
| 1600 | :notice:build ---> Building gtk3 |
|---|
| 1601 | :debug:build Executing org.macports.build (gtk3) |
|---|
| 1602 | :debug:build Environment: |
|---|
| 1603 | CC_PRINT_OPTIONS='YES' |
|---|
| 1604 | CC_PRINT_OPTIONS_FILE='/opt/local/var/macports/build/_opt_local_var_macports_sources_nue.de.rsync.macports.org_macports_release_tarballs_ports_gnome_gtk3/gtk3/work/.CC_PRINT_OPTIONS' |
|---|
| 1605 | CPATH='/opt/local/include' |
|---|
| 1606 | LIBRARY_PATH='/opt/local/lib' |
|---|
| 1607 | MACOSX_DEPLOYMENT_TARGET='10.5' |
|---|
| 1608 | :debug:build Assembled command: 'cd "/opt/local/var/macports/build/_opt_local_var_macports_sources_nue.de.rsync.macports.org_macports_release_tarballs_ports_gnome_gtk3/gtk3/work/gtk+-3.22.5" && /usr/bin/make -w all CC="/opt/local/bin/clang-mp-3.4 -arch ppc" CC_FOR_BUILD="/opt/local/bin/clang-mp-3.4 -arch ppc -Wl,-read_only_relocs suppress" ac_ct_CC_FOR_BUILD="/opt/local/bin/clang-mp-3.4 -arch ppc -Wl,-read_only_relocs suppress" LDFLAGS="-L/opt/local/lib -Wl,-headerpad_max_install_names -read_only_relocs suppress" V=1 CPP_FOR_BUILD="/usr/bin/cpp"' |
|---|
| 1609 | :debug:build Executing command line: cd "/opt/local/var/macports/build/_opt_local_var_macports_sources_nue.de.rsync.macports.org_macports_release_tarballs_ports_gnome_gtk3/gtk3/work/gtk+-3.22.5" && /usr/bin/make -w all CC="/opt/local/bin/clang-mp-3.4 -arch ppc" CC_FOR_BUILD="/opt/local/bin/clang-mp-3.4 -arch ppc -Wl,-read_only_relocs suppress" ac_ct_CC_FOR_BUILD="/opt/local/bin/clang-mp-3.4 -arch ppc -Wl,-read_only_relocs suppress" LDFLAGS="-L/opt/local/lib -Wl,-headerpad_max_install_names -read_only_relocs suppress" V=1 CPP_FOR_BUILD="/usr/bin/cpp" |
|---|
| 1610 | :info:build make: Entering directory `/opt/local/var/macports/build/_opt_local_var_macports_sources_nue.de.rsync.macports.org_macports_release_tarballs_ports_gnome_gtk3/gtk3/work/gtk+-3.22.5' |
|---|
| 1611 | :info:build /usr/bin/make all-recursive |
|---|
| 1612 | :info:build make[1]: Entering directory `/opt/local/var/macports/build/_opt_local_var_macports_sources_nue.de.rsync.macports.org_macports_release_tarballs_ports_gnome_gtk3/gtk3/work/gtk+-3.22.5' |
|---|
| 1613 | :info:build Making all in po |
|---|
| 1614 | :info:build make[2]: Entering directory `/opt/local/var/macports/build/_opt_local_var_macports_sources_nue.de.rsync.macports.org_macports_release_tarballs_ports_gnome_gtk3/gtk3/work/gtk+-3.22.5/po' |
|---|
| 1615 | :info:build make[2]: Nothing to be done for `all'. |
|---|
| 1616 | :info:build make[2]: Leaving directory `/opt/local/var/macports/build/_opt_local_var_macports_sources_nue.de.rsync.macports.org_macports_release_tarballs_ports_gnome_gtk3/gtk3/work/gtk+-3.22.5/po' |
|---|
| 1617 | :info:build Making all in po-properties |
|---|
| 1618 | :info:build make[2]: Entering directory `/opt/local/var/macports/build/_opt_local_var_macports_sources_nue.de.rsync.macports.org_macports_release_tarballs_ports_gnome_gtk3/gtk3/work/gtk+-3.22.5/po-properties' |
|---|
| 1619 | :info:build make[2]: Nothing to be done for `all'. |
|---|
| 1620 | :info:build make[2]: Leaving directory `/opt/local/var/macports/build/_opt_local_var_macports_sources_nue.de.rsync.macports.org_macports_release_tarballs_ports_gnome_gtk3/gtk3/work/gtk+-3.22.5/po-properties' |
|---|
| 1621 | :info:build Making all in gdk |
|---|
| 1622 | :info:build Failed to open file './gdk.gresource.xml': No such file or directory |
|---|
| 1623 | :info:build make[2]: Entering directory `/opt/local/var/macports/build/_opt_local_var_macports_sources_nue.de.rsync.macports.org_macports_release_tarballs_ports_gnome_gtk3/gtk3/work/gtk+-3.22.5/gdk' |
|---|
| 1624 | :info:build ( cd . && glib-mkenums --template gdkenumtypes.h.template \ |
|---|
| 1625 | :info:build gdk.h gdk-autocleanup.h gdkapplaunchcontext.h gdkcairo.h gdkcursor.h gdkdevice.h gdkdevicepad.h gdkdevicetool.h gdkdevicemanager.h gdkdisplay.h gdkdisplaymanager.h gdkdnd.h gdkdrawingcontext.h gdkevents.h gdkframetimings.h gdkglcontext.h gdkkeys.h gdkkeysyms.h gdkkeysyms-compat.h gdkmain.h gdkmonitor.h gdkpango.h gdkframeclock.h gdkpixbuf.h gdkprivate.h gdkproperty.h gdkrectangle.h gdkrgba.h gdkscreen.h gdkseat.h gdkselection.h gdktestutils.h gdkthreads.h gdktypes.h gdkvisual.h gdkwindow.h deprecated/gdkcolor.h ) >> xgen-geth \ |
|---|
| 1626 | :info:build && (cmp -s xgen-geth gdkenumtypes.h || cp xgen-geth gdkenumtypes.h ) \ |
|---|
| 1627 | :info:build && rm -f xgen-geth \ |
|---|
| 1628 | :info:build && echo timestamp > stamp-gdkenumtypes.h |
|---|
| 1629 | :info:build echo "<?xml version='1.0' encoding='UTF-8'?>" > gdk.gresource.xml; \ |
|---|
| 1630 | :info:build echo "<gresources>" >> gdk.gresource.xml; \ |
|---|
| 1631 | :info:build echo " <gresource prefix='/org/gtk/libgdk'>" >> gdk.gresource.xml; \ |
|---|
| 1632 | :info:build for f in ./resources/glsl/gl2-texture-2d.fs.glsl ./resources/glsl/gl2-texture-2d.vs.glsl ./resources/glsl/gl2-texture-rect.fs.glsl ./resources/glsl/gl2-texture-rect.vs.glsl ./resources/glsl/gl3-texture-2d.fs.glsl ./resources/glsl/gl3-texture-2d.vs.glsl ./resources/glsl/gl3-texture-rect.fs.glsl ./resources/glsl/gl3-texture-rect.vs.glsl ./resources/glsl/gles2-texture.fs.glsl ./resources/glsl/gles2-texture.vs.glsl; do \ |
|---|
| 1633 | :info:build n=`basename $f`; \ |
|---|
| 1634 | :info:build echo " <file alias='glsl/$n'>resources/glsl/$n</file>" >> gdk.gresource.xml; \ |
|---|
| 1635 | :info:build done; \ |
|---|
| 1636 | :info:build echo " </gresource>" >> gdk.gresource.xml; \ |
|---|
| 1637 | :info:build echo "</gresources>" >> gdk.gresource.xml; |
|---|
| 1638 | :info:build glib-compile-resources gdk.gresource.xml --target=gdkresources.h \ |
|---|
| 1639 | :info:build --sourcedir=. --c-name _gdk --generate-header --manual-register |
|---|
| 1640 | :info:build glib-compile-resources gdk.gresource.xml --target=gdkresources.c \ |
|---|
| 1641 | :info:build --sourcedir=. --c-name _gdk --generate-source --manual-register |
|---|
| 1642 | :info:build cd .. && /bin/sh ./config.status gdk/gdkconfig.h \ |
|---|
| 1643 | :info:build && echo timestamp > gdk/stamp-gc-h |
|---|
| 1644 | :info:build config.status: executing gdk/gdkconfig.h commands |
|---|
| 1645 | :info:build config.status: gdk/gdkconfig.h is unchanged |
|---|
| 1646 | :info:build if test -f gdkconfig.h; then :; \ |
|---|
| 1647 | :info:build else rm -f stamp-gc-h; /usr/bin/make stamp-gc-h; fi |
|---|
| 1648 | :info:build /usr/bin/make all-recursive |
|---|
| 1649 | :info:build make[3]: Entering directory `/opt/local/var/macports/build/_opt_local_var_macports_sources_nue.de.rsync.macports.org_macports_release_tarballs_ports_gnome_gtk3/gtk3/work/gtk+-3.22.5/gdk' |
|---|
| 1650 | :info:build Making all in quartz |
|---|
| 1651 | :info:build make[4]: Entering directory `/opt/local/var/macports/build/_opt_local_var_macports_sources_nue.de.rsync.macports.org_macports_release_tarballs_ports_gnome_gtk3/gtk3/work/gtk+-3.22.5/gdk/quartz' |
|---|
| 1652 | :info:build /bin/sh ../../libtool --tag=CC --mode=compile /opt/local/bin/clang-mp-3.4 -arch ppc -DHAVE_CONFIG_H -I. -I../.. -DG_LOG_DOMAIN=\"Gdk\" -DG_LOG_USE_STRUCTURED=1 -DGDK_COMPILATION -I../.. -I../../gdk -I../../gdk -DG_ENABLE_DEBUG -DG_DISABLE_CAST_CHECKS -DGLIB_MIN_REQUIRED_VERSION=GLIB_VERSION_2_48 -DGLIB_MAX_ALLOWED_VERSION=GLIB_VERSION_2_50 -D_REENTRANT -I/opt/local/include/pango-1.0 -I/opt/local/include/harfbuzz -I/opt/local/include -I/opt/local/include/pango-1.0 -I/opt/local/include/gdk-pixbuf-2.0 -I/opt/local/include/libpng16 -I/opt/local/include/cairo -I/opt/local/include/gio-unix-2.0/ -I/opt/local/include/cairo -I/opt/local/include/glib-2.0 -I/opt/local/lib/glib-2.0/include -I/opt/local/include -I/opt/local/include/pixman-1 -I/opt/local/include -I/opt/local/include/freetype2 -I/opt/local/include -I/opt/local/include/freetype2 -I/opt/local/include/libpng16 -I/opt/local/include "-xobjective-c" -I/opt/local/include -DX_LOCALE -pipe -Os -fstrict-aliasing -arch ppc -Wall -MT GdkQuartzView.lo -MD -MP -MF .deps/GdkQuartzView.Tpo -c -o GdkQuartzView.lo GdkQuartzView.c |
|---|
| 1653 | :info:build libtool: compile: /opt/local/bin/clang-mp-3.4 -arch ppc -DHAVE_CONFIG_H -I. -I../.. -DG_LOG_DOMAIN=\"Gdk\" -DG_LOG_USE_STRUCTURED=1 -DGDK_COMPILATION -I../.. -I../../gdk -I../../gdk -DG_ENABLE_DEBUG -DG_DISABLE_CAST_CHECKS -DGLIB_MIN_REQUIRED_VERSION=GLIB_VERSION_2_48 -DGLIB_MAX_ALLOWED_VERSION=GLIB_VERSION_2_50 -D_REENTRANT -I/opt/local/include/pango-1.0 -I/opt/local/include/harfbuzz -I/opt/local/include -I/opt/local/include/pango-1.0 -I/opt/local/include/gdk-pixbuf-2.0 -I/opt/local/include/libpng16 -I/opt/local/include/cairo -I/opt/local/include/gio-unix-2.0/ -I/opt/local/include/cairo -I/opt/local/include/glib-2.0 -I/opt/local/lib/glib-2.0/include -I/opt/local/include -I/opt/local/include/pixman-1 -I/opt/local/include -I/opt/local/include/freetype2 -I/opt/local/include -I/opt/local/include/freetype2 -I/opt/local/include/libpng16 -I/opt/local/include -xobjective-c -I/opt/local/include -DX_LOCALE -pipe -Os -fstrict-aliasing -arch ppc -Wall -MT GdkQuartzView.lo -MD -MP -MF .deps/GdkQuartzView.Tpo -c GdkQuartzView.c -fno-common -DPIC -o .libs/GdkQuartzView.o |
|---|
| 1654 | :info:build GdkQuartzView.c:125:10: warning: unused variable 'prev_str' [-Wunused-variable] |
|---|
| 1655 | :info:build gchar *prev_str; |
|---|
| 1656 | :info:build ^ |
|---|
| 1657 | :info:build GdkQuartzView.c:135:10: warning: unused variable 'prev_str' [-Wunused-variable] |
|---|
| 1658 | :info:build gchar *prev_str; |
|---|
| 1659 | :info:build ^ |
|---|
| 1660 | :info:build GdkQuartzView.c:185:10: warning: unused variable 'prev_str' [-Wunused-variable] |
|---|
| 1661 | :info:build gchar *prev_str; |
|---|
| 1662 | :info:build ^ |
|---|
| 1663 | :info:build 3 warnings generated. |
|---|
| 1664 | :info:build libtool: compile: /opt/local/bin/clang-mp-3.4 -arch ppc -DHAVE_CONFIG_H -I. -I../.. -DG_LOG_DOMAIN=\"Gdk\" -DG_LOG_USE_STRUCTURED=1 -DGDK_COMPILATION -I../.. -I../../gdk -I../../gdk -DG_ENABLE_DEBUG -DG_DISABLE_CAST_CHECKS -DGLIB_MIN_REQUIRED_VERSION=GLIB_VERSION_2_48 -DGLIB_MAX_ALLOWED_VERSION=GLIB_VERSION_2_50 -D_REENTRANT -I/opt/local/include/pango-1.0 -I/opt/local/include/harfbuzz -I/opt/local/include -I/opt/local/include/pango-1.0 -I/opt/local/include/gdk-pixbuf-2.0 -I/opt/local/include/libpng16 -I/opt/local/include/cairo -I/opt/local/include/gio-unix-2.0/ -I/opt/local/include/cairo -I/opt/local/include/glib-2.0 -I/opt/local/lib/glib-2.0/include -I/opt/local/include -I/opt/local/include/pixman-1 -I/opt/local/include -I/opt/local/include/freetype2 -I/opt/local/include -I/opt/local/include/freetype2 -I/opt/local/include/libpng16 -I/opt/local/include -xobjective-c -I/opt/local/include -DX_LOCALE -pipe -Os -fstrict-aliasing -arch ppc -Wall -MT GdkQuartzView.lo -MD -MP -MF .deps/GdkQuartzView.Tpo -c GdkQuartzView.c -o GdkQuartzView.o >/dev/null 2>&1 |
|---|
| 1665 | :info:build mv -f .deps/GdkQuartzView.Tpo .deps/GdkQuartzView.Plo |
|---|
| 1666 | :info:build /bin/sh ../../libtool --tag=CC --mode=compile /opt/local/bin/clang-mp-3.4 -arch ppc -DHAVE_CONFIG_H -I. -I../.. -DG_LOG_DOMAIN=\"Gdk\" -DG_LOG_USE_STRUCTURED=1 -DGDK_COMPILATION -I../.. -I../../gdk -I../../gdk -DG_ENABLE_DEBUG -DG_DISABLE_CAST_CHECKS -DGLIB_MIN_REQUIRED_VERSION=GLIB_VERSION_2_48 -DGLIB_MAX_ALLOWED_VERSION=GLIB_VERSION_2_50 -D_REENTRANT -I/opt/local/include/pango-1.0 -I/opt/local/include/harfbuzz -I/opt/local/include -I/opt/local/include/pango-1.0 -I/opt/local/include/gdk-pixbuf-2.0 -I/opt/local/include/libpng16 -I/opt/local/include/cairo -I/opt/local/include/gio-unix-2.0/ -I/opt/local/include/cairo -I/opt/local/include/glib-2.0 -I/opt/local/lib/glib-2.0/include -I/opt/local/include -I/opt/local/include/pixman-1 -I/opt/local/include -I/opt/local/include/freetype2 -I/opt/local/include -I/opt/local/include/freetype2 -I/opt/local/include/libpng16 -I/opt/local/include "-xobjective-c" -I/opt/local/include -DX_LOCALE -pipe -Os -fstrict-aliasing -arch ppc -Wall -MT GdkQuartzNSWindow.lo -MD -MP -MF .deps/GdkQuartzNSWindow.Tpo -c -o GdkQuartzNSWindow.lo GdkQuartzNSWindow.c |
|---|
| 1667 | :info:build libtool: compile: /opt/local/bin/clang-mp-3.4 -arch ppc -DHAVE_CONFIG_H -I. -I../.. -DG_LOG_DOMAIN=\"Gdk\" -DG_LOG_USE_STRUCTURED=1 -DGDK_COMPILATION -I../.. -I../../gdk -I../../gdk -DG_ENABLE_DEBUG -DG_DISABLE_CAST_CHECKS -DGLIB_MIN_REQUIRED_VERSION=GLIB_VERSION_2_48 -DGLIB_MAX_ALLOWED_VERSION=GLIB_VERSION_2_50 -D_REENTRANT -I/opt/local/include/pango-1.0 -I/opt/local/include/harfbuzz -I/opt/local/include -I/opt/local/include/pango-1.0 -I/opt/local/include/gdk-pixbuf-2.0 -I/opt/local/include/libpng16 -I/opt/local/include/cairo -I/opt/local/include/gio-unix-2.0/ -I/opt/local/include/cairo -I/opt/local/include/glib-2.0 -I/opt/local/lib/glib-2.0/include -I/opt/local/include -I/opt/local/include/pixman-1 -I/opt/local/include -I/opt/local/include/freetype2 -I/opt/local/include -I/opt/local/include/freetype2 -I/opt/local/include/libpng16 -I/opt/local/include -xobjective-c -I/opt/local/include -DX_LOCALE -pipe -Os -fstrict-aliasing -arch ppc -Wall -MT GdkQuartzNSWindow.lo -MD -MP -MF .deps/GdkQuartzNSWindow.Tpo -c GdkQuartzNSWindow.c -fno-common -DPIC -o .libs/GdkQuartzNSWindow.o |
|---|
| 1668 | :info:build GdkQuartzNSWindow.c:189:24: warning: unused variable 'impl' [-Wunused-variable] |
|---|
| 1669 | :info:build GdkWindowImplQuartz *impl = GDK_WINDOW_IMPL_QUARTZ (window->impl); |
|---|
| 1670 | :info:build ^ |
|---|
| 1671 | :info:build GdkQuartzNSWindow.c:220:24: warning: unused variable 'impl' [-Wunused-variable] |
|---|
| 1672 | :info:build GdkWindowImplQuartz *impl = GDK_WINDOW_IMPL_QUARTZ (window->impl); |
|---|
| 1673 | :info:build ^ |
|---|
| 1674 | :info:build GdkQuartzNSWindow.c:592:20: warning: 'gdk_display_get_device_manager' is deprecated [-Wdeprecated-declarations] |
|---|
| 1675 | :info:build device_manager = gdk_display_get_device_manager (gdk_display_get_default ()); |
|---|
| 1676 | :info:build ^ |
|---|
| 1677 | :info:build ../../gdk/gdkdisplay.h:171:20: note: 'gdk_display_get_device_manager' declared here |
|---|
| 1678 | :info:build GdkDeviceManager * gdk_display_get_device_manager (GdkDisplay *display); |
|---|
| 1679 | :info:build ^ |
|---|
| 1680 | :info:build GdkQuartzNSWindow.c:594:32: warning: 'gdk_device_manager_get_client_pointer' is deprecated [-Wdeprecated-declarations] |
|---|
| 1681 | :info:build gdk_device_manager_get_client_pointer (device_manager)); |
|---|
| 1682 | :info:build ^ |
|---|
| 1683 | :info:build ../../gdk/gdkdevicemanager.h:44:14: note: 'gdk_device_manager_get_client_pointer' declared here |
|---|
| 1684 | :info:build GdkDevice * gdk_device_manager_get_client_pointer (GdkDeviceManager *device_manager); |
|---|
| 1685 | :info:build ^ |
|---|
| 1686 | :info:build GdkQuartzNSWindow.c:800:24: warning: unused variable 'impl' [-Wunused-variable] |
|---|
| 1687 | :info:build GdkWindowImplQuartz *impl = GDK_WINDOW_IMPL_QUARTZ (window->impl); |
|---|
| 1688 | :info:build ^ |
|---|
| 1689 | :info:build GdkQuartzNSWindow.c:814:24: warning: unused variable 'impl' [-Wunused-variable] |
|---|
| 1690 | :info:build GdkWindowImplQuartz *impl = GDK_WINDOW_IMPL_QUARTZ (window->impl); |
|---|
| 1691 | :info:build ^ |
|---|
| 1692 | :info:build 6 warnings generated. |
|---|
| 1693 | :info:build libtool: compile: /opt/local/bin/clang-mp-3.4 -arch ppc -DHAVE_CONFIG_H -I. -I../.. -DG_LOG_DOMAIN=\"Gdk\" -DG_LOG_USE_STRUCTURED=1 -DGDK_COMPILATION -I../.. -I../../gdk -I../../gdk -DG_ENABLE_DEBUG -DG_DISABLE_CAST_CHECKS -DGLIB_MIN_REQUIRED_VERSION=GLIB_VERSION_2_48 -DGLIB_MAX_ALLOWED_VERSION=GLIB_VERSION_2_50 -D_REENTRANT -I/opt/local/include/pango-1.0 -I/opt/local/include/harfbuzz -I/opt/local/include -I/opt/local/include/pango-1.0 -I/opt/local/include/gdk-pixbuf-2.0 -I/opt/local/include/libpng16 -I/opt/local/include/cairo -I/opt/local/include/gio-unix-2.0/ -I/opt/local/include/cairo -I/opt/local/include/glib-2.0 -I/opt/local/lib/glib-2.0/include -I/opt/local/include -I/opt/local/include/pixman-1 -I/opt/local/include -I/opt/local/include/freetype2 -I/opt/local/include -I/opt/local/include/freetype2 -I/opt/local/include/libpng16 -I/opt/local/include -xobjective-c -I/opt/local/include -DX_LOCALE -pipe -Os -fstrict-aliasing -arch ppc -Wall -MT GdkQuartzNSWindow.lo -MD -MP -MF .deps/GdkQuartzNSWindow.Tpo -c GdkQuartzNSWindow.c -o GdkQuartzNSWindow.o >/dev/null 2>&1 |
|---|
| 1694 | :info:build mv -f .deps/GdkQuartzNSWindow.Tpo .deps/GdkQuartzNSWindow.Plo |
|---|
| 1695 | :info:build /bin/sh ../../libtool --tag=CC --mode=compile /opt/local/bin/clang-mp-3.4 -arch ppc -DHAVE_CONFIG_H -I. -I../.. -DG_LOG_DOMAIN=\"Gdk\" -DG_LOG_USE_STRUCTURED=1 -DGDK_COMPILATION -I../.. -I../../gdk -I../../gdk -DG_ENABLE_DEBUG -DG_DISABLE_CAST_CHECKS -DGLIB_MIN_REQUIRED_VERSION=GLIB_VERSION_2_48 -DGLIB_MAX_ALLOWED_VERSION=GLIB_VERSION_2_50 -D_REENTRANT -I/opt/local/include/pango-1.0 -I/opt/local/include/harfbuzz -I/opt/local/include -I/opt/local/include/pango-1.0 -I/opt/local/include/gdk-pixbuf-2.0 -I/opt/local/include/libpng16 -I/opt/local/include/cairo -I/opt/local/include/gio-unix-2.0/ -I/opt/local/include/cairo -I/opt/local/include/glib-2.0 -I/opt/local/lib/glib-2.0/include -I/opt/local/include -I/opt/local/include/pixman-1 -I/opt/local/include -I/opt/local/include/freetype2 -I/opt/local/include -I/opt/local/include/freetype2 -I/opt/local/include/libpng16 -I/opt/local/include "-xobjective-c" -I/opt/local/include -DX_LOCALE -pipe -Os -fstrict-aliasing -arch ppc -Wall -MT gdkcursor-quartz.lo -MD -MP -MF .deps/gdkcursor-quartz.Tpo -c -o gdkcursor-quartz.lo gdkcursor-quartz.c |
|---|
| 1696 | :info:build libtool: compile: /opt/local/bin/clang-mp-3.4 -arch ppc -DHAVE_CONFIG_H -I. -I../.. -DG_LOG_DOMAIN=\"Gdk\" -DG_LOG_USE_STRUCTURED=1 -DGDK_COMPILATION -I../.. -I../../gdk -I../../gdk -DG_ENABLE_DEBUG -DG_DISABLE_CAST_CHECKS -DGLIB_MIN_REQUIRED_VERSION=GLIB_VERSION_2_48 -DGLIB_MAX_ALLOWED_VERSION=GLIB_VERSION_2_50 -D_REENTRANT -I/opt/local/include/pango-1.0 -I/opt/local/include/harfbuzz -I/opt/local/include -I/opt/local/include/pango-1.0 -I/opt/local/include/gdk-pixbuf-2.0 -I/opt/local/include/libpng16 -I/opt/local/include/cairo -I/opt/local/include/gio-unix-2.0/ -I/opt/local/include/cairo -I/opt/local/include/glib-2.0 -I/opt/local/lib/glib-2.0/include -I/opt/local/include -I/opt/local/include/pixman-1 -I/opt/local/include -I/opt/local/include/freetype2 -I/opt/local/include -I/opt/local/include/freetype2 -I/opt/local/include/libpng16 -I/opt/local/include -xobjective-c -I/opt/local/include -DX_LOCALE -pipe -Os -fstrict-aliasing -arch ppc -Wall -MT gdkcursor-quartz.lo -MD -MP -MF .deps/gdkcursor-quartz.Tpo -c gdkcursor-quartz.c -fno-common -DPIC -o .libs/gdkcursor-quartz.o |
|---|
| 1697 | :info:build gdkcursor-quartz.c:299:16: warning: 'NSCursor' may not respond to '_coreCursorType' |
|---|
| 1698 | :info:build return [super _coreCursorType]; |
|---|
| 1699 | :info:build ~~~~~ ^ |
|---|
| 1700 | :info:build 1 warning generated. |
|---|
| 1701 | :info:build libtool: compile: /opt/local/bin/clang-mp-3.4 -arch ppc -DHAVE_CONFIG_H -I. -I../.. -DG_LOG_DOMAIN=\"Gdk\" -DG_LOG_USE_STRUCTURED=1 -DGDK_COMPILATION -I../.. -I../../gdk -I../../gdk -DG_ENABLE_DEBUG -DG_DISABLE_CAST_CHECKS -DGLIB_MIN_REQUIRED_VERSION=GLIB_VERSION_2_48 -DGLIB_MAX_ALLOWED_VERSION=GLIB_VERSION_2_50 -D_REENTRANT -I/opt/local/include/pango-1.0 -I/opt/local/include/harfbuzz -I/opt/local/include -I/opt/local/include/pango-1.0 -I/opt/local/include/gdk-pixbuf-2.0 -I/opt/local/include/libpng16 -I/opt/local/include/cairo -I/opt/local/include/gio-unix-2.0/ -I/opt/local/include/cairo -I/opt/local/include/glib-2.0 -I/opt/local/lib/glib-2.0/include -I/opt/local/include -I/opt/local/include/pixman-1 -I/opt/local/include -I/opt/local/include/freetype2 -I/opt/local/include -I/opt/local/include/freetype2 -I/opt/local/include/libpng16 -I/opt/local/include -xobjective-c -I/opt/local/include -DX_LOCALE -pipe -Os -fstrict-aliasing -arch ppc -Wall -MT gdkcursor-quartz.lo -MD -MP -MF .deps/gdkcursor-quartz.Tpo -c gdkcursor-quartz.c -o gdkcursor-quartz.o >/dev/null 2>&1 |
|---|
| 1702 | :info:build mv -f .deps/gdkcursor-quartz.Tpo .deps/gdkcursor-quartz.Plo |
|---|
| 1703 | :info:build /bin/sh ../../libtool --tag=CC --mode=compile /opt/local/bin/clang-mp-3.4 -arch ppc -DHAVE_CONFIG_H -I. -I../.. -DG_LOG_DOMAIN=\"Gdk\" -DG_LOG_USE_STRUCTURED=1 -DGDK_COMPILATION -I../.. -I../../gdk -I../../gdk -DG_ENABLE_DEBUG -DG_DISABLE_CAST_CHECKS -DGLIB_MIN_REQUIRED_VERSION=GLIB_VERSION_2_48 -DGLIB_MAX_ALLOWED_VERSION=GLIB_VERSION_2_50 -D_REENTRANT -I/opt/local/include/pango-1.0 -I/opt/local/include/harfbuzz -I/opt/local/include -I/opt/local/include/pango-1.0 -I/opt/local/include/gdk-pixbuf-2.0 -I/opt/local/include/libpng16 -I/opt/local/include/cairo -I/opt/local/include/gio-unix-2.0/ -I/opt/local/include/cairo -I/opt/local/include/glib-2.0 -I/opt/local/lib/glib-2.0/include -I/opt/local/include -I/opt/local/include/pixman-1 -I/opt/local/include -I/opt/local/include/freetype2 -I/opt/local/include -I/opt/local/include/freetype2 -I/opt/local/include/libpng16 -I/opt/local/include "-xobjective-c" -I/opt/local/include -DX_LOCALE -pipe -Os -fstrict-aliasing -arch ppc -Wall -MT gdkdevice-core-quartz.lo -MD -MP -MF .deps/gdkdevice-core-quartz.Tpo -c -o gdkdevice-core-quartz.lo gdkdevice-core-quartz.c |
|---|
| 1704 | :info:build libtool: compile: /opt/local/bin/clang-mp-3.4 -arch ppc -DHAVE_CONFIG_H -I. -I../.. -DG_LOG_DOMAIN=\"Gdk\" -DG_LOG_USE_STRUCTURED=1 -DGDK_COMPILATION -I../.. -I../../gdk -I../../gdk -DG_ENABLE_DEBUG -DG_DISABLE_CAST_CHECKS -DGLIB_MIN_REQUIRED_VERSION=GLIB_VERSION_2_48 -DGLIB_MAX_ALLOWED_VERSION=GLIB_VERSION_2_50 -D_REENTRANT -I/opt/local/include/pango-1.0 -I/opt/local/include/harfbuzz -I/opt/local/include -I/opt/local/include/pango-1.0 -I/opt/local/include/gdk-pixbuf-2.0 -I/opt/local/include/libpng16 -I/opt/local/include/cairo -I/opt/local/include/gio-unix-2.0/ -I/opt/local/include/cairo -I/opt/local/include/glib-2.0 -I/opt/local/lib/glib-2.0/include -I/opt/local/include -I/opt/local/include/pixman-1 -I/opt/local/include -I/opt/local/include/freetype2 -I/opt/local/include -I/opt/local/include/freetype2 -I/opt/local/include/libpng16 -I/opt/local/include -xobjective-c -I/opt/local/include -DX_LOCALE -pipe -Os -fstrict-aliasing -arch ppc -Wall -MT gdkdevice-core-quartz.lo -MD -MP -MF .deps/gdkdevice-core-quartz.Tpo -c gdkdevice-core-quartz.c -fno-common -DPIC -o .libs/gdkdevice-core-quartz.o |
|---|
| 1705 | :info:build gdkdevice-core-quartz.c:133:3: warning: 'gdk_window_get_pointer' is deprecated [-Wdeprecated-declarations] |
|---|
| 1706 | :info:build gdk_window_get_pointer (window, &x_int, &y_int, mask); |
|---|
| 1707 | :info:build ^ |
|---|
| 1708 | :info:build ../../gdk/gdkwindow.h:851:15: note: 'gdk_window_get_pointer' declared here |
|---|
| 1709 | :info:build GdkWindow * gdk_window_get_pointer (GdkWindow *window, |
|---|
| 1710 | :info:build ^ |
|---|
| 1711 | :info:build 1 warning generated. |
|---|
| 1712 | :info:build libtool: compile: /opt/local/bin/clang-mp-3.4 -arch ppc -DHAVE_CONFIG_H -I. -I../.. -DG_LOG_DOMAIN=\"Gdk\" -DG_LOG_USE_STRUCTURED=1 -DGDK_COMPILATION -I../.. -I../../gdk -I../../gdk -DG_ENABLE_DEBUG -DG_DISABLE_CAST_CHECKS -DGLIB_MIN_REQUIRED_VERSION=GLIB_VERSION_2_48 -DGLIB_MAX_ALLOWED_VERSION=GLIB_VERSION_2_50 -D_REENTRANT -I/opt/local/include/pango-1.0 -I/opt/local/include/harfbuzz -I/opt/local/include -I/opt/local/include/pango-1.0 -I/opt/local/include/gdk-pixbuf-2.0 -I/opt/local/include/libpng16 -I/opt/local/include/cairo -I/opt/local/include/gio-unix-2.0/ -I/opt/local/include/cairo -I/opt/local/include/glib-2.0 -I/opt/local/lib/glib-2.0/include -I/opt/local/include -I/opt/local/include/pixman-1 -I/opt/local/include -I/opt/local/include/freetype2 -I/opt/local/include -I/opt/local/include/freetype2 -I/opt/local/include/libpng16 -I/opt/local/include -xobjective-c -I/opt/local/include -DX_LOCALE -pipe -Os -fstrict-aliasing -arch ppc -Wall -MT gdkdevice-core-quartz.lo -MD -MP -MF .deps/gdkdevice-core-quartz.Tpo -c gdkdevice-core-quartz.c -o gdkdevice-core-quartz.o >/dev/null 2>&1 |
|---|
| 1713 | :info:build mv -f .deps/gdkdevice-core-quartz.Tpo .deps/gdkdevice-core-quartz.Plo |
|---|
| 1714 | :info:build /bin/sh ../../libtool --tag=CC --mode=compile /opt/local/bin/clang-mp-3.4 -arch ppc -DHAVE_CONFIG_H -I. -I../.. -DG_LOG_DOMAIN=\"Gdk\" -DG_LOG_USE_STRUCTURED=1 -DGDK_COMPILATION -I../.. -I../../gdk -I../../gdk -DG_ENABLE_DEBUG -DG_DISABLE_CAST_CHECKS -DGLIB_MIN_REQUIRED_VERSION=GLIB_VERSION_2_48 -DGLIB_MAX_ALLOWED_VERSION=GLIB_VERSION_2_50 -D_REENTRANT -I/opt/local/include/pango-1.0 -I/opt/local/include/harfbuzz -I/opt/local/include -I/opt/local/include/pango-1.0 -I/opt/local/include/gdk-pixbuf-2.0 -I/opt/local/include/libpng16 -I/opt/local/include/cairo -I/opt/local/include/gio-unix-2.0/ -I/opt/local/include/cairo -I/opt/local/include/glib-2.0 -I/opt/local/lib/glib-2.0/include -I/opt/local/include -I/opt/local/include/pixman-1 -I/opt/local/include -I/opt/local/include/freetype2 -I/opt/local/include -I/opt/local/include/freetype2 -I/opt/local/include/libpng16 -I/opt/local/include "-xobjective-c" -I/opt/local/include -DX_LOCALE -pipe -Os -fstrict-aliasing -arch ppc -Wall -MT gdkdevicemanager-core-quartz.lo -MD -MP -MF .deps/gdkdevicemanager-core-quartz.Tpo -c -o gdkdevicemanager-core-quartz.lo gdkdevicemanager-core-quartz.c |
|---|
| 1715 | :info:build libtool: compile: /opt/local/bin/clang-mp-3.4 -arch ppc -DHAVE_CONFIG_H -I. -I../.. -DG_LOG_DOMAIN=\"Gdk\" -DG_LOG_USE_STRUCTURED=1 -DGDK_COMPILATION -I../.. -I../../gdk -I../../gdk -DG_ENABLE_DEBUG -DG_DISABLE_CAST_CHECKS -DGLIB_MIN_REQUIRED_VERSION=GLIB_VERSION_2_48 -DGLIB_MAX_ALLOWED_VERSION=GLIB_VERSION_2_50 -D_REENTRANT -I/opt/local/include/pango-1.0 -I/opt/local/include/harfbuzz -I/opt/local/include -I/opt/local/include/pango-1.0 -I/opt/local/include/gdk-pixbuf-2.0 -I/opt/local/include/libpng16 -I/opt/local/include/cairo -I/opt/local/include/gio-unix-2.0/ -I/opt/local/include/cairo -I/opt/local/include/glib-2.0 -I/opt/local/lib/glib-2.0/include -I/opt/local/include -I/opt/local/include/pixman-1 -I/opt/local/include -I/opt/local/include/freetype2 -I/opt/local/include -I/opt/local/include/freetype2 -I/opt/local/include/libpng16 -I/opt/local/include -xobjective-c -I/opt/local/include -DX_LOCALE -pipe -Os -fstrict-aliasing -arch ppc -Wall -MT gdkdevicemanager-core-quartz.lo -MD -MP -MF .deps/gdkdevicemanager-core-quartz.Tpo -c gdkdevicemanager-core-quartz.c -fno-common -DPIC -o .libs/gdkdevicemanager-core-quartz.o |
|---|
| 1716 | :info:build gdkdevicemanager-core-quartz.c:121:3: warning: implicit declaration of function 'gdk_display_add_seat' is invalid in C99 [-Wimplicit-function-declaration] |
|---|
| 1717 | :info:build gdk_display_add_seat (display, seat); |
|---|
| 1718 | :info:build ^ |
|---|
| 1719 | :info:build 1 warning generated. |
|---|
| 1720 | :info:build libtool: compile: /opt/local/bin/clang-mp-3.4 -arch ppc -DHAVE_CONFIG_H -I. -I../.. -DG_LOG_DOMAIN=\"Gdk\" -DG_LOG_USE_STRUCTURED=1 -DGDK_COMPILATION -I../.. -I../../gdk -I../../gdk -DG_ENABLE_DEBUG -DG_DISABLE_CAST_CHECKS -DGLIB_MIN_REQUIRED_VERSION=GLIB_VERSION_2_48 -DGLIB_MAX_ALLOWED_VERSION=GLIB_VERSION_2_50 -D_REENTRANT -I/opt/local/include/pango-1.0 -I/opt/local/include/harfbuzz -I/opt/local/include -I/opt/local/include/pango-1.0 -I/opt/local/include/gdk-pixbuf-2.0 -I/opt/local/include/libpng16 -I/opt/local/include/cairo -I/opt/local/include/gio-unix-2.0/ -I/opt/local/include/cairo -I/opt/local/include/glib-2.0 -I/opt/local/lib/glib-2.0/include -I/opt/local/include -I/opt/local/include/pixman-1 -I/opt/local/include -I/opt/local/include/freetype2 -I/opt/local/include -I/opt/local/include/freetype2 -I/opt/local/include/libpng16 -I/opt/local/include -xobjective-c -I/opt/local/include -DX_LOCALE -pipe -Os -fstrict-aliasing -arch ppc -Wall -MT gdkdevicemanager-core-quartz.lo -MD -MP -MF .deps/gdkdevicemanager-core-quartz.Tpo -c gdkdevicemanager-core-quartz.c -o gdkdevicemanager-core-quartz.o >/dev/null 2>&1 |
|---|
| 1721 | :info:build mv -f .deps/gdkdevicemanager-core-quartz.Tpo .deps/gdkdevicemanager-core-quartz.Plo |
|---|
| 1722 | :info:build /bin/sh ../../libtool --tag=CC --mode=compile /opt/local/bin/clang-mp-3.4 -arch ppc -DHAVE_CONFIG_H -I. -I../.. -DG_LOG_DOMAIN=\"Gdk\" -DG_LOG_USE_STRUCTURED=1 -DGDK_COMPILATION -I../.. -I../../gdk -I../../gdk -DG_ENABLE_DEBUG -DG_DISABLE_CAST_CHECKS -DGLIB_MIN_REQUIRED_VERSION=GLIB_VERSION_2_48 -DGLIB_MAX_ALLOWED_VERSION=GLIB_VERSION_2_50 -D_REENTRANT -I/opt/local/include/pango-1.0 -I/opt/local/include/harfbuzz -I/opt/local/include -I/opt/local/include/pango-1.0 -I/opt/local/include/gdk-pixbuf-2.0 -I/opt/local/include/libpng16 -I/opt/local/include/cairo -I/opt/local/include/gio-unix-2.0/ -I/opt/local/include/cairo -I/opt/local/include/glib-2.0 -I/opt/local/lib/glib-2.0/include -I/opt/local/include -I/opt/local/include/pixman-1 -I/opt/local/include -I/opt/local/include/freetype2 -I/opt/local/include -I/opt/local/include/freetype2 -I/opt/local/include/libpng16 -I/opt/local/include "-xobjective-c" -I/opt/local/include -DX_LOCALE -pipe -Os -fstrict-aliasing -arch ppc -Wall -MT gdkdisplay-quartz.lo -MD -MP -MF .deps/gdkdisplay-quartz.Tpo -c -o gdkdisplay-quartz.lo gdkdisplay-quartz.c |
|---|
| 1723 | :info:build libtool: compile: /opt/local/bin/clang-mp-3.4 -arch ppc -DHAVE_CONFIG_H -I. -I../.. -DG_LOG_DOMAIN=\"Gdk\" -DG_LOG_USE_STRUCTURED=1 -DGDK_COMPILATION -I../.. -I../../gdk -I../../gdk -DG_ENABLE_DEBUG -DG_DISABLE_CAST_CHECKS -DGLIB_MIN_REQUIRED_VERSION=GLIB_VERSION_2_48 -DGLIB_MAX_ALLOWED_VERSION=GLIB_VERSION_2_50 -D_REENTRANT -I/opt/local/include/pango-1.0 -I/opt/local/include/harfbuzz -I/opt/local/include -I/opt/local/include/pango-1.0 -I/opt/local/include/gdk-pixbuf-2.0 -I/opt/local/include/libpng16 -I/opt/local/include/cairo -I/opt/local/include/gio-unix-2.0/ -I/opt/local/include/cairo -I/opt/local/include/glib-2.0 -I/opt/local/lib/glib-2.0/include -I/opt/local/include -I/opt/local/include/pixman-1 -I/opt/local/include -I/opt/local/include/freetype2 -I/opt/local/include -I/opt/local/include/freetype2 -I/opt/local/include/libpng16 -I/opt/local/include -xobjective-c -I/opt/local/include -DX_LOCALE -pipe -Os -fstrict-aliasing -arch ppc -Wall -MT gdkdisplay-quartz.lo -MD -MP -MF .deps/gdkdisplay-quartz.Tpo -c gdkdisplay-quartz.c -fno-common -DPIC -o .libs/gdkdisplay-quartz.o |
|---|
| 1724 | :info:build gdkdisplay-quartz.c:210:21: warning: unused variable 'display_quartz' [-Wunused-variable] |
|---|
| 1725 | :info:build GdkQuartzDisplay *display_quartz = GDK_QUARTZ_DISPLAY (object); |
|---|
| 1726 | :info:build ^ |
|---|
| 1727 | :info:build gdkdisplay-quartz.c:218:21: warning: unused variable 'display_quartz' [-Wunused-variable] |
|---|
| 1728 | :info:build GdkQuartzDisplay *display_quartz = GDK_QUARTZ_DISPLAY (object); |
|---|
| 1729 | :info:build ^ |
|---|
| 1730 | :info:build 2 warnings generated. |
|---|
| 1731 | :info:build libtool: compile: /opt/local/bin/clang-mp-3.4 -arch ppc -DHAVE_CONFIG_H -I. -I../.. -DG_LOG_DOMAIN=\"Gdk\" -DG_LOG_USE_STRUCTURED=1 -DGDK_COMPILATION -I../.. -I../../gdk -I../../gdk -DG_ENABLE_DEBUG -DG_DISABLE_CAST_CHECKS -DGLIB_MIN_REQUIRED_VERSION=GLIB_VERSION_2_48 -DGLIB_MAX_ALLOWED_VERSION=GLIB_VERSION_2_50 -D_REENTRANT -I/opt/local/include/pango-1.0 -I/opt/local/include/harfbuzz -I/opt/local/include -I/opt/local/include/pango-1.0 -I/opt/local/include/gdk-pixbuf-2.0 -I/opt/local/include/libpng16 -I/opt/local/include/cairo -I/opt/local/include/gio-unix-2.0/ -I/opt/local/include/cairo -I/opt/local/include/glib-2.0 -I/opt/local/lib/glib-2.0/include -I/opt/local/include -I/opt/local/include/pixman-1 -I/opt/local/include -I/opt/local/include/freetype2 -I/opt/local/include -I/opt/local/include/freetype2 -I/opt/local/include/libpng16 -I/opt/local/include -xobjective-c -I/opt/local/include -DX_LOCALE -pipe -Os -fstrict-aliasing -arch ppc -Wall -MT gdkdisplay-quartz.lo -MD -MP -MF .deps/gdkdisplay-quartz.Tpo -c gdkdisplay-quartz.c -o gdkdisplay-quartz.o >/dev/null 2>&1 |
|---|
| 1732 | :info:build mv -f .deps/gdkdisplay-quartz.Tpo .deps/gdkdisplay-quartz.Plo |
|---|
| 1733 | :info:build /bin/sh ../../libtool --tag=CC --mode=compile /opt/local/bin/clang-mp-3.4 -arch ppc -DHAVE_CONFIG_H -I. -I../.. -DG_LOG_DOMAIN=\"Gdk\" -DG_LOG_USE_STRUCTURED=1 -DGDK_COMPILATION -I../.. -I../../gdk -I../../gdk -DG_ENABLE_DEBUG -DG_DISABLE_CAST_CHECKS -DGLIB_MIN_REQUIRED_VERSION=GLIB_VERSION_2_48 -DGLIB_MAX_ALLOWED_VERSION=GLIB_VERSION_2_50 -D_REENTRANT -I/opt/local/include/pango-1.0 -I/opt/local/include/harfbuzz -I/opt/local/include -I/opt/local/include/pango-1.0 -I/opt/local/include/gdk-pixbuf-2.0 -I/opt/local/include/libpng16 -I/opt/local/include/cairo -I/opt/local/include/gio-unix-2.0/ -I/opt/local/include/cairo -I/opt/local/include/glib-2.0 -I/opt/local/lib/glib-2.0/include -I/opt/local/include -I/opt/local/include/pixman-1 -I/opt/local/include -I/opt/local/include/freetype2 -I/opt/local/include -I/opt/local/include/freetype2 -I/opt/local/include/libpng16 -I/opt/local/include "-xobjective-c" -I/opt/local/include -DX_LOCALE -pipe -Os -fstrict-aliasing -arch ppc -Wall -MT gdkdisplaymanager-quartz.lo -MD -MP -MF .deps/gdkdisplaymanager-quartz.Tpo -c -o gdkdisplaymanager-quartz.lo gdkdisplaymanager-quartz.c |
|---|
| 1734 | :info:build libtool: compile: /opt/local/bin/clang-mp-3.4 -arch ppc -DHAVE_CONFIG_H -I. -I../.. -DG_LOG_DOMAIN=\"Gdk\" -DG_LOG_USE_STRUCTURED=1 -DGDK_COMPILATION -I../.. -I../../gdk -I../../gdk -DG_ENABLE_DEBUG -DG_DISABLE_CAST_CHECKS -DGLIB_MIN_REQUIRED_VERSION=GLIB_VERSION_2_48 -DGLIB_MAX_ALLOWED_VERSION=GLIB_VERSION_2_50 -D_REENTRANT -I/opt/local/include/pango-1.0 -I/opt/local/include/harfbuzz -I/opt/local/include -I/opt/local/include/pango-1.0 -I/opt/local/include/gdk-pixbuf-2.0 -I/opt/local/include/libpng16 -I/opt/local/include/cairo -I/opt/local/include/gio-unix-2.0/ -I/opt/local/include/cairo -I/opt/local/include/glib-2.0 -I/opt/local/lib/glib-2.0/include -I/opt/local/include -I/opt/local/include/pixman-1 -I/opt/local/include -I/opt/local/include/freetype2 -I/opt/local/include -I/opt/local/include/freetype2 -I/opt/local/include/libpng16 -I/opt/local/include -xobjective-c -I/opt/local/include -DX_LOCALE -pipe -Os -fstrict-aliasing -arch ppc -Wall -MT gdkdisplaymanager-quartz.lo -MD -MP -MF .deps/gdkdisplaymanager-quartz.Tpo -c gdkdisplaymanager-quartz.c -fno-common -DPIC -o .libs/gdkdisplaymanager-quartz.o |
|---|
| 1735 | :info:build gdkdisplaymanager-quartz.c:58:27: warning: unused variable 'manager_class' [-Wunused-variable] |
|---|
| 1736 | :info:build GdkDisplayManagerClass *manager_class = GDK_DISPLAY_MANAGER_CLASS (class); |
|---|
| 1737 | :info:build ^ |
|---|
| 1738 | :info:build 1 warning generated. |
|---|
| 1739 | :info:build libtool: compile: /opt/local/bin/clang-mp-3.4 -arch ppc -DHAVE_CONFIG_H -I. -I../.. -DG_LOG_DOMAIN=\"Gdk\" -DG_LOG_USE_STRUCTURED=1 -DGDK_COMPILATION -I../.. -I../../gdk -I../../gdk -DG_ENABLE_DEBUG -DG_DISABLE_CAST_CHECKS -DGLIB_MIN_REQUIRED_VERSION=GLIB_VERSION_2_48 -DGLIB_MAX_ALLOWED_VERSION=GLIB_VERSION_2_50 -D_REENTRANT -I/opt/local/include/pango-1.0 -I/opt/local/include/harfbuzz -I/opt/local/include -I/opt/local/include/pango-1.0 -I/opt/local/include/gdk-pixbuf-2.0 -I/opt/local/include/libpng16 -I/opt/local/include/cairo -I/opt/local/include/gio-unix-2.0/ -I/opt/local/include/cairo -I/opt/local/include/glib-2.0 -I/opt/local/lib/glib-2.0/include -I/opt/local/include -I/opt/local/include/pixman-1 -I/opt/local/include -I/opt/local/include/freetype2 -I/opt/local/include -I/opt/local/include/freetype2 -I/opt/local/include/libpng16 -I/opt/local/include -xobjective-c -I/opt/local/include -DX_LOCALE -pipe -Os -fstrict-aliasing -arch ppc -Wall -MT gdkdisplaymanager-quartz.lo -MD -MP -MF .deps/gdkdisplaymanager-quartz.Tpo -c gdkdisplaymanager-quartz.c -o gdkdisplaymanager-quartz.o >/dev/null 2>&1 |
|---|
| 1740 | :info:build mv -f .deps/gdkdisplaymanager-quartz.Tpo .deps/gdkdisplaymanager-quartz.Plo |
|---|
| 1741 | :info:build /bin/sh ../../libtool --tag=CC --mode=compile /opt/local/bin/clang-mp-3.4 -arch ppc -DHAVE_CONFIG_H -I. -I../.. -DG_LOG_DOMAIN=\"Gdk\" -DG_LOG_USE_STRUCTURED=1 -DGDK_COMPILATION -I../.. -I../../gdk -I../../gdk -DG_ENABLE_DEBUG -DG_DISABLE_CAST_CHECKS -DGLIB_MIN_REQUIRED_VERSION=GLIB_VERSION_2_48 -DGLIB_MAX_ALLOWED_VERSION=GLIB_VERSION_2_50 -D_REENTRANT -I/opt/local/include/pango-1.0 -I/opt/local/include/harfbuzz -I/opt/local/include -I/opt/local/include/pango-1.0 -I/opt/local/include/gdk-pixbuf-2.0 -I/opt/local/include/libpng16 -I/opt/local/include/cairo -I/opt/local/include/gio-unix-2.0/ -I/opt/local/include/cairo -I/opt/local/include/glib-2.0 -I/opt/local/lib/glib-2.0/include -I/opt/local/include -I/opt/local/include/pixman-1 -I/opt/local/include -I/opt/local/include/freetype2 -I/opt/local/include -I/opt/local/include/freetype2 -I/opt/local/include/libpng16 -I/opt/local/include "-xobjective-c" -I/opt/local/include -DX_LOCALE -pipe -Os -fstrict-aliasing -arch ppc -Wall -MT gdkdnd-quartz.lo -MD -MP -MF .deps/gdkdnd-quartz.Tpo -c -o gdkdnd-quartz.lo gdkdnd-quartz.c |
|---|
| 1742 | :info:build libtool: compile: /opt/local/bin/clang-mp-3.4 -arch ppc -DHAVE_CONFIG_H -I. -I../.. -DG_LOG_DOMAIN=\"Gdk\" -DG_LOG_USE_STRUCTURED=1 -DGDK_COMPILATION -I../.. -I../../gdk -I../../gdk -DG_ENABLE_DEBUG -DG_DISABLE_CAST_CHECKS -DGLIB_MIN_REQUIRED_VERSION=GLIB_VERSION_2_48 -DGLIB_MAX_ALLOWED_VERSION=GLIB_VERSION_2_50 -D_REENTRANT -I/opt/local/include/pango-1.0 -I/opt/local/include/harfbuzz -I/opt/local/include -I/opt/local/include/pango-1.0 -I/opt/local/include/gdk-pixbuf-2.0 -I/opt/local/include/libpng16 -I/opt/local/include/cairo -I/opt/local/include/gio-unix-2.0/ -I/opt/local/include/cairo -I/opt/local/include/glib-2.0 -I/opt/local/lib/glib-2.0/include -I/opt/local/include -I/opt/local/include/pixman-1 -I/opt/local/include -I/opt/local/include/freetype2 -I/opt/local/include -I/opt/local/include/freetype2 -I/opt/local/include/libpng16 -I/opt/local/include -xobjective-c -I/opt/local/include -DX_LOCALE -pipe -Os -fstrict-aliasing -arch ppc -Wall -MT gdkdnd-quartz.lo -MD -MP -MF .deps/gdkdnd-quartz.Tpo -c gdkdnd-quartz.c -fno-common -DPIC -o .libs/gdkdnd-quartz.o |
|---|
| 1743 | :info:build libtool: compile: /opt/local/bin/clang-mp-3.4 -arch ppc -DHAVE_CONFIG_H -I. -I../.. -DG_LOG_DOMAIN=\"Gdk\" -DG_LOG_USE_STRUCTURED=1 -DGDK_COMPILATION -I../.. -I../../gdk -I../../gdk -DG_ENABLE_DEBUG -DG_DISABLE_CAST_CHECKS -DGLIB_MIN_REQUIRED_VERSION=GLIB_VERSION_2_48 -DGLIB_MAX_ALLOWED_VERSION=GLIB_VERSION_2_50 -D_REENTRANT -I/opt/local/include/pango-1.0 -I/opt/local/include/harfbuzz -I/opt/local/include -I/opt/local/include/pango-1.0 -I/opt/local/include/gdk-pixbuf-2.0 -I/opt/local/include/libpng16 -I/opt/local/include/cairo -I/opt/local/include/gio-unix-2.0/ -I/opt/local/include/cairo -I/opt/local/include/glib-2.0 -I/opt/local/lib/glib-2.0/include -I/opt/local/include -I/opt/local/include/pixman-1 -I/opt/local/include -I/opt/local/include/freetype2 -I/opt/local/include -I/opt/local/include/freetype2 -I/opt/local/include/libpng16 -I/opt/local/include -xobjective-c -I/opt/local/include -DX_LOCALE -pipe -Os -fstrict-aliasing -arch ppc -Wall -MT gdkdnd-quartz.lo -MD -MP -MF .deps/gdkdnd-quartz.Tpo -c gdkdnd-quartz.c -o gdkdnd-quartz.o >/dev/null 2>&1 |
|---|
| 1744 | :info:build mv -f .deps/gdkdnd-quartz.Tpo .deps/gdkdnd-quartz.Plo |
|---|
| 1745 | :info:build /bin/sh ../../libtool --tag=CC --mode=compile /opt/local/bin/clang-mp-3.4 -arch ppc -DHAVE_CONFIG_H -I. -I../.. -DG_LOG_DOMAIN=\"Gdk\" -DG_LOG_USE_STRUCTURED=1 -DGDK_COMPILATION -I../.. -I../../gdk -I../../gdk -DG_ENABLE_DEBUG -DG_DISABLE_CAST_CHECKS -DGLIB_MIN_REQUIRED_VERSION=GLIB_VERSION_2_48 -DGLIB_MAX_ALLOWED_VERSION=GLIB_VERSION_2_50 -D_REENTRANT -I/opt/local/include/pango-1.0 -I/opt/local/include/harfbuzz -I/opt/local/include -I/opt/local/include/pango-1.0 -I/opt/local/include/gdk-pixbuf-2.0 -I/opt/local/include/libpng16 -I/opt/local/include/cairo -I/opt/local/include/gio-unix-2.0/ -I/opt/local/include/cairo -I/opt/local/include/glib-2.0 -I/opt/local/lib/glib-2.0/include -I/opt/local/include -I/opt/local/include/pixman-1 -I/opt/local/include -I/opt/local/include/freetype2 -I/opt/local/include -I/opt/local/include/freetype2 -I/opt/local/include/libpng16 -I/opt/local/include "-xobjective-c" -I/opt/local/include -DX_LOCALE -pipe -Os -fstrict-aliasing -arch ppc -Wall -MT gdkevents-quartz.lo -MD -MP -MF .deps/gdkevents-quartz.Tpo -c -o gdkevents-quartz.lo gdkevents-quartz.c |
|---|
| 1746 | :info:build libtool: compile: /opt/local/bin/clang-mp-3.4 -arch ppc -DHAVE_CONFIG_H -I. -I../.. -DG_LOG_DOMAIN=\"Gdk\" -DG_LOG_USE_STRUCTURED=1 -DGDK_COMPILATION -I../.. -I../../gdk -I../../gdk -DG_ENABLE_DEBUG -DG_DISABLE_CAST_CHECKS -DGLIB_MIN_REQUIRED_VERSION=GLIB_VERSION_2_48 -DGLIB_MAX_ALLOWED_VERSION=GLIB_VERSION_2_50 -D_REENTRANT -I/opt/local/include/pango-1.0 -I/opt/local/include/harfbuzz -I/opt/local/include -I/opt/local/include/pango-1.0 -I/opt/local/include/gdk-pixbuf-2.0 -I/opt/local/include/libpng16 -I/opt/local/include/cairo -I/opt/local/include/gio-unix-2.0/ -I/opt/local/include/cairo -I/opt/local/include/glib-2.0 -I/opt/local/lib/glib-2.0/include -I/opt/local/include -I/opt/local/include/pixman-1 -I/opt/local/include -I/opt/local/include/freetype2 -I/opt/local/include -I/opt/local/include/freetype2 -I/opt/local/include/libpng16 -I/opt/local/include -xobjective-c -I/opt/local/include -DX_LOCALE -pipe -Os -fstrict-aliasing -arch ppc -Wall -MT gdkevents-quartz.lo -MD -MP -MF .deps/gdkevents-quartz.Tpo -c gdkevents-quartz.c -fno-common -DPIC -o .libs/gdkevents-quartz.o |
|---|
| 1747 | :info:build gdkevents-quartz.c:134:20: warning: 'gdk_display_get_device_manager' is deprecated [-Wdeprecated-declarations] |
|---|
| 1748 | :info:build device_manager = gdk_display_get_device_manager (_gdk_display); |
|---|
| 1749 | :info:build ^ |
|---|
| 1750 | :info:build ../../gdk/gdkdisplay.h:171:20: note: 'gdk_display_get_device_manager' declared here |
|---|
| 1751 | :info:build GdkDeviceManager * gdk_display_get_device_manager (GdkDisplay *display); |
|---|
| 1752 | :info:build ^ |
|---|
| 1753 | :info:build gdkevents-quartz.c:135:10: warning: 'gdk_device_manager_list_devices' is deprecated [-Wdeprecated-declarations] |
|---|
| 1754 | :info:build list = gdk_device_manager_list_devices (device_manager, |
|---|
| 1755 | :info:build ^ |
|---|
| 1756 | :info:build ../../gdk/gdkdevicemanager.h:41:14: note: 'gdk_device_manager_list_devices' declared here |
|---|
| 1757 | :info:build GList * gdk_device_manager_list_devices (GdkDeviceManager *device_manager, |
|---|
| 1758 | :info:build ^ |
|---|
| 1759 | :info:build gdkevents-quartz.c:356:10: error: use of undeclared identifier 'NSEventTypeMagnify' |
|---|
| 1760 | :info:build case NSEventTypeMagnify: |
|---|
| 1761 | :info:build ^ |
|---|
| 1762 | :info:build gdkevents-quartz.c:357:10: error: use of undeclared identifier 'NSEventTypeRotate' |
|---|
| 1763 | :info:build case NSEventTypeRotate: |
|---|
| 1764 | :info:build ^ |
|---|
| 1765 | :info:build gdkevents-quartz.c:661:20: warning: 'gdk_display_get_device_manager' is deprecated [-Wdeprecated-declarations] |
|---|
| 1766 | :info:build device_manager = gdk_display_get_device_manager (display); |
|---|
| 1767 | :info:build ^ |
|---|
| 1768 | :info:build ../../gdk/gdkdisplay.h:171:20: note: 'gdk_display_get_device_manager' declared here |
|---|
| 1769 | :info:build GdkDeviceManager * gdk_display_get_device_manager (GdkDisplay *display); |
|---|
| 1770 | :info:build ^ |
|---|
| 1771 | :info:build gdkevents-quartz.c:662:10: warning: 'gdk_device_manager_list_devices' is deprecated [-Wdeprecated-declarations] |
|---|
| 1772 | :info:build list = gdk_device_manager_list_devices (device_manager, |
|---|
| 1773 | :info:build ^ |
|---|
| 1774 | :info:build ../../gdk/gdkdevicemanager.h:41:14: note: 'gdk_device_manager_list_devices' declared here |
|---|
| 1775 | :info:build GList * gdk_device_manager_list_devices (GdkDeviceManager *device_manager, |
|---|
| 1776 | :info:build ^ |
|---|
| 1777 | :info:build gdkevents-quartz.c:835:10: error: use of undeclared identifier 'NSEventTypeMagnify' |
|---|
| 1778 | :info:build case NSEventTypeMagnify: |
|---|
| 1779 | :info:build ^ |
|---|
| 1780 | :info:build gdkevents-quartz.c:836:10: error: use of undeclared identifier 'NSEventTypeRotate' |
|---|
| 1781 | :info:build case NSEventTypeRotate: |
|---|
| 1782 | :info:build ^ |
|---|
| 1783 | :info:build gdkevents-quartz.c:1319:83: warning: instance method 'modifierFlags' is being used on 'Class' which is not in the root class [-Wobjc-method-access] |
|---|
| 1784 | :info:build return get_keyboard_modifiers_from_ns_flags ([NSClassFromString(@"NSEvent") modifierFlags]); |
|---|
| 1785 | :info:build ~~~~~~~~~~~~~~~~~~~~~~~~~~~~~~~^~~~~~~~~~~~~~ |
|---|
| 1786 | :info:build gdkevents-quartz.c:1346:89: warning: class method '+pressedMouseButtons' not found (return type defaults to 'id') [-Wobjc-method-access] |
|---|
| 1787 | :info:build return get_mouse_button_modifiers_from_ns_buttons ([NSClassFromString(@"NSEvent") pressedMouseButtons]); |
|---|
| 1788 | :info:build ^~~~~~~~~~~~~~~~~~~ |
|---|
| 1789 | :info:build gdkevents-quartz.c:1346:58: warning: incompatible pointer to integer conversion passing 'id' to parameter of type 'NSUInteger' (aka 'unsigned int') [-Wint-conversion] |
|---|
| 1790 | :info:build return get_mouse_button_modifiers_from_ns_buttons ([NSClassFromString(@"NSEvent") pressedMouseButtons]); |
|---|
| 1791 | :info:build ^~~~~~~~~~~~~~~~~~~~~~~~~~~~~~~~~~~~~~~~~~~~~~~~~~~ |
|---|
| 1792 | :info:build gdkevents-quartz.c:255:56: note: passing argument to parameter 'nsbuttons' here |
|---|
| 1793 | :info:build get_mouse_button_modifiers_from_ns_buttons (NSUInteger nsbuttons) |
|---|
| 1794 | :info:build ^ |
|---|
| 1795 | :info:build 7 warnings and 4 errors generated. |
|---|
| 1796 | :info:build make[4]: *** [gdkevents-quartz.lo] Error 1 |
|---|
| 1797 | :info:build make[4]: Leaving directory `/opt/local/var/macports/build/_opt_local_var_macports_sources_nue.de.rsync.macports.org_macports_release_tarballs_ports_gnome_gtk3/gtk3/work/gtk+-3.22.5/gdk/quartz' |
|---|
| 1798 | :info:build make[3]: *** [all-recursive] Error 1 |
|---|
| 1799 | :info:build make[3]: Leaving directory `/opt/local/var/macports/build/_opt_local_var_macports_sources_nue.de.rsync.macports.org_macports_release_tarballs_ports_gnome_gtk3/gtk3/work/gtk+-3.22.5/gdk' |
|---|
| 1800 | :info:build make[2]: *** [all] Error 2 |
|---|
| 1801 | :info:build make[2]: Leaving directory `/opt/local/var/macports/build/_opt_local_var_macports_sources_nue.de.rsync.macports.org_macports_release_tarballs_ports_gnome_gtk3/gtk3/work/gtk+-3.22.5/gdk' |
|---|
| 1802 | :info:build make[1]: *** [all-recursive] Error 1 |
|---|
| 1803 | :info:build make[1]: Leaving directory `/opt/local/var/macports/build/_opt_local_var_macports_sources_nue.de.rsync.macports.org_macports_release_tarballs_ports_gnome_gtk3/gtk3/work/gtk+-3.22.5' |
|---|
| 1804 | :info:build make: *** [all] Error 2 |
|---|
| 1805 | :info:build make: Leaving directory `/opt/local/var/macports/build/_opt_local_var_macports_sources_nue.de.rsync.macports.org_macports_release_tarballs_ports_gnome_gtk3/gtk3/work/gtk+-3.22.5' |
|---|
| 1806 | :info:build Command failed: cd "/opt/local/var/macports/build/_opt_local_var_macports_sources_nue.de.rsync.macports.org_macports_release_tarballs_ports_gnome_gtk3/gtk3/work/gtk+-3.22.5" && /usr/bin/make -w all CC="/opt/local/bin/clang-mp-3.4 -arch ppc" CC_FOR_BUILD="/opt/local/bin/clang-mp-3.4 -arch ppc -Wl,-read_only_relocs suppress" ac_ct_CC_FOR_BUILD="/opt/local/bin/clang-mp-3.4 -arch ppc -Wl,-read_only_relocs suppress" LDFLAGS="-L/opt/local/lib -Wl,-headerpad_max_install_names -read_only_relocs suppress" V=1 CPP_FOR_BUILD="/usr/bin/cpp" |
|---|
| 1807 | :info:build Exit code: 2 |
|---|
| 1808 | :error:build Failed to build gtk3: command execution failed |
|---|
| 1809 | :debug:build Error code: CHILDSTATUS 18340 2 |
|---|
| 1810 | :debug:build Backtrace: command execution failed |
|---|
| 1811 | while executing |
|---|
| 1812 | "system {*}$notty {*}$nice $fullcmdstring" |
|---|
| 1813 | invoked from within |
|---|
| 1814 | "command_exec build" |
|---|
| 1815 | (procedure "portbuild::build_main" line 8) |
|---|
| 1816 | invoked from within |
|---|
| 1817 | "$procedure $targetname" |
|---|
| 1818 | :error:build See /opt/local/var/macports/logs/_opt_local_var_macports_sources_nue.de.rsync.macports.org_macports_release_tarballs_ports_gnome_gtk3/gtk3/main.log for details. |
|---|