Ticket #52680: main.log

File main.log, 143.9 KB (added by ekawahyu (Ekawahyu Susilo), 5 years ago)
Line 
1version:1
2:debug:main epoch: in tree: 0 installed: 0
3:debug:main xz 5.2.2_0 exists in the ports tree
4:debug:main xz 5.2.2_0  is the latest installed
5:debug:main xz 5.2.2_0 +universal is active
6:debug:main Merging existing variants '+universal' into variants
7:debug:main new fully merged portvariants: universal +
8:debug:main Changing to port directory: /opt/local/var/macports/sources/rsync.macports.org/release/tarballs/ports/archivers/xz
9:debug:main OS darwin/14.5.0 (Mac OS X 10.10) arch i386
10:debug:main adding the default universal variant
11:debug:main Reading variant descriptions from /opt/local/var/macports/sources/rsync.macports.org/release/tarballs/ports/_resources/port1.0/variant_descriptions.conf
12:debug:main Executing variant universal provides universal
13:debug:main Running callback portconfigure::add_automatic_compiler_dependencies
14:debug:main Finished running callback portconfigure::add_automatic_compiler_dependencies
15:debug:main Running callback portbuild::add_automatic_buildsystem_dependencies
16:debug:main Finished running callback portbuild::add_automatic_buildsystem_dependencies
17:debug:main No need to upgrade! xz 5.2.2_0 >= xz 5.2.2_0
18:debug:main epoch: in tree: 0 installed: 0
19:debug:main libiconv 1.14_0 exists in the ports tree
20:debug:main libiconv 1.14_0  is the latest installed
21:debug:main libiconv 1.14_0 +universal is active
22:debug:main Merging existing variants '+universal' into variants
23:debug:main new fully merged portvariants: universal +
24:debug:main Changing to port directory: /opt/local/var/macports/sources/rsync.macports.org/release/tarballs/ports/textproc/libiconv
25:debug:main OS darwin/14.5.0 (Mac OS X 10.10) arch i386
26:debug:main Reading variant descriptions from /opt/local/var/macports/sources/rsync.macports.org/release/tarballs/ports/_resources/port1.0/variant_descriptions.conf
27:debug:main Sourcing PortGroup muniversal 1.0 from /opt/local/var/macports/sources/rsync.macports.org/release/tarballs/ports/_resources/port1.0/group/muniversal-1.0.tcl
28:debug:main universal variant already exists, so not adding the default one
29:debug:main Executing variant universal provides universal
30:debug:main Running callback portconfigure::add_automatic_compiler_dependencies
31:debug:main Finished running callback portconfigure::add_automatic_compiler_dependencies
32:debug:main Running callback portbuild::add_automatic_buildsystem_dependencies
33:debug:main Finished running callback portbuild::add_automatic_buildsystem_dependencies
34:debug:main No need to upgrade! libiconv 1.14_0 >= libiconv 1.14_0
35:debug:main epoch: in tree: 2 installed: 2
36:debug:main gettext 0.19.8.1_0 exists in the ports tree
37:debug:main gettext 0.19.8.1_0  is the latest installed
38:debug:main gettext 0.19.8.1_0 +universal is active
39:debug:main Merging existing variants '+universal' into variants
40:debug:main new fully merged portvariants: universal +
41:debug:main Changing to port directory: /opt/local/var/macports/sources/rsync.macports.org/release/tarballs/ports/devel/gettext
42:debug:main OS darwin/14.5.0 (Mac OS X 10.10) arch i386
43:debug:main Sourcing PortGroup compiler_blacklist_versions 1.0 from /opt/local/var/macports/sources/rsync.macports.org/release/tarballs/ports/_resources/port1.0/group/compiler_blacklist_versions-1.0.tcl
44:debug:main Reading variant descriptions from /opt/local/var/macports/sources/rsync.macports.org/release/tarballs/ports/_resources/port1.0/variant_descriptions.conf
45:debug:main Sourcing PortGroup muniversal 1.0 from /opt/local/var/macports/sources/rsync.macports.org/release/tarballs/ports/_resources/port1.0/group/muniversal-1.0.tcl
46:debug:main compiler clang 700.1.81 not blacklisted because it doesn't match {clang < 211.10.1}
47:debug:main universal variant already exists, so not adding the default one
48:debug:main Executing variant universal provides universal
49:debug:main Running callback portconfigure::add_automatic_compiler_dependencies
50:debug:main Finished running callback portconfigure::add_automatic_compiler_dependencies
51:debug:main Running callback portbuild::add_automatic_buildsystem_dependencies
52:debug:main Finished running callback portbuild::add_automatic_buildsystem_dependencies
53:debug:main No need to upgrade! gettext 0.19.8.1_0 >= gettext 0.19.8.1_0
54:debug:main epoch: in tree: 0 installed: 0
55:debug:main expat 2.2.0_0 exists in the ports tree
56:debug:main expat 2.2.0_0  is the latest installed
57:debug:main expat 2.2.0_0 +universal is active
58:debug:main Merging existing variants '+universal' into variants
59:debug:main new fully merged portvariants: universal +
60:debug:main Changing to port directory: /opt/local/var/macports/sources/rsync.macports.org/release/tarballs/ports/textproc/expat
61:debug:main OS darwin/14.5.0 (Mac OS X 10.10) arch i386
62:debug:main adding the default universal variant
63:debug:main Reading variant descriptions from /opt/local/var/macports/sources/rsync.macports.org/release/tarballs/ports/_resources/port1.0/variant_descriptions.conf
64:debug:main Executing variant universal provides universal
65:debug:main Running callback portconfigure::add_automatic_compiler_dependencies
66:debug:main Finished running callback portconfigure::add_automatic_compiler_dependencies
67:debug:main Running callback portbuild::add_automatic_buildsystem_dependencies
68:debug:main Finished running callback portbuild::add_automatic_buildsystem_dependencies
69:debug:main No need to upgrade! expat 2.2.0_0 >= expat 2.2.0_0
70:debug:main epoch: in tree: 0 installed: 0
71:debug:main ncurses 6.0_0 exists in the ports tree
72:debug:main ncurses 6.0_0  is the latest installed
73:debug:main ncurses 6.0_0 +universal is active
74:debug:main Merging existing variants '+universal' into variants
75:debug:main new fully merged portvariants: universal +
76:debug:main Changing to port directory: /opt/local/var/macports/sources/rsync.macports.org/release/tarballs/ports/devel/ncurses
77:debug:main OS darwin/14.5.0 (Mac OS X 10.10) arch i386
78:debug:main adding the default universal variant
79:debug:main Reading variant descriptions from /opt/local/var/macports/sources/rsync.macports.org/release/tarballs/ports/_resources/port1.0/variant_descriptions.conf
80:debug:main Executing variant universal provides universal
81:debug:main Running callback portconfigure::add_automatic_compiler_dependencies
82:debug:main Finished running callback portconfigure::add_automatic_compiler_dependencies
83:debug:main Running callback portbuild::add_automatic_buildsystem_dependencies
84:debug:main Finished running callback portbuild::add_automatic_buildsystem_dependencies
85:debug:main No need to upgrade! ncurses 6.0_0 >= ncurses 6.0_0
86:msg:main --->  Computing dependencies for i386-mingw32-binutils:info:main .:debug:main i386-mingw32-binutils has no conflicts
87:debug:main Searching for dependency: xz
88:debug:main Found Dependency: receipt exists for xz
89:debug:main Searching for dependency: gettext
90:debug:main Found Dependency: receipt exists for gettext
91:msg:main
92:debug:main Executing org.macports.main (i386-mingw32-binutils)
93:debug:main changing euid/egid - current euid: 0 - current egid: 0
94:debug:main egid changed to: 501
95:debug:main euid changed to: 502
96:debug:archivefetch archivefetch phase started at Sat Oct 22 13:30:40 PDT 2016
97:msg:archivefetch --->  Fetching archive for i386-mingw32-binutils
98:debug:archivefetch Executing org.macports.archivefetch (i386-mingw32-binutils)
99:debug:archivefetch euid/egid changed to: 0/0
100:debug:archivefetch chowned /opt/local/var/macports/incoming to macports
101:debug:archivefetch euid/egid changed to: 502/501
102:info:archivefetch --->  i386-mingw32-binutils-2.21-3_0.darwin_14.x86_64.tbz2 doesn't seem to exist in /opt/local/var/macports/incoming/verified
103:msg:archivefetch --->  Attempting to fetch i386-mingw32-binutils-2.21-3_0.darwin_14.x86_64.tbz2 from https://packages.macports.org/i386-mingw32-binutils
104:debug:archivefetch Fetching archive failed:: The requested URL returned error: 404 Not Found
105:msg:archivefetch --->  Attempting to fetch i386-mingw32-binutils-2.21-3_0.darwin_14.x86_64.tbz2 from http://sea.us.packages.macports.org/macports/packages/i386-mingw32-binutils
106:debug:archivefetch Fetching archive failed:: The requested URL returned error: 404 Not Found
107:msg:archivefetch --->  Attempting to fetch i386-mingw32-binutils-2.21-3_0.darwin_14.x86_64.tbz2 from http://lil.fr.packages.macports.org/i386-mingw32-binutils
108:debug:archivefetch Fetching archive failed:: The requested URL returned error: 404 Not Found
109:debug:archivefetch Privilege de-escalation not attempted as not running as root.
110:debug:fetch fetch phase started at Sat Oct 22 13:30:45 PDT 2016
111:notice:fetch --->  Fetching distfiles for i386-mingw32-binutils
112:debug:fetch Executing org.macports.fetch (i386-mingw32-binutils)
113:debug:fetch Privilege de-escalation not attempted as not running as root.
114:debug:checksum checksum phase started at Sat Oct 22 13:30:45 PDT 2016
115:notice:checksum --->  Verifying checksums for i386-mingw32-binutils
116:debug:checksum Executing org.macports.checksum (i386-mingw32-binutils)
117:info:checksum --->  Checksumming binutils-2.21-3-mingw32-src.tar.lzma
118:debug:checksum Calculated (sha1) is ad67d8f010b87643087f77390aebef287b00a189
119:debug:checksum Correct (sha1) checksum for binutils-2.21-3-mingw32-src.tar.lzma
120:debug:checksum Calculated (rmd160) is 0774cd01e36e0dfabafd73950cc071754fbe8d1a
121:debug:checksum Correct (rmd160) checksum for binutils-2.21-3-mingw32-src.tar.lzma
122:debug:checksum Privilege de-escalation not attempted as not running as root.
123:debug:extract extract phase started at Sat Oct 22 13:30:45 PDT 2016
124:notice:extract --->  Extracting i386-mingw32-binutils
125:debug:extract setting option extract.cmd to /opt/local/bin/lzma
126:debug:extract Executing org.macports.extract (i386-mingw32-binutils)
127:info:extract --->  Extracting binutils-2.21-3-mingw32-src.tar.lzma
128:debug:extract setting option extract.args to '/opt/local/var/macports/distfiles/i386-mingw32-binutils/binutils-2.21-3-mingw32-src.tar.lzma'
129:debug:extract Environment:
130CC_PRINT_OPTIONS='YES'
131CC_PRINT_OPTIONS_FILE='/opt/local/var/macports/build/_opt_local_var_macports_sources_rsync.macports.org_release_tarballs_ports_cross_i386-mingw32-binutils/i386-mingw32-binutils/work/.CC_PRINT_OPTIONS'
132CPATH='/opt/local/include'
133LIBRARY_PATH='/opt/local/lib'
134MACOSX_DEPLOYMENT_TARGET='10.10'
135:debug:extract Assembled command: 'cd "/opt/local/var/macports/build/_opt_local_var_macports_sources_rsync.macports.org_release_tarballs_ports_cross_i386-mingw32-binutils/i386-mingw32-binutils/work" && /opt/local/bin/lzma -dc '/opt/local/var/macports/distfiles/i386-mingw32-binutils/binutils-2.21-3-mingw32-src.tar.lzma' | /usr/bin/tar -xf -'
136:debug:extract Executing command line:  cd "/opt/local/var/macports/build/_opt_local_var_macports_sources_rsync.macports.org_release_tarballs_ports_cross_i386-mingw32-binutils/i386-mingw32-binutils/work" && /opt/local/bin/lzma -dc '/opt/local/var/macports/distfiles/i386-mingw32-binutils/binutils-2.21-3-mingw32-src.tar.lzma' | /usr/bin/tar -xf -
137:debug:extract euid/egid changed to: 0/0
138:debug:extract chowned /opt/local/var/macports/build/_opt_local_var_macports_sources_rsync.macports.org_release_tarballs_ports_cross_i386-mingw32-binutils/i386-mingw32-binutils/work to macports
139:debug:extract euid/egid changed to: 502/501
140:debug:extract Executing proc-post-org.macports.extract-extract-0
141:debug:extract Privilege de-escalation not attempted as not running as root.
142:debug:patch patch phase started at Sat Oct 22 13:30:51 PDT 2016
143:debug:patch Executing org.macports.patch (i386-mingw32-binutils)
144:debug:patch Executing proc-post-org.macports.patch-patch-0
145:info:patch --->  Patching as.texinfo: s|setfilename as.info|setfilename i386-mingw32-as.info|g
146:debug:patch Executing reinplace: /usr/bin/sed {s|setfilename as.info|setfilename i386-mingw32-as.info|g} < /opt/local/var/macports/build/_opt_local_var_macports_sources_rsync.macports.org_release_tarballs_ports_cross_i386-mingw32-binutils/i386-mingw32-binutils/work/binutils-2.21/gas/doc/as.texinfo >@ file10 2>@stderr
147:debug:patch euid/egid changed to: 0/0
148:debug:patch chowned /opt/local/var/macports/build/_opt_local_var_macports_sources_rsync.macports.org_release_tarballs_ports_cross_i386-mingw32-binutils/i386-mingw32-binutils/work/binutils-2.21/gas/doc/as.texinfo to macports
149:debug:patch euid/egid changed to: 502/501
150:debug:patch euid/egid changed to: 0/0
151:debug:patch setting attributes on /opt/local/var/macports/build/_opt_local_var_macports_sources_rsync.macports.org_release_tarballs_ports_cross_i386-mingw32-binutils/i386-mingw32-binutils/work/binutils-2.21/gas/doc/as.texinfo
152:debug:patch euid/egid changed to: 502/501
153:info:patch --->  Patching as.texinfo: s|(as)|(i386-mingw32-as)|g
154:debug:patch Executing reinplace: /usr/bin/sed s|(as)|(i386-mingw32-as)|g < /opt/local/var/macports/build/_opt_local_var_macports_sources_rsync.macports.org_release_tarballs_ports_cross_i386-mingw32-binutils/i386-mingw32-binutils/work/binutils-2.21/gas/doc/as.texinfo >@ file10 2>@stderr
155:debug:patch euid/egid changed to: 0/0
156:debug:patch chowned /opt/local/var/macports/build/_opt_local_var_macports_sources_rsync.macports.org_release_tarballs_ports_cross_i386-mingw32-binutils/i386-mingw32-binutils/work/binutils-2.21/gas/doc/as.texinfo to macports
157:debug:patch euid/egid changed to: 502/501
158:debug:patch euid/egid changed to: 0/0
159:debug:patch setting attributes on /opt/local/var/macports/build/_opt_local_var_macports_sources_rsync.macports.org_release_tarballs_ports_cross_i386-mingw32-binutils/i386-mingw32-binutils/work/binutils-2.21/gas/doc/as.texinfo
160:debug:patch euid/egid changed to: 502/501
161:info:patch --->  Patching as.texinfo: s|@file{as}|@file{i386-mingw32-as}|g
162:debug:patch Executing reinplace: /usr/bin/sed s|@file{as}|@file{i386-mingw32-as}|g < /opt/local/var/macports/build/_opt_local_var_macports_sources_rsync.macports.org_release_tarballs_ports_cross_i386-mingw32-binutils/i386-mingw32-binutils/work/binutils-2.21/gas/doc/as.texinfo >@ file10 2>@stderr
163:debug:patch euid/egid changed to: 0/0
164:debug:patch chowned /opt/local/var/macports/build/_opt_local_var_macports_sources_rsync.macports.org_release_tarballs_ports_cross_i386-mingw32-binutils/i386-mingw32-binutils/work/binutils-2.21/gas/doc/as.texinfo to macports
165:debug:patch euid/egid changed to: 502/501
166:debug:patch euid/egid changed to: 0/0
167:debug:patch setting attributes on /opt/local/var/macports/build/_opt_local_var_macports_sources_rsync.macports.org_release_tarballs_ports_cross_i386-mingw32-binutils/i386-mingw32-binutils/work/binutils-2.21/gas/doc/as.texinfo
168:debug:patch euid/egid changed to: 502/501
169:info:patch --->  Patching Makefile.in: s|as.info|i386-mingw32-as.info|g
170:debug:patch Executing reinplace: /usr/bin/sed s|as.info|i386-mingw32-as.info|g < /opt/local/var/macports/build/_opt_local_var_macports_sources_rsync.macports.org_release_tarballs_ports_cross_i386-mingw32-binutils/i386-mingw32-binutils/work/binutils-2.21/gas/doc/Makefile.in >@ file10 2>@stderr
171:debug:patch euid/egid changed to: 0/0
172:debug:patch chowned /opt/local/var/macports/build/_opt_local_var_macports_sources_rsync.macports.org_release_tarballs_ports_cross_i386-mingw32-binutils/i386-mingw32-binutils/work/binutils-2.21/gas/doc/Makefile.in to macports
173:debug:patch euid/egid changed to: 502/501
174:debug:patch euid/egid changed to: 0/0
175:debug:patch setting attributes on /opt/local/var/macports/build/_opt_local_var_macports_sources_rsync.macports.org_release_tarballs_ports_cross_i386-mingw32-binutils/i386-mingw32-binutils/work/binutils-2.21/gas/doc/Makefile.in
176:debug:patch euid/egid changed to: 502/501
177:info:patch --->  Patching Makefile.in: s|as.texinfo|i386-mingw32-as.texinfo|g
178:debug:patch Executing reinplace: /usr/bin/sed s|as.texinfo|i386-mingw32-as.texinfo|g < /opt/local/var/macports/build/_opt_local_var_macports_sources_rsync.macports.org_release_tarballs_ports_cross_i386-mingw32-binutils/i386-mingw32-binutils/work/binutils-2.21/gas/doc/Makefile.in >@ file10 2>@stderr
179:debug:patch euid/egid changed to: 0/0
180:debug:patch chowned /opt/local/var/macports/build/_opt_local_var_macports_sources_rsync.macports.org_release_tarballs_ports_cross_i386-mingw32-binutils/i386-mingw32-binutils/work/binutils-2.21/gas/doc/Makefile.in to macports
181:debug:patch euid/egid changed to: 502/501
182:debug:patch euid/egid changed to: 0/0
183:debug:patch setting attributes on /opt/local/var/macports/build/_opt_local_var_macports_sources_rsync.macports.org_release_tarballs_ports_cross_i386-mingw32-binutils/i386-mingw32-binutils/work/binutils-2.21/gas/doc/Makefile.in
184:debug:patch euid/egid changed to: 502/501
185:info:patch --->  Patching Makefile.in: s|__TARGET|i386-mingw32|g
186:debug:patch Executing reinplace: /usr/bin/sed s|__TARGET|i386-mingw32|g < /opt/local/var/macports/build/_opt_local_var_macports_sources_rsync.macports.org_release_tarballs_ports_cross_i386-mingw32-binutils/i386-mingw32-binutils/work/binutils-2.21/gas/doc/Makefile.in >@ file10 2>@stderr
187:debug:patch euid/egid changed to: 0/0
188:debug:patch chowned /opt/local/var/macports/build/_opt_local_var_macports_sources_rsync.macports.org_release_tarballs_ports_cross_i386-mingw32-binutils/i386-mingw32-binutils/work/binutils-2.21/gas/doc/Makefile.in to macports
189:debug:patch euid/egid changed to: 502/501
190:debug:patch euid/egid changed to: 0/0
191:debug:patch setting attributes on /opt/local/var/macports/build/_opt_local_var_macports_sources_rsync.macports.org_release_tarballs_ports_cross_i386-mingw32-binutils/i386-mingw32-binutils/work/binutils-2.21/gas/doc/Makefile.in
192:debug:patch euid/egid changed to: 502/501
193:info:patch --->  Patching bfd.texinfo: s|setfilename bfd.info|setfilename i386-mingw32-bfd.info|g
194:debug:patch Executing reinplace: /usr/bin/sed {s|setfilename bfd.info|setfilename i386-mingw32-bfd.info|g} < /opt/local/var/macports/build/_opt_local_var_macports_sources_rsync.macports.org_release_tarballs_ports_cross_i386-mingw32-binutils/i386-mingw32-binutils/work/binutils-2.21/bfd/doc/bfd.texinfo >@ file10 2>@stderr
195:debug:patch euid/egid changed to: 0/0
196:debug:patch chowned /opt/local/var/macports/build/_opt_local_var_macports_sources_rsync.macports.org_release_tarballs_ports_cross_i386-mingw32-binutils/i386-mingw32-binutils/work/binutils-2.21/bfd/doc/bfd.texinfo to macports
197:debug:patch euid/egid changed to: 502/501
198:debug:patch euid/egid changed to: 0/0
199:debug:patch setting attributes on /opt/local/var/macports/build/_opt_local_var_macports_sources_rsync.macports.org_release_tarballs_ports_cross_i386-mingw32-binutils/i386-mingw32-binutils/work/binutils-2.21/bfd/doc/bfd.texinfo
200:debug:patch euid/egid changed to: 502/501
201:info:patch --->  Patching bfd.texinfo: s|(bfd)|(i386-mingw32-bfd)|g
202:debug:patch Executing reinplace: /usr/bin/sed s|(bfd)|(i386-mingw32-bfd)|g < /opt/local/var/macports/build/_opt_local_var_macports_sources_rsync.macports.org_release_tarballs_ports_cross_i386-mingw32-binutils/i386-mingw32-binutils/work/binutils-2.21/bfd/doc/bfd.texinfo >@ file10 2>@stderr
203:debug:patch euid/egid changed to: 0/0
204:debug:patch chowned /opt/local/var/macports/build/_opt_local_var_macports_sources_rsync.macports.org_release_tarballs_ports_cross_i386-mingw32-binutils/i386-mingw32-binutils/work/binutils-2.21/bfd/doc/bfd.texinfo to macports
205:debug:patch euid/egid changed to: 502/501
206:debug:patch euid/egid changed to: 0/0
207:debug:patch setting attributes on /opt/local/var/macports/build/_opt_local_var_macports_sources_rsync.macports.org_release_tarballs_ports_cross_i386-mingw32-binutils/i386-mingw32-binutils/work/binutils-2.21/bfd/doc/bfd.texinfo
208:debug:patch euid/egid changed to: 502/501
209:info:patch --->  Patching bfd.texinfo: s|@file{bfd}|@file{i386-mingw32-bfd}|g
210:debug:patch Executing reinplace: /usr/bin/sed s|@file{bfd}|@file{i386-mingw32-bfd}|g < /opt/local/var/macports/build/_opt_local_var_macports_sources_rsync.macports.org_release_tarballs_ports_cross_i386-mingw32-binutils/i386-mingw32-binutils/work/binutils-2.21/bfd/doc/bfd.texinfo >@ file10 2>@stderr
211:debug:patch euid/egid changed to: 0/0
212:debug:patch chowned /opt/local/var/macports/build/_opt_local_var_macports_sources_rsync.macports.org_release_tarballs_ports_cross_i386-mingw32-binutils/i386-mingw32-binutils/work/binutils-2.21/bfd/doc/bfd.texinfo to macports
213:debug:patch euid/egid changed to: 502/501
214:debug:patch euid/egid changed to: 0/0
215:debug:patch setting attributes on /opt/local/var/macports/build/_opt_local_var_macports_sources_rsync.macports.org_release_tarballs_ports_cross_i386-mingw32-binutils/i386-mingw32-binutils/work/binutils-2.21/bfd/doc/bfd.texinfo
216:debug:patch euid/egid changed to: 502/501
217:info:patch --->  Patching Makefile.in: s|bfd.info|i386-mingw32-bfd.info|g
218:debug:patch Executing reinplace: /usr/bin/sed s|bfd.info|i386-mingw32-bfd.info|g < /opt/local/var/macports/build/_opt_local_var_macports_sources_rsync.macports.org_release_tarballs_ports_cross_i386-mingw32-binutils/i386-mingw32-binutils/work/binutils-2.21/bfd/doc/Makefile.in >@ file10 2>@stderr
219:debug:patch euid/egid changed to: 0/0
220:debug:patch chowned /opt/local/var/macports/build/_opt_local_var_macports_sources_rsync.macports.org_release_tarballs_ports_cross_i386-mingw32-binutils/i386-mingw32-binutils/work/binutils-2.21/bfd/doc/Makefile.in to macports
221:debug:patch euid/egid changed to: 502/501
222:debug:patch euid/egid changed to: 0/0
223:debug:patch setting attributes on /opt/local/var/macports/build/_opt_local_var_macports_sources_rsync.macports.org_release_tarballs_ports_cross_i386-mingw32-binutils/i386-mingw32-binutils/work/binutils-2.21/bfd/doc/Makefile.in
224:debug:patch euid/egid changed to: 502/501
225:info:patch --->  Patching Makefile.in: s|bfd.texinfo|i386-mingw32-bfd.texinfo|g
226:debug:patch Executing reinplace: /usr/bin/sed s|bfd.texinfo|i386-mingw32-bfd.texinfo|g < /opt/local/var/macports/build/_opt_local_var_macports_sources_rsync.macports.org_release_tarballs_ports_cross_i386-mingw32-binutils/i386-mingw32-binutils/work/binutils-2.21/bfd/doc/Makefile.in >@ file10 2>@stderr
227:debug:patch euid/egid changed to: 0/0
228:debug:patch chowned /opt/local/var/macports/build/_opt_local_var_macports_sources_rsync.macports.org_release_tarballs_ports_cross_i386-mingw32-binutils/i386-mingw32-binutils/work/binutils-2.21/bfd/doc/Makefile.in to macports
229:debug:patch euid/egid changed to: 502/501
230:debug:patch euid/egid changed to: 0/0
231:debug:patch setting attributes on /opt/local/var/macports/build/_opt_local_var_macports_sources_rsync.macports.org_release_tarballs_ports_cross_i386-mingw32-binutils/i386-mingw32-binutils/work/binutils-2.21/bfd/doc/Makefile.in
232:debug:patch euid/egid changed to: 502/501
233:info:patch --->  Patching Makefile.in: s|__TARGET|i386-mingw32|g
234:debug:patch Executing reinplace: /usr/bin/sed s|__TARGET|i386-mingw32|g < /opt/local/var/macports/build/_opt_local_var_macports_sources_rsync.macports.org_release_tarballs_ports_cross_i386-mingw32-binutils/i386-mingw32-binutils/work/binutils-2.21/bfd/doc/Makefile.in >@ file10 2>@stderr
235:debug:patch euid/egid changed to: 0/0
236:debug:patch chowned /opt/local/var/macports/build/_opt_local_var_macports_sources_rsync.macports.org_release_tarballs_ports_cross_i386-mingw32-binutils/i386-mingw32-binutils/work/binutils-2.21/bfd/doc/Makefile.in to macports
237:debug:patch euid/egid changed to: 502/501
238:debug:patch euid/egid changed to: 0/0
239:debug:patch setting attributes on /opt/local/var/macports/build/_opt_local_var_macports_sources_rsync.macports.org_release_tarballs_ports_cross_i386-mingw32-binutils/i386-mingw32-binutils/work/binutils-2.21/bfd/doc/Makefile.in
240:debug:patch euid/egid changed to: 502/501
241:info:patch --->  Patching binutils.texi: s|setfilename binutils.info|setfilename i386-mingw32-binutils.info|g
242:debug:patch Executing reinplace: /usr/bin/sed {s|setfilename binutils.info|setfilename i386-mingw32-binutils.info|g} < /opt/local/var/macports/build/_opt_local_var_macports_sources_rsync.macports.org_release_tarballs_ports_cross_i386-mingw32-binutils/i386-mingw32-binutils/work/binutils-2.21/binutils/doc/binutils.texi >@ file10 2>@stderr
243:debug:patch euid/egid changed to: 0/0
244:debug:patch chowned /opt/local/var/macports/build/_opt_local_var_macports_sources_rsync.macports.org_release_tarballs_ports_cross_i386-mingw32-binutils/i386-mingw32-binutils/work/binutils-2.21/binutils/doc/binutils.texi to macports
245:debug:patch euid/egid changed to: 502/501
246:debug:patch euid/egid changed to: 0/0
247:debug:patch setting attributes on /opt/local/var/macports/build/_opt_local_var_macports_sources_rsync.macports.org_release_tarballs_ports_cross_i386-mingw32-binutils/i386-mingw32-binutils/work/binutils-2.21/binutils/doc/binutils.texi
248:debug:patch euid/egid changed to: 502/501
249:info:patch --->  Patching binutils.texi: s|(binutils)|(i386-mingw32-binutils)|g
250:debug:patch Executing reinplace: /usr/bin/sed s|(binutils)|(i386-mingw32-binutils)|g < /opt/local/var/macports/build/_opt_local_var_macports_sources_rsync.macports.org_release_tarballs_ports_cross_i386-mingw32-binutils/i386-mingw32-binutils/work/binutils-2.21/binutils/doc/binutils.texi >@ file10 2>@stderr
251:debug:patch euid/egid changed to: 0/0
252:debug:patch chowned /opt/local/var/macports/build/_opt_local_var_macports_sources_rsync.macports.org_release_tarballs_ports_cross_i386-mingw32-binutils/i386-mingw32-binutils/work/binutils-2.21/binutils/doc/binutils.texi to macports
253:debug:patch euid/egid changed to: 502/501
254:debug:patch euid/egid changed to: 0/0
255:debug:patch setting attributes on /opt/local/var/macports/build/_opt_local_var_macports_sources_rsync.macports.org_release_tarballs_ports_cross_i386-mingw32-binutils/i386-mingw32-binutils/work/binutils-2.21/binutils/doc/binutils.texi
256:debug:patch euid/egid changed to: 502/501
257:info:patch --->  Patching binutils.texi: s|@file{binutils}|@file{i386-mingw32-binutils}|g
258:debug:patch Executing reinplace: /usr/bin/sed s|@file{binutils}|@file{i386-mingw32-binutils}|g < /opt/local/var/macports/build/_opt_local_var_macports_sources_rsync.macports.org_release_tarballs_ports_cross_i386-mingw32-binutils/i386-mingw32-binutils/work/binutils-2.21/binutils/doc/binutils.texi >@ file10 2>@stderr
259:debug:patch euid/egid changed to: 0/0
260:debug:patch chowned /opt/local/var/macports/build/_opt_local_var_macports_sources_rsync.macports.org_release_tarballs_ports_cross_i386-mingw32-binutils/i386-mingw32-binutils/work/binutils-2.21/binutils/doc/binutils.texi to macports
261:debug:patch euid/egid changed to: 502/501
262:debug:patch euid/egid changed to: 0/0
263:debug:patch setting attributes on /opt/local/var/macports/build/_opt_local_var_macports_sources_rsync.macports.org_release_tarballs_ports_cross_i386-mingw32-binutils/i386-mingw32-binutils/work/binutils-2.21/binutils/doc/binutils.texi
264:debug:patch euid/egid changed to: 502/501
265:info:patch --->  Patching Makefile.in: s|binutils.info|i386-mingw32-binutils.info|g
266:debug:patch Executing reinplace: /usr/bin/sed s|binutils.info|i386-mingw32-binutils.info|g < /opt/local/var/macports/build/_opt_local_var_macports_sources_rsync.macports.org_release_tarballs_ports_cross_i386-mingw32-binutils/i386-mingw32-binutils/work/binutils-2.21/binutils/doc/Makefile.in >@ file10 2>@stderr
267:debug:patch euid/egid changed to: 0/0
268:debug:patch chowned /opt/local/var/macports/build/_opt_local_var_macports_sources_rsync.macports.org_release_tarballs_ports_cross_i386-mingw32-binutils/i386-mingw32-binutils/work/binutils-2.21/binutils/doc/Makefile.in to macports
269:debug:patch euid/egid changed to: 502/501
270:debug:patch euid/egid changed to: 0/0
271:debug:patch setting attributes on /opt/local/var/macports/build/_opt_local_var_macports_sources_rsync.macports.org_release_tarballs_ports_cross_i386-mingw32-binutils/i386-mingw32-binutils/work/binutils-2.21/binutils/doc/Makefile.in
272:debug:patch euid/egid changed to: 502/501
273:info:patch --->  Patching Makefile.in: s|binutils.texi|i386-mingw32-binutils.texi|g
274:debug:patch Executing reinplace: /usr/bin/sed s|binutils.texi|i386-mingw32-binutils.texi|g < /opt/local/var/macports/build/_opt_local_var_macports_sources_rsync.macports.org_release_tarballs_ports_cross_i386-mingw32-binutils/i386-mingw32-binutils/work/binutils-2.21/binutils/doc/Makefile.in >@ file10 2>@stderr
275:debug:patch euid/egid changed to: 0/0
276:debug:patch chowned /opt/local/var/macports/build/_opt_local_var_macports_sources_rsync.macports.org_release_tarballs_ports_cross_i386-mingw32-binutils/i386-mingw32-binutils/work/binutils-2.21/binutils/doc/Makefile.in to macports
277:debug:patch euid/egid changed to: 502/501
278:debug:patch euid/egid changed to: 0/0
279:debug:patch setting attributes on /opt/local/var/macports/build/_opt_local_var_macports_sources_rsync.macports.org_release_tarballs_ports_cross_i386-mingw32-binutils/i386-mingw32-binutils/work/binutils-2.21/binutils/doc/Makefile.in
280:debug:patch euid/egid changed to: 502/501
281:info:patch --->  Patching Makefile.in: s|__TARGET|i386-mingw32|g
282:debug:patch Executing reinplace: /usr/bin/sed s|__TARGET|i386-mingw32|g < /opt/local/var/macports/build/_opt_local_var_macports_sources_rsync.macports.org_release_tarballs_ports_cross_i386-mingw32-binutils/i386-mingw32-binutils/work/binutils-2.21/binutils/doc/Makefile.in >@ file10 2>@stderr
283:debug:patch euid/egid changed to: 0/0
284:debug:patch chowned /opt/local/var/macports/build/_opt_local_var_macports_sources_rsync.macports.org_release_tarballs_ports_cross_i386-mingw32-binutils/i386-mingw32-binutils/work/binutils-2.21/binutils/doc/Makefile.in to macports
285:debug:patch euid/egid changed to: 502/501
286:debug:patch euid/egid changed to: 0/0
287:debug:patch setting attributes on /opt/local/var/macports/build/_opt_local_var_macports_sources_rsync.macports.org_release_tarballs_ports_cross_i386-mingw32-binutils/i386-mingw32-binutils/work/binutils-2.21/binutils/doc/Makefile.in
288:debug:patch euid/egid changed to: 502/501
289:info:patch --->  Patching gprof.texi: s|setfilename gprof.info|setfilename i386-mingw32-gprof.info|g
290:debug:patch Executing reinplace: /usr/bin/sed {s|setfilename gprof.info|setfilename i386-mingw32-gprof.info|g} < /opt/local/var/macports/build/_opt_local_var_macports_sources_rsync.macports.org_release_tarballs_ports_cross_i386-mingw32-binutils/i386-mingw32-binutils/work/binutils-2.21/gprof/gprof.texi >@ file10 2>@stderr
291:debug:patch euid/egid changed to: 0/0
292:debug:patch chowned /opt/local/var/macports/build/_opt_local_var_macports_sources_rsync.macports.org_release_tarballs_ports_cross_i386-mingw32-binutils/i386-mingw32-binutils/work/binutils-2.21/gprof/gprof.texi to macports
293:debug:patch euid/egid changed to: 502/501
294:debug:patch euid/egid changed to: 0/0
295:debug:patch setting attributes on /opt/local/var/macports/build/_opt_local_var_macports_sources_rsync.macports.org_release_tarballs_ports_cross_i386-mingw32-binutils/i386-mingw32-binutils/work/binutils-2.21/gprof/gprof.texi
296:debug:patch euid/egid changed to: 502/501
297:info:patch --->  Patching gprof.texi: s|(gprof)|(i386-mingw32-gprof)|g
298:debug:patch Executing reinplace: /usr/bin/sed s|(gprof)|(i386-mingw32-gprof)|g < /opt/local/var/macports/build/_opt_local_var_macports_sources_rsync.macports.org_release_tarballs_ports_cross_i386-mingw32-binutils/i386-mingw32-binutils/work/binutils-2.21/gprof/gprof.texi >@ file10 2>@stderr
299:debug:patch euid/egid changed to: 0/0
300:debug:patch chowned /opt/local/var/macports/build/_opt_local_var_macports_sources_rsync.macports.org_release_tarballs_ports_cross_i386-mingw32-binutils/i386-mingw32-binutils/work/binutils-2.21/gprof/gprof.texi to macports
301:debug:patch euid/egid changed to: 502/501
302:debug:patch euid/egid changed to: 0/0
303:debug:patch setting attributes on /opt/local/var/macports/build/_opt_local_var_macports_sources_rsync.macports.org_release_tarballs_ports_cross_i386-mingw32-binutils/i386-mingw32-binutils/work/binutils-2.21/gprof/gprof.texi
304:debug:patch euid/egid changed to: 502/501
305:info:patch --->  Patching gprof.texi: s|@file{gprof}|@file{i386-mingw32-gprof}|g
306:debug:patch Executing reinplace: /usr/bin/sed s|@file{gprof}|@file{i386-mingw32-gprof}|g < /opt/local/var/macports/build/_opt_local_var_macports_sources_rsync.macports.org_release_tarballs_ports_cross_i386-mingw32-binutils/i386-mingw32-binutils/work/binutils-2.21/gprof/gprof.texi >@ file10 2>@stderr
307:debug:patch euid/egid changed to: 0/0
308:debug:patch chowned /opt/local/var/macports/build/_opt_local_var_macports_sources_rsync.macports.org_release_tarballs_ports_cross_i386-mingw32-binutils/i386-mingw32-binutils/work/binutils-2.21/gprof/gprof.texi to macports
309:debug:patch euid/egid changed to: 502/501
310:debug:patch euid/egid changed to: 0/0
311:debug:patch setting attributes on /opt/local/var/macports/build/_opt_local_var_macports_sources_rsync.macports.org_release_tarballs_ports_cross_i386-mingw32-binutils/i386-mingw32-binutils/work/binutils-2.21/gprof/gprof.texi
312:debug:patch euid/egid changed to: 502/501
313:info:patch --->  Patching Makefile.in: s|gprof.info|i386-mingw32-gprof.info|g
314:debug:patch Executing reinplace: /usr/bin/sed s|gprof.info|i386-mingw32-gprof.info|g < /opt/local/var/macports/build/_opt_local_var_macports_sources_rsync.macports.org_release_tarballs_ports_cross_i386-mingw32-binutils/i386-mingw32-binutils/work/binutils-2.21/gprof/Makefile.in >@ file10 2>@stderr
315:debug:patch euid/egid changed to: 0/0
316:debug:patch chowned /opt/local/var/macports/build/_opt_local_var_macports_sources_rsync.macports.org_release_tarballs_ports_cross_i386-mingw32-binutils/i386-mingw32-binutils/work/binutils-2.21/gprof/Makefile.in to macports
317:debug:patch euid/egid changed to: 502/501
318:debug:patch euid/egid changed to: 0/0
319:debug:patch setting attributes on /opt/local/var/macports/build/_opt_local_var_macports_sources_rsync.macports.org_release_tarballs_ports_cross_i386-mingw32-binutils/i386-mingw32-binutils/work/binutils-2.21/gprof/Makefile.in
320:debug:patch euid/egid changed to: 502/501
321:info:patch --->  Patching Makefile.in: s|gprof.texi|i386-mingw32-gprof.texi|g
322:debug:patch Executing reinplace: /usr/bin/sed s|gprof.texi|i386-mingw32-gprof.texi|g < /opt/local/var/macports/build/_opt_local_var_macports_sources_rsync.macports.org_release_tarballs_ports_cross_i386-mingw32-binutils/i386-mingw32-binutils/work/binutils-2.21/gprof/Makefile.in >@ file10 2>@stderr
323:debug:patch euid/egid changed to: 0/0
324:debug:patch chowned /opt/local/var/macports/build/_opt_local_var_macports_sources_rsync.macports.org_release_tarballs_ports_cross_i386-mingw32-binutils/i386-mingw32-binutils/work/binutils-2.21/gprof/Makefile.in to macports
325:debug:patch euid/egid changed to: 502/501
326:debug:patch euid/egid changed to: 0/0
327:debug:patch setting attributes on /opt/local/var/macports/build/_opt_local_var_macports_sources_rsync.macports.org_release_tarballs_ports_cross_i386-mingw32-binutils/i386-mingw32-binutils/work/binutils-2.21/gprof/Makefile.in
328:debug:patch euid/egid changed to: 502/501
329:info:patch --->  Patching Makefile.in: s|__TARGET|i386-mingw32|g
330:debug:patch Executing reinplace: /usr/bin/sed s|__TARGET|i386-mingw32|g < /opt/local/var/macports/build/_opt_local_var_macports_sources_rsync.macports.org_release_tarballs_ports_cross_i386-mingw32-binutils/i386-mingw32-binutils/work/binutils-2.21/gprof/Makefile.in >@ file10 2>@stderr
331:debug:patch euid/egid changed to: 0/0
332:debug:patch chowned /opt/local/var/macports/build/_opt_local_var_macports_sources_rsync.macports.org_release_tarballs_ports_cross_i386-mingw32-binutils/i386-mingw32-binutils/work/binutils-2.21/gprof/Makefile.in to macports
333:debug:patch euid/egid changed to: 502/501
334:debug:patch euid/egid changed to: 0/0
335:debug:patch setting attributes on /opt/local/var/macports/build/_opt_local_var_macports_sources_rsync.macports.org_release_tarballs_ports_cross_i386-mingw32-binutils/i386-mingw32-binutils/work/binutils-2.21/gprof/Makefile.in
336:debug:patch euid/egid changed to: 502/501
337:info:patch --->  Patching ld.texinfo: s|setfilename ld.info|setfilename i386-mingw32-ld.info|g
338:debug:patch Executing reinplace: /usr/bin/sed {s|setfilename ld.info|setfilename i386-mingw32-ld.info|g} < /opt/local/var/macports/build/_opt_local_var_macports_sources_rsync.macports.org_release_tarballs_ports_cross_i386-mingw32-binutils/i386-mingw32-binutils/work/binutils-2.21/ld/ld.texinfo >@ file10 2>@stderr
339:debug:patch euid/egid changed to: 0/0
340:debug:patch chowned /opt/local/var/macports/build/_opt_local_var_macports_sources_rsync.macports.org_release_tarballs_ports_cross_i386-mingw32-binutils/i386-mingw32-binutils/work/binutils-2.21/ld/ld.texinfo to macports
341:debug:patch euid/egid changed to: 502/501
342:debug:patch euid/egid changed to: 0/0
343:debug:patch setting attributes on /opt/local/var/macports/build/_opt_local_var_macports_sources_rsync.macports.org_release_tarballs_ports_cross_i386-mingw32-binutils/i386-mingw32-binutils/work/binutils-2.21/ld/ld.texinfo
344:debug:patch euid/egid changed to: 502/501
345:info:patch --->  Patching ld.texinfo: s|(ld)|(i386-mingw32-ld)|g
346:debug:patch Executing reinplace: /usr/bin/sed s|(ld)|(i386-mingw32-ld)|g < /opt/local/var/macports/build/_opt_local_var_macports_sources_rsync.macports.org_release_tarballs_ports_cross_i386-mingw32-binutils/i386-mingw32-binutils/work/binutils-2.21/ld/ld.texinfo >@ file10 2>@stderr
347:debug:patch euid/egid changed to: 0/0
348:debug:patch chowned /opt/local/var/macports/build/_opt_local_var_macports_sources_rsync.macports.org_release_tarballs_ports_cross_i386-mingw32-binutils/i386-mingw32-binutils/work/binutils-2.21/ld/ld.texinfo to macports
349:debug:patch euid/egid changed to: 502/501
350:debug:patch euid/egid changed to: 0/0
351:debug:patch setting attributes on /opt/local/var/macports/build/_opt_local_var_macports_sources_rsync.macports.org_release_tarballs_ports_cross_i386-mingw32-binutils/i386-mingw32-binutils/work/binutils-2.21/ld/ld.texinfo
352:debug:patch euid/egid changed to: 502/501
353:info:patch --->  Patching ld.texinfo: s|@file{ld}|@file{i386-mingw32-ld}|g
354:debug:patch Executing reinplace: /usr/bin/sed s|@file{ld}|@file{i386-mingw32-ld}|g < /opt/local/var/macports/build/_opt_local_var_macports_sources_rsync.macports.org_release_tarballs_ports_cross_i386-mingw32-binutils/i386-mingw32-binutils/work/binutils-2.21/ld/ld.texinfo >@ file10 2>@stderr
355:debug:patch euid/egid changed to: 0/0
356:debug:patch chowned /opt/local/var/macports/build/_opt_local_var_macports_sources_rsync.macports.org_release_tarballs_ports_cross_i386-mingw32-binutils/i386-mingw32-binutils/work/binutils-2.21/ld/ld.texinfo to macports
357:debug:patch euid/egid changed to: 502/501
358:debug:patch euid/egid changed to: 0/0
359:debug:patch setting attributes on /opt/local/var/macports/build/_opt_local_var_macports_sources_rsync.macports.org_release_tarballs_ports_cross_i386-mingw32-binutils/i386-mingw32-binutils/work/binutils-2.21/ld/ld.texinfo
360:debug:patch euid/egid changed to: 502/501
361:info:patch --->  Patching Makefile.in: s|ld.info|i386-mingw32-ld.info|g
362:debug:patch Executing reinplace: /usr/bin/sed s|ld.info|i386-mingw32-ld.info|g < /opt/local/var/macports/build/_opt_local_var_macports_sources_rsync.macports.org_release_tarballs_ports_cross_i386-mingw32-binutils/i386-mingw32-binutils/work/binutils-2.21/ld/Makefile.in >@ file10 2>@stderr
363:debug:patch euid/egid changed to: 0/0
364:debug:patch chowned /opt/local/var/macports/build/_opt_local_var_macports_sources_rsync.macports.org_release_tarballs_ports_cross_i386-mingw32-binutils/i386-mingw32-binutils/work/binutils-2.21/ld/Makefile.in to macports
365:debug:patch euid/egid changed to: 502/501
366:debug:patch euid/egid changed to: 0/0
367:debug:patch setting attributes on /opt/local/var/macports/build/_opt_local_var_macports_sources_rsync.macports.org_release_tarballs_ports_cross_i386-mingw32-binutils/i386-mingw32-binutils/work/binutils-2.21/ld/Makefile.in
368:debug:patch euid/egid changed to: 502/501
369:info:patch --->  Patching Makefile.in: s|ld.texinfo|i386-mingw32-ld.texinfo|g
370:debug:patch Executing reinplace: /usr/bin/sed s|ld.texinfo|i386-mingw32-ld.texinfo|g < /opt/local/var/macports/build/_opt_local_var_macports_sources_rsync.macports.org_release_tarballs_ports_cross_i386-mingw32-binutils/i386-mingw32-binutils/work/binutils-2.21/ld/Makefile.in >@ file10 2>@stderr
371:debug:patch euid/egid changed to: 0/0
372:debug:patch chowned /opt/local/var/macports/build/_opt_local_var_macports_sources_rsync.macports.org_release_tarballs_ports_cross_i386-mingw32-binutils/i386-mingw32-binutils/work/binutils-2.21/ld/Makefile.in to macports
373:debug:patch euid/egid changed to: 502/501
374:debug:patch euid/egid changed to: 0/0
375:debug:patch setting attributes on /opt/local/var/macports/build/_opt_local_var_macports_sources_rsync.macports.org_release_tarballs_ports_cross_i386-mingw32-binutils/i386-mingw32-binutils/work/binutils-2.21/ld/Makefile.in
376:debug:patch euid/egid changed to: 502/501
377:info:patch --->  Patching Makefile.in: s|__TARGET|i386-mingw32|g
378:debug:patch Executing reinplace: /usr/bin/sed s|__TARGET|i386-mingw32|g < /opt/local/var/macports/build/_opt_local_var_macports_sources_rsync.macports.org_release_tarballs_ports_cross_i386-mingw32-binutils/i386-mingw32-binutils/work/binutils-2.21/ld/Makefile.in >@ file10 2>@stderr
379:debug:patch euid/egid changed to: 0/0
380:debug:patch chowned /opt/local/var/macports/build/_opt_local_var_macports_sources_rsync.macports.org_release_tarballs_ports_cross_i386-mingw32-binutils/i386-mingw32-binutils/work/binutils-2.21/ld/Makefile.in to macports
381:debug:patch euid/egid changed to: 502/501
382:debug:patch euid/egid changed to: 0/0
383:debug:patch setting attributes on /opt/local/var/macports/build/_opt_local_var_macports_sources_rsync.macports.org_release_tarballs_ports_cross_i386-mingw32-binutils/i386-mingw32-binutils/work/binutils-2.21/ld/Makefile.in
384:debug:patch euid/egid changed to: 502/501
385:info:patch --->  Patching Makefile.in: s|@PACKAGE@|i386-mingw32-@PACKAGE@|g
386:debug:patch Executing reinplace: /usr/bin/sed s|@PACKAGE@|i386-mingw32-@PACKAGE@|g < /opt/local/var/macports/build/_opt_local_var_macports_sources_rsync.macports.org_release_tarballs_ports_cross_i386-mingw32-binutils/i386-mingw32-binutils/work/binutils-2.21/bfd/Makefile.in >@ file10 2>@stderr
387:debug:patch euid/egid changed to: 0/0
388:debug:patch chowned /opt/local/var/macports/build/_opt_local_var_macports_sources_rsync.macports.org_release_tarballs_ports_cross_i386-mingw32-binutils/i386-mingw32-binutils/work/binutils-2.21/bfd/Makefile.in to macports
389:debug:patch euid/egid changed to: 502/501
390:debug:patch euid/egid changed to: 0/0
391:debug:patch setting attributes on /opt/local/var/macports/build/_opt_local_var_macports_sources_rsync.macports.org_release_tarballs_ports_cross_i386-mingw32-binutils/i386-mingw32-binutils/work/binutils-2.21/bfd/Makefile.in
392:debug:patch euid/egid changed to: 502/501
393:info:patch --->  Patching Makefile.in: s|@PACKAGE@|i386-mingw32-@PACKAGE@|g
394:debug:patch Executing reinplace: /usr/bin/sed s|@PACKAGE@|i386-mingw32-@PACKAGE@|g < /opt/local/var/macports/build/_opt_local_var_macports_sources_rsync.macports.org_release_tarballs_ports_cross_i386-mingw32-binutils/i386-mingw32-binutils/work/binutils-2.21/bfd/doc/Makefile.in >@ file10 2>@stderr
395:debug:patch euid/egid changed to: 0/0
396:debug:patch chowned /opt/local/var/macports/build/_opt_local_var_macports_sources_rsync.macports.org_release_tarballs_ports_cross_i386-mingw32-binutils/i386-mingw32-binutils/work/binutils-2.21/bfd/doc/Makefile.in to macports
397:debug:patch euid/egid changed to: 502/501
398:debug:patch euid/egid changed to: 0/0
399:debug:patch setting attributes on /opt/local/var/macports/build/_opt_local_var_macports_sources_rsync.macports.org_release_tarballs_ports_cross_i386-mingw32-binutils/i386-mingw32-binutils/work/binutils-2.21/bfd/doc/Makefile.in
400:debug:patch euid/egid changed to: 502/501
401:info:patch --->  Patching Make-in: s|@PACKAGE@|i386-mingw32-@PACKAGE@|g
402:debug:patch Executing reinplace: /usr/bin/sed s|@PACKAGE@|i386-mingw32-@PACKAGE@|g < /opt/local/var/macports/build/_opt_local_var_macports_sources_rsync.macports.org_release_tarballs_ports_cross_i386-mingw32-binutils/i386-mingw32-binutils/work/binutils-2.21/bfd/po/Make-in >@ file10 2>@stderr
403:debug:patch euid/egid changed to: 0/0
404:debug:patch chowned /opt/local/var/macports/build/_opt_local_var_macports_sources_rsync.macports.org_release_tarballs_ports_cross_i386-mingw32-binutils/i386-mingw32-binutils/work/binutils-2.21/bfd/po/Make-in to macports
405:debug:patch euid/egid changed to: 502/501
406:debug:patch euid/egid changed to: 0/0
407:debug:patch setting attributes on /opt/local/var/macports/build/_opt_local_var_macports_sources_rsync.macports.org_release_tarballs_ports_cross_i386-mingw32-binutils/i386-mingw32-binutils/work/binutils-2.21/bfd/po/Make-in
408:debug:patch euid/egid changed to: 502/501
409:info:patch --->  Patching Makefile.in: s|@PACKAGE@|i386-mingw32-@PACKAGE@|g
410:debug:patch Executing reinplace: /usr/bin/sed s|@PACKAGE@|i386-mingw32-@PACKAGE@|g < /opt/local/var/macports/build/_opt_local_var_macports_sources_rsync.macports.org_release_tarballs_ports_cross_i386-mingw32-binutils/i386-mingw32-binutils/work/binutils-2.21/binutils/Makefile.in >@ file10 2>@stderr
411:debug:patch euid/egid changed to: 0/0
412:debug:patch chowned /opt/local/var/macports/build/_opt_local_var_macports_sources_rsync.macports.org_release_tarballs_ports_cross_i386-mingw32-binutils/i386-mingw32-binutils/work/binutils-2.21/binutils/Makefile.in to macports
413:debug:patch euid/egid changed to: 502/501
414:debug:patch euid/egid changed to: 0/0
415:debug:patch setting attributes on /opt/local/var/macports/build/_opt_local_var_macports_sources_rsync.macports.org_release_tarballs_ports_cross_i386-mingw32-binutils/i386-mingw32-binutils/work/binutils-2.21/binutils/Makefile.in
416:debug:patch euid/egid changed to: 502/501
417:info:patch --->  Patching Makefile.in: s|@PACKAGE@|i386-mingw32-@PACKAGE@|g
418:debug:patch Executing reinplace: /usr/bin/sed s|@PACKAGE@|i386-mingw32-@PACKAGE@|g < /opt/local/var/macports/build/_opt_local_var_macports_sources_rsync.macports.org_release_tarballs_ports_cross_i386-mingw32-binutils/i386-mingw32-binutils/work/binutils-2.21/binutils/doc/Makefile.in >@ file10 2>@stderr
419:debug:patch euid/egid changed to: 0/0
420:debug:patch chowned /opt/local/var/macports/build/_opt_local_var_macports_sources_rsync.macports.org_release_tarballs_ports_cross_i386-mingw32-binutils/i386-mingw32-binutils/work/binutils-2.21/binutils/doc/Makefile.in to macports
421:debug:patch euid/egid changed to: 502/501
422:debug:patch euid/egid changed to: 0/0
423:debug:patch setting attributes on /opt/local/var/macports/build/_opt_local_var_macports_sources_rsync.macports.org_release_tarballs_ports_cross_i386-mingw32-binutils/i386-mingw32-binutils/work/binutils-2.21/binutils/doc/Makefile.in
424:debug:patch euid/egid changed to: 502/501
425:info:patch --->  Patching Make-in: s|@PACKAGE@|i386-mingw32-@PACKAGE@|g
426:debug:patch Executing reinplace: /usr/bin/sed s|@PACKAGE@|i386-mingw32-@PACKAGE@|g < /opt/local/var/macports/build/_opt_local_var_macports_sources_rsync.macports.org_release_tarballs_ports_cross_i386-mingw32-binutils/i386-mingw32-binutils/work/binutils-2.21/binutils/po/Make-in >@ file10 2>@stderr
427:debug:patch euid/egid changed to: 0/0
428:debug:patch chowned /opt/local/var/macports/build/_opt_local_var_macports_sources_rsync.macports.org_release_tarballs_ports_cross_i386-mingw32-binutils/i386-mingw32-binutils/work/binutils-2.21/binutils/po/Make-in to macports
429:debug:patch euid/egid changed to: 502/501
430:debug:patch euid/egid changed to: 0/0
431:debug:patch setting attributes on /opt/local/var/macports/build/_opt_local_var_macports_sources_rsync.macports.org_release_tarballs_ports_cross_i386-mingw32-binutils/i386-mingw32-binutils/work/binutils-2.21/binutils/po/Make-in
432:debug:patch euid/egid changed to: 502/501
433:info:patch --->  Patching Makefile.in: s|@PACKAGE@|i386-mingw32-@PACKAGE@|g
434:debug:patch Executing reinplace: /usr/bin/sed s|@PACKAGE@|i386-mingw32-@PACKAGE@|g < /opt/local/var/macports/build/_opt_local_var_macports_sources_rsync.macports.org_release_tarballs_ports_cross_i386-mingw32-binutils/i386-mingw32-binutils/work/binutils-2.21/gas/Makefile.in >@ file10 2>@stderr
435:debug:patch euid/egid changed to: 0/0
436:debug:patch chowned /opt/local/var/macports/build/_opt_local_var_macports_sources_rsync.macports.org_release_tarballs_ports_cross_i386-mingw32-binutils/i386-mingw32-binutils/work/binutils-2.21/gas/Makefile.in to macports
437:debug:patch euid/egid changed to: 502/501
438:debug:patch euid/egid changed to: 0/0
439:debug:patch setting attributes on /opt/local/var/macports/build/_opt_local_var_macports_sources_rsync.macports.org_release_tarballs_ports_cross_i386-mingw32-binutils/i386-mingw32-binutils/work/binutils-2.21/gas/Makefile.in
440:debug:patch euid/egid changed to: 502/501
441:info:patch --->  Patching Makefile.in: s|@PACKAGE@|i386-mingw32-@PACKAGE@|g
442:debug:patch Executing reinplace: /usr/bin/sed s|@PACKAGE@|i386-mingw32-@PACKAGE@|g < /opt/local/var/macports/build/_opt_local_var_macports_sources_rsync.macports.org_release_tarballs_ports_cross_i386-mingw32-binutils/i386-mingw32-binutils/work/binutils-2.21/gas/doc/Makefile.in >@ file10 2>@stderr
443:debug:patch euid/egid changed to: 0/0
444:debug:patch chowned /opt/local/var/macports/build/_opt_local_var_macports_sources_rsync.macports.org_release_tarballs_ports_cross_i386-mingw32-binutils/i386-mingw32-binutils/work/binutils-2.21/gas/doc/Makefile.in to macports
445:debug:patch euid/egid changed to: 502/501
446:debug:patch euid/egid changed to: 0/0
447:debug:patch setting attributes on /opt/local/var/macports/build/_opt_local_var_macports_sources_rsync.macports.org_release_tarballs_ports_cross_i386-mingw32-binutils/i386-mingw32-binutils/work/binutils-2.21/gas/doc/Makefile.in
448:debug:patch euid/egid changed to: 502/501
449:info:patch --->  Patching Make-in: s|@PACKAGE@|i386-mingw32-@PACKAGE@|g
450:debug:patch Executing reinplace: /usr/bin/sed s|@PACKAGE@|i386-mingw32-@PACKAGE@|g < /opt/local/var/macports/build/_opt_local_var_macports_sources_rsync.macports.org_release_tarballs_ports_cross_i386-mingw32-binutils/i386-mingw32-binutils/work/binutils-2.21/gas/po/Make-in >@ file10 2>@stderr
451:debug:patch euid/egid changed to: 0/0
452:debug:patch chowned /opt/local/var/macports/build/_opt_local_var_macports_sources_rsync.macports.org_release_tarballs_ports_cross_i386-mingw32-binutils/i386-mingw32-binutils/work/binutils-2.21/gas/po/Make-in to macports
453:debug:patch euid/egid changed to: 502/501
454:debug:patch euid/egid changed to: 0/0
455:debug:patch setting attributes on /opt/local/var/macports/build/_opt_local_var_macports_sources_rsync.macports.org_release_tarballs_ports_cross_i386-mingw32-binutils/i386-mingw32-binutils/work/binutils-2.21/gas/po/Make-in
456:debug:patch euid/egid changed to: 502/501
457:info:patch --->  Patching Makefile.in: s|@PACKAGE@|i386-mingw32-@PACKAGE@|g
458:debug:patch Executing reinplace: /usr/bin/sed s|@PACKAGE@|i386-mingw32-@PACKAGE@|g < /opt/local/var/macports/build/_opt_local_var_macports_sources_rsync.macports.org_release_tarballs_ports_cross_i386-mingw32-binutils/i386-mingw32-binutils/work/binutils-2.21/gprof/Makefile.in >@ file10 2>@stderr
459:debug:patch euid/egid changed to: 0/0
460:debug:patch chowned /opt/local/var/macports/build/_opt_local_var_macports_sources_rsync.macports.org_release_tarballs_ports_cross_i386-mingw32-binutils/i386-mingw32-binutils/work/binutils-2.21/gprof/Makefile.in to macports
461:debug:patch euid/egid changed to: 502/501
462:debug:patch euid/egid changed to: 0/0
463:debug:patch setting attributes on /opt/local/var/macports/build/_opt_local_var_macports_sources_rsync.macports.org_release_tarballs_ports_cross_i386-mingw32-binutils/i386-mingw32-binutils/work/binutils-2.21/gprof/Makefile.in
464:debug:patch euid/egid changed to: 502/501
465:info:patch --->  Patching Make-in: s|@PACKAGE@|i386-mingw32-@PACKAGE@|g
466:debug:patch Executing reinplace: /usr/bin/sed s|@PACKAGE@|i386-mingw32-@PACKAGE@|g < /opt/local/var/macports/build/_opt_local_var_macports_sources_rsync.macports.org_release_tarballs_ports_cross_i386-mingw32-binutils/i386-mingw32-binutils/work/binutils-2.21/gprof/po/Make-in >@ file10 2>@stderr
467:debug:patch euid/egid changed to: 0/0
468:debug:patch chowned /opt/local/var/macports/build/_opt_local_var_macports_sources_rsync.macports.org_release_tarballs_ports_cross_i386-mingw32-binutils/i386-mingw32-binutils/work/binutils-2.21/gprof/po/Make-in to macports
469:debug:patch euid/egid changed to: 502/501
470:debug:patch euid/egid changed to: 0/0
471:debug:patch setting attributes on /opt/local/var/macports/build/_opt_local_var_macports_sources_rsync.macports.org_release_tarballs_ports_cross_i386-mingw32-binutils/i386-mingw32-binutils/work/binutils-2.21/gprof/po/Make-in
472:debug:patch euid/egid changed to: 502/501
473:info:patch --->  Patching Makefile.in: s|@PACKAGE@|i386-mingw32-@PACKAGE@|g
474:debug:patch Executing reinplace: /usr/bin/sed s|@PACKAGE@|i386-mingw32-@PACKAGE@|g < /opt/local/var/macports/build/_opt_local_var_macports_sources_rsync.macports.org_release_tarballs_ports_cross_i386-mingw32-binutils/i386-mingw32-binutils/work/binutils-2.21/ld/Makefile.in >@ file10 2>@stderr
475:debug:patch euid/egid changed to: 0/0
476:debug:patch chowned /opt/local/var/macports/build/_opt_local_var_macports_sources_rsync.macports.org_release_tarballs_ports_cross_i386-mingw32-binutils/i386-mingw32-binutils/work/binutils-2.21/ld/Makefile.in to macports
477:debug:patch euid/egid changed to: 502/501
478:debug:patch euid/egid changed to: 0/0
479:debug:patch setting attributes on /opt/local/var/macports/build/_opt_local_var_macports_sources_rsync.macports.org_release_tarballs_ports_cross_i386-mingw32-binutils/i386-mingw32-binutils/work/binutils-2.21/ld/Makefile.in
480:debug:patch euid/egid changed to: 502/501
481:info:patch --->  Patching Make-in: s|@PACKAGE@|i386-mingw32-@PACKAGE@|g
482:debug:patch Executing reinplace: /usr/bin/sed s|@PACKAGE@|i386-mingw32-@PACKAGE@|g < /opt/local/var/macports/build/_opt_local_var_macports_sources_rsync.macports.org_release_tarballs_ports_cross_i386-mingw32-binutils/i386-mingw32-binutils/work/binutils-2.21/ld/po/Make-in >@ file10 2>@stderr
483:debug:patch euid/egid changed to: 0/0
484:debug:patch chowned /opt/local/var/macports/build/_opt_local_var_macports_sources_rsync.macports.org_release_tarballs_ports_cross_i386-mingw32-binutils/i386-mingw32-binutils/work/binutils-2.21/ld/po/Make-in to macports
485:debug:patch euid/egid changed to: 502/501
486:debug:patch euid/egid changed to: 0/0
487:debug:patch setting attributes on /opt/local/var/macports/build/_opt_local_var_macports_sources_rsync.macports.org_release_tarballs_ports_cross_i386-mingw32-binutils/i386-mingw32-binutils/work/binutils-2.21/ld/po/Make-in
488:debug:patch euid/egid changed to: 502/501
489:info:patch --->  Patching Makefile.in: s|@PACKAGE@|i386-mingw32-@PACKAGE@|g
490:debug:patch Executing reinplace: /usr/bin/sed s|@PACKAGE@|i386-mingw32-@PACKAGE@|g < /opt/local/var/macports/build/_opt_local_var_macports_sources_rsync.macports.org_release_tarballs_ports_cross_i386-mingw32-binutils/i386-mingw32-binutils/work/binutils-2.21/opcodes/Makefile.in >@ file10 2>@stderr
491:debug:patch euid/egid changed to: 0/0
492:debug:patch chowned /opt/local/var/macports/build/_opt_local_var_macports_sources_rsync.macports.org_release_tarballs_ports_cross_i386-mingw32-binutils/i386-mingw32-binutils/work/binutils-2.21/opcodes/Makefile.in to macports
493:debug:patch euid/egid changed to: 502/501
494:debug:patch euid/egid changed to: 0/0
495:debug:patch setting attributes on /opt/local/var/macports/build/_opt_local_var_macports_sources_rsync.macports.org_release_tarballs_ports_cross_i386-mingw32-binutils/i386-mingw32-binutils/work/binutils-2.21/opcodes/Makefile.in
496:debug:patch euid/egid changed to: 502/501
497:info:patch --->  Patching Make-in: s|@PACKAGE@|i386-mingw32-@PACKAGE@|g
498:debug:patch Executing reinplace: /usr/bin/sed s|@PACKAGE@|i386-mingw32-@PACKAGE@|g < /opt/local/var/macports/build/_opt_local_var_macports_sources_rsync.macports.org_release_tarballs_ports_cross_i386-mingw32-binutils/i386-mingw32-binutils/work/binutils-2.21/opcodes/po/Make-in >@ file10 2>@stderr
499:debug:patch euid/egid changed to: 0/0
500:debug:patch chowned /opt/local/var/macports/build/_opt_local_var_macports_sources_rsync.macports.org_release_tarballs_ports_cross_i386-mingw32-binutils/i386-mingw32-binutils/work/binutils-2.21/opcodes/po/Make-in to macports
501:debug:patch euid/egid changed to: 502/501
502:debug:patch euid/egid changed to: 0/0
503:debug:patch setting attributes on /opt/local/var/macports/build/_opt_local_var_macports_sources_rsync.macports.org_release_tarballs_ports_cross_i386-mingw32-binutils/i386-mingw32-binutils/work/binutils-2.21/opcodes/po/Make-in
504:debug:patch euid/egid changed to: 502/501
505:debug:patch Privilege de-escalation not attempted as not running as root.
506:debug:configure configure phase started at Sat Oct 22 13:30:52 PDT 2016
507:notice:configure --->  Configuring i386-mingw32-binutils
508:debug:configure Using compiler 'Xcode Clang'
509:debug:configure Executing proc-pre-org.macports.configure-configure-0
510:debug:configure Executing org.macports.configure (i386-mingw32-binutils)
511:debug:configure Environment:
512CC='/usr/bin/clang'
513CC_PRINT_OPTIONS='YES'
514CC_PRINT_OPTIONS_FILE='/opt/local/var/macports/build/_opt_local_var_macports_sources_rsync.macports.org_release_tarballs_ports_cross_i386-mingw32-binutils/i386-mingw32-binutils/work/.CC_PRINT_OPTIONS'
515CFLAGS='-pipe -Os -I/opt/local/include -arch x86_64'
516CPATH='/opt/local/include'
517CPPFLAGS='-I/opt/local/include'
518CXX='/usr/bin/clang++'
519CXXFLAGS='-pipe -Os -I/opt/local/include -arch x86_64 -stdlib=libc++'
520F77FLAGS='-m64'
521F90FLAGS='-pipe -Os -m64'
522FCFLAGS='-pipe -Os -m64'
523FFLAGS='-pipe -Os'
524INSTALL='/usr/bin/install -c'
525LDFLAGS='-L/opt/local/lib -Wl,-headerpad_max_install_names -arch x86_64'
526LIBRARY_PATH='/opt/local/lib'
527MACOSX_DEPLOYMENT_TARGET='10.10'
528OBJC='/usr/bin/clang'
529OBJCFLAGS='-pipe -Os -arch x86_64'
530OBJCXX='/usr/bin/clang++'
531OBJCXXFLAGS='-pipe -Os -arch x86_64 -stdlib=libc++'
532:debug:configure Assembled command: 'cd "/opt/local/var/macports/build/_opt_local_var_macports_sources_rsync.macports.org_release_tarballs_ports_cross_i386-mingw32-binutils/i386-mingw32-binutils/work/build" && /opt/local/var/macports/build/_opt_local_var_macports_sources_rsync.macports.org_release_tarballs_ports_cross_i386-mingw32-binutils/i386-mingw32-binutils/work/binutils-2.21/configure --prefix=/opt/local --infodir='/opt/local/share/info' --target=i386-mingw32 --program-prefix=i386-mingw32- --mandir='/opt/local/share/man' --disable-werror --build=x86_64-apple-darwin14'
533:debug:configure Executing command line:  cd "/opt/local/var/macports/build/_opt_local_var_macports_sources_rsync.macports.org_release_tarballs_ports_cross_i386-mingw32-binutils/i386-mingw32-binutils/work/build" && /opt/local/var/macports/build/_opt_local_var_macports_sources_rsync.macports.org_release_tarballs_ports_cross_i386-mingw32-binutils/i386-mingw32-binutils/work/binutils-2.21/configure --prefix=/opt/local --infodir='/opt/local/share/info' --target=i386-mingw32 --program-prefix=i386-mingw32- --mandir='/opt/local/share/man' --disable-werror --build=x86_64-apple-darwin14
534:info:configure checking build system type... x86_64-apple-darwin14
535:info:configure checking host system type... x86_64-apple-darwin14
536:info:configure checking target system type... i386-pc-mingw32
537:info:configure checking for a BSD-compatible install... /usr/bin/install -c
538:info:configure checking whether ln works... yes
539:info:configure checking whether ln -s works... yes
540:info:configure checking for a sed that does not truncate output... /opt/local/bin/gsed
541:info:configure checking for gawk... gawk
542:info:configure checking for gcc... /usr/bin/clang
543:info:configure checking for C compiler default output file name... a.out
544:info:configure checking whether the C compiler works... yes
545:info:configure checking whether we are cross compiling... no
546:info:configure checking for suffix of executables...
547:info:configure checking for suffix of object files... o
548:info:configure checking whether we are using the GNU C compiler... yes
549:info:configure checking whether /usr/bin/clang accepts -g... yes
550:info:configure checking for /usr/bin/clang option to accept ISO C89... none needed
551:info:configure checking whether we are using the GNU C++ compiler... yes
552:info:configure checking whether /usr/bin/clang++ accepts -g... yes
553:info:configure checking for gnatbind... no
554:info:configure checking for gnatmake... no
555:info:configure checking whether compiler driver understands Ada... no
556:info:configure checking how to compare bootstrapped objects... cmp --ignore-initial=16 $$f1 $$f2
557:info:configure checking for objdir... .libs
558:info:configure checking for version 0.10 (or later revision) of PPL... no
559:info:configure checking for default BUILD_CONFIG...
560:info:configure checking for bison... bison -y
561:info:configure checking for bison... bison
562:info:configure checking for gm4... gm4
563:info:configure checking for flex... flex
564:info:configure checking for flex... flex
565:info:configure checking for makeinfo... makeinfo
566:info:configure checking for expect... expect
567:info:configure checking for runtest... no
568:info:configure checking for ar... ar
569:info:configure checking for as... as
570:info:configure checking for dlltool... no
571:info:configure checking for ld... (cached) /Applications/Xcode.app/Contents/Developer/Toolchains/XcodeDefault.xctoolchain/usr/bin/ld
572:info:configure checking for lipo... lipo
573:info:configure checking for nm... nm
574:info:configure checking for ranlib... ranlib
575:info:configure checking for strip... strip
576:info:configure checking for windres... no
577:info:configure checking for windmc... no
578:info:configure checking for objcopy... no
579:info:configure checking for objdump... no
580:info:configure checking for i386-mingw32-cc... no
581:info:configure checking for i386-mingw32-gcc... no
582:info:configure checking for i386-mingw32-c++... no
583:info:configure checking for i386-mingw32-g++... no
584:info:configure checking for i386-mingw32-cxx... no
585:info:configure checking for i386-mingw32-gxx... no
586:info:configure checking for i386-mingw32-gcc... no
587:info:configure checking for i386-mingw32-gcj... no
588:info:configure checking for i386-mingw32-gfortran... no
589:info:configure checking for i386-mingw32-ar... no
590:info:configure checking for i386-mingw32-as... no
591:info:configure checking for i386-mingw32-dlltool... no
592:info:configure checking for i386-mingw32-ld... no
593:info:configure checking for i386-mingw32-lipo... no
594:info:configure checking for i386-mingw32-nm... no
595:info:configure checking for i386-mingw32-objdump... no
596:info:configure checking for i386-mingw32-ranlib... no
597:info:configure checking for i386-mingw32-strip... no
598:info:configure checking for i386-mingw32-windres... no
599:info:configure checking for i386-mingw32-windmc... no
600:info:configure checking where to find the target ar... just compiled
601:info:configure checking where to find the target as... just compiled
602:info:configure checking where to find the target cc... pre-installed
603:info:configure checking where to find the target c++... pre-installed
604:info:configure checking where to find the target c++ for libstdc++... pre-installed
605:info:configure checking where to find the target dlltool... just compiled
606:info:configure checking where to find the target gcc... pre-installed
607:info:configure checking where to find the target gcj... pre-installed
608:info:configure checking where to find the target gfortran... pre-installed
609:info:configure checking where to find the target ld... just compiled
610:info:configure checking where to find the target lipo... pre-installed
611:info:configure checking where to find the target nm... just compiled
612:info:configure checking where to find the target objdump... just compiled
613:info:configure checking where to find the target ranlib... just compiled
614:info:configure checking where to find the target strip... just compiled
615:info:configure checking where to find the target windres... just compiled
616:info:configure checking where to find the target windmc... just compiled
617:info:configure checking whether to enable maintainer-specific portions of Makefiles... no
618:info:configure checking whether -fkeep-inline-functions is supported... yes
619:info:configure configure: creating ./config.status
620:info:configure config.status: creating Makefile
621:debug:configure Privilege de-escalation not attempted as not running as root.
622:debug:build build phase started at Sat Oct 22 13:30:59 PDT 2016
623:notice:build --->  Building i386-mingw32-binutils
624:debug:build Executing org.macports.build (i386-mingw32-binutils)
625:debug:build Environment:
626CC_PRINT_OPTIONS='YES'
627CC_PRINT_OPTIONS_FILE='/opt/local/var/macports/build/_opt_local_var_macports_sources_rsync.macports.org_release_tarballs_ports_cross_i386-mingw32-binutils/i386-mingw32-binutils/work/.CC_PRINT_OPTIONS'
628CPATH='/opt/local/include'
629LIBRARY_PATH='/opt/local/lib'
630MACOSX_DEPLOYMENT_TARGET='10.10'
631:debug:build Assembled command: 'cd "/opt/local/var/macports/build/_opt_local_var_macports_sources_rsync.macports.org_release_tarballs_ports_cross_i386-mingw32-binutils/i386-mingw32-binutils/work/build" && /usr/bin/make -j4 -w all'
632:debug:build Executing command line:  cd "/opt/local/var/macports/build/_opt_local_var_macports_sources_rsync.macports.org_release_tarballs_ports_cross_i386-mingw32-binutils/i386-mingw32-binutils/work/build" && /usr/bin/make -j4 -w all
633:info:build make: Entering directory `/opt/local/var/macports/build/_opt_local_var_macports_sources_rsync.macports.org_release_tarballs_ports_cross_i386-mingw32-binutils/i386-mingw32-binutils/work/build'
634:info:build make[1]: Entering directory `/opt/local/var/macports/build/_opt_local_var_macports_sources_rsync.macports.org_release_tarballs_ports_cross_i386-mingw32-binutils/i386-mingw32-binutils/work/build'
635:info:build make[1]: Nothing to be done for `all-target'.
636:info:build mkdir ./libiberty
637:info:build mkdir ./intl
638:info:build Configuring in ./intl
639:info:build Configuring in ./libiberty
640:info:build configure: creating cache ./config.cache
641:info:build checking whether /Applications/Xcode.app/Contents/Developer/usr/bin/make sets $(MAKE)... configure: creating cache ./config.cache
642:info:build checking whether to enable maintainer-specific portions of Makefiles... no
643:info:build checking for makeinfo... makeinfo --split-size=5000000
644:info:build yes
645:info:build checking for a BSD-compatible install... /usr/bin/install -c
646:info:build checking whether NLS is requested... yes
647:info:build checking for msgfmt... /opt/local/bin/msgfmt
648:info:build checking for gmsgfmt... /opt/local/bin/msgfmt
649:info:build checking for xgettext... /opt/local/bin/xgettext
650:info:build checking for perl... perl
651:info:build checking for msgmerge... checking build system type... /opt/local/bin/msgmerge
652:info:build x86_64-apple-darwin14
653:info:build checking host system type... checking for x86_64-apple-darwin14-gcc... /usr/bin/clang
654:info:build x86_64-apple-darwin14
655:info:build checking for x86_64-apple-darwin14-ar... ar
656:info:build checking for x86_64-apple-darwin14-ranlib... ranlib
657:info:build checking for x86_64-apple-darwin14-gcc... /usr/bin/clang
658:info:build checking for C compiler default output file name... checking for C compiler default output file name... a.out
659:info:build checking whether the C compiler works... yes
660:info:build checking whether we are cross compiling... no
661:info:build checking for suffix of executables... a.out
662:info:build checking whether the C compiler works...
663:info:build yes
664:info:build checking for suffix of object files... checking whether we are cross compiling... no
665:info:build checking for suffix of executables... o
666:info:build checking whether we are using the GNU C compiler...
667:info:build checking for suffix of object files... yes
668:info:build checking whether /usr/bin/clang accepts -g... o
669:info:build checking whether we are using the GNU C compiler... yes
670:info:build checking for /usr/bin/clang option to accept ISO C89... yes
671:info:build checking whether /usr/bin/clang accepts -g... yes
672:info:build checking for /usr/bin/clang option to accept ISO C89... none needed
673:info:build checking build system type... none needed
674:info:build checking for special C compiler options needed for large files... no
675:info:build checking for _FILE_OFFSET_BITS value needed for large files... x86_64-apple-darwin14
676:info:build checking host system type... x86_64-apple-darwin14
677:info:build checking for x86_64-apple-darwin14-ranlib... ranlib
678:info:build checking for library containing strerror... no
679:info:build checking how to run the C preprocessor... none required
680:info:build checking how to run the C preprocessor... /usr/bin/clang -E
681:info:build checking whether /usr/bin/clang supports -W... /usr/bin/clang -E
682:info:build yes
683:info:build checking whether /usr/bin/clang supports -Wall... yes
684:info:build checking for grep that handles long lines and -e... checking whether /usr/bin/clang supports -Wwrite-strings... /opt/local/bin/grep
685:info:build checking for egrep... /opt/local/bin/grep -E
686:info:build checking for ANSI C header files... yes
687:info:build checking whether /usr/bin/clang supports -Wc++-compat... yes
688:info:build checking whether /usr/bin/clang supports -Wstrict-prototypes... yes
689:info:build checking whether /usr/bin/clang supports -pedantic ... yes
690:info:build checking whether /usr/bin/clang and cc understand -c and -o together... yes
691:info:build checking for an ANSI C-conforming const... yes
692:info:build checking for inline... yes
693:info:build checking for an ANSI C-conforming const... inline
694:info:build yes
695:info:build checking for inline... checking for sys/types.h... inline
696:info:build checking for grep that handles long lines and -e... /opt/local/bin/grep
697:info:build checking for egrep... yes
698:info:build /opt/local/bin/grep -E
699:info:build checking for ANSI C header files... checking for sys/stat.h... yes
700:info:build checking for stdlib.h... yes
701:info:build checking for string.h... yes
702:info:build yes
703:info:build checking for sys/types.h... checking for memory.h... yes
704:info:build checking for sys/stat.h... yes
705:info:build checking for strings.h... yes
706:info:build checking for stdlib.h... yes
707:info:build checking for inttypes.h... yes
708:info:build checking for string.h... yes
709:info:build yes
710:info:build checking for memory.h... checking for stdint.h... yes
711:info:build yes
712:info:build checking for strings.h... checking for unistd.h... yes
713:info:build checking for inttypes.h... yes
714:info:build yes
715:info:build checking for off_t... checking for stdint.h... yes
716:info:build checking for unistd.h... yes
717:info:build checking whether byte ordering is bigendian... yes
718:info:build checking for size_t... yes
719:info:build no
720:info:build checking for a BSD-compatible install... checking for working alloca.h... /usr/bin/install -c
721:info:build checking for sys/file.h... yes
722:info:build yes
723:info:build checking for alloca... checking for sys/param.h... yes
724:info:build checking for limits.h... yes
725:info:build checking for stdlib.h... (cached) yes
726:info:build yes
727:info:build checking for unistd.h... (cached) yes
728:info:build checking for getpagesize... checking for stdlib.h... (cached) yes
729:info:build checking for malloc.h... yes
730:info:build checking for working mmap... no
731:info:build checking for string.h... (cached) yes
732:info:build checking for unistd.h... (cached) yes
733:info:build checking for strings.h... (cached) yes
734:info:build checking for sys/time.h... yes
735:info:build yes
736:info:build checking whether we are using the GNU C Library 2.1 or newer... checking for time.h... no
737:info:build checking whether integer division by zero raises SIGFPE... yes
738:info:build checking for sys/resource.h... no
739:info:build checking for inttypes.h... yes
740:info:build checking for sys/stat.h... (cached) yes
741:info:build checking for sys/mman.h... yes
742:info:build checking for stdint.h... yes
743:info:build yes
744:info:build checking for fcntl.h... checking for unsigned long long... yes
745:info:build checking for alloca.h... yes
746:info:build checking for inttypes.h... yes
747:info:build checking for sys/pstat.h... yes
748:info:build checking whether the inttypes.h PRIxNN macros are broken... no
749:info:build no
750:info:build checking for ld used by GCC... checking for sys/sysmp.h... /Applications/Xcode.app/Contents/Developer/Toolchains/XcodeDefault.xctoolchain/usr/bin/ld
751:info:build checking if the linker (/Applications/Xcode.app/Contents/Developer/Toolchains/XcodeDefault.xctoolchain/usr/bin/ld) is GNU ld... no
752:info:build checking for shared library run path origin... no
753:info:build checking for sys/sysinfo.h... done
754:info:build no
755:info:build checking for machine/hal_sysinfo.h... checking argz.h usability... no
756:info:build checking for sys/table.h... no
757:info:build checking argz.h presence... no
758:info:build checking for sys/sysctl.h... no
759:info:build checking for argz.h... no
760:info:build checking limits.h usability... yes
761:info:build yes
762:info:build checking limits.h presence... checking for sys/systemcfg.h... yes
763:info:build checking for limits.h... yes
764:info:build checking locale.h usability... no
765:info:build checking for stdint.h... (cached) yes
766:info:build checking for stdio_ext.h... yes
767:info:build checking locale.h presence... yes
768:info:build checking for locale.h... yes
769:info:build no
770:info:build checking for process.h... checking nl_types.h usability... no
771:info:build checking for sys/wait.h that is POSIX.1 compatible... yes
772:info:build checking nl_types.h presence... yes
773:info:build checking for nl_types.h... yes
774:info:build yes
775:info:build checking whether time.h and sys/time.h may both be included... checking malloc.h usability... yes
776:info:build checking whether errno must be declared... no
777:info:build checking malloc.h presence... no
778:info:build checking size of int... no
779:info:build checking for malloc.h... no
780:info:build checking stddef.h usability... yes
781:info:build checking stddef.h presence... 4
782:info:build checking for a 64-bit type... yes
783:info:build checking for stddef.h... yes
784:info:build uint64_t
785:info:build checking for stdlib.h... (cached) yes
786:info:build checking for intptr_t... checking for string.h... (cached) yes
787:info:build checking for unistd.h... (cached) yes
788:info:build checking sys/param.h usability... yes
789:info:build checking sys/param.h presence... yes
790:info:build checking for uintptr_t... yes
791:info:build checking for sys/param.h... yes
792:info:build checking for feof_unlocked... yes
793:info:build checking for fgets_unlocked... yes
794:info:build checking for ssize_t... no
795:info:build checking for getc_unlocked... yes
796:info:build yes
797:info:build checking for pid_t... checking for getcwd... yes
798:info:build checking for getegid... yes
799:info:build yes
800:info:build checking for geteuid... checking for library containing strerror... yes
801:info:build checking for getgid... none required
802:info:build checking for asprintf... yes
803:info:build checking for getuid... yes
804:info:build checking for atexit... yes
805:info:build checking for mempcpy... yes
806:info:build checking for basename... no
807:info:build checking for munmap... yes
808:info:build checking for bcmp... yes
809:info:build checking for putenv... yes
810:info:build checking for bcopy... yes
811:info:build checking for setenv... yes
812:info:build checking for bsearch... yes
813:info:build checking for setlocale... yes
814:info:build checking for bzero... yes
815:info:build checking for stpcpy... yes
816:info:build checking for calloc... yes
817:info:build checking for strcasecmp... yes
818:info:build checking for clock... yes
819:info:build checking for strdup... yes
820:info:build checking for ffs... yes
821:info:build yes
822:info:build checking for getcwd... checking for strtoul... yes
823:info:build yes
824:info:build checking for tsearch... checking for getpagesize... yes
825:info:build yes
826:info:build checking for __argz_count... checking for gettimeofday... yes
827:info:build no
828:info:build checking for index... checking for __argz_stringify... no
829:info:build yes
830:info:build checking for __argz_next... checking for insque... yes
831:info:build no
832:info:build checking for __fsetlocking... checking for memchr... no
833:info:build checking for iconv... yes
834:info:build checking for memcmp... yes
835:info:build checking for memcpy... yes
836:info:build checking how to link with libiconv... -liconv
837:info:build checking for iconv declaration... yes
838:info:build checking for memmem... install-shextern size_t iconv (iconv_t cd, char * *inbuf, size_t *inbytesleft, char * *outbuf, size_t *outbytesleft);
839:info:build checking for nl_langinfo and CODESET... yes
840:info:build checking for memmove... yes
841:info:build checking for LC_MESSAGES... yes
842:info:build checking for bison... bison
843:info:build checking version of bison... yes
844:info:build 3.0.4, ok
845:info:build checking whether NLS is requested... yes
846:info:build checking whether included gettext is requested... no
847:info:build checking for GNU gettext in libc... checking for mempcpy... no
848:info:build no
849:info:build checking for memset... checking for GNU gettext in libintl... yes
850:info:build checking whether to use NLS... yes
851:info:build checking where the gettext function comes from... external libintl
852:info:build checking how to link with libintl... -lintl
853:info:build checking for aclocal... aclocal
854:info:build checking for autoconf... autoconf
855:info:build checking for autoheader... autoheader
856:info:build yes
857:info:build checking for mkstemps... configure: updating cache ./config.cache
858:info:build configure: creating ./config.status
859:info:build yes
860:info:build checking for putenv... yes
861:info:build checking for random... yes
862:info:build checking for rename... yes
863:info:build checking for rindex... config.status: creating Makefile
864:info:build config.status: creating config.intl
865:info:build yes
866:info:build config.status: creating config.h
867:info:build checking for setenv... config.status: executing default-1 commands
868:info:build yes
869:info:build checking for snprintf... mkdir ./binutils
870:info:build mkdir ./gas
871:info:build Configuring in ./binutils
872:info:build Configuring in ./gas
873:info:build make[2]: Entering directory `/opt/local/var/macports/build/_opt_local_var_macports_sources_rsync.macports.org_release_tarballs_ports_cross_i386-mingw32-binutils/i386-mingw32-binutils/work/build/intl'
874:info:build make[2]: Nothing to be done for `all'.
875:info:build make[2]: Leaving directory `/opt/local/var/macports/build/_opt_local_var_macports_sources_rsync.macports.org_release_tarballs_ports_cross_i386-mingw32-binutils/i386-mingw32-binutils/work/build/intl'
876:info:build mkdir ./gprof
877:info:build Configuring in ./gprof
878:info:build yes
879:info:build checking for sigsetmask... yes
880:info:build checking for stpcpy... yes
881:info:build checking for stpncpy... configure: creating cache ./config.cache
882:info:build configure: creating cache ./config.cache
883:info:build checking build system type... checking build system type... yes
884:info:build configure: creating cache ./config.cache
885:info:build x86_64-apple-darwin14
886:info:build checking host system type... checking for strcasecmp... x86_64-apple-darwin14
887:info:build checking host system type... checking build system type... x86_64-apple-darwin14
888:info:build checking target system type... x86_64-apple-darwin14
889:info:build checking target system type... x86_64-apple-darwin14
890:info:build checking host system type... i386-pc-mingw32
891:info:build checking for x86_64-apple-darwin14-gcc... /usr/bin/clang
892:info:build i386-pc-mingw32
893:info:build checking for x86_64-apple-darwin14-gcc... /usr/bin/clang
894:info:build x86_64-apple-darwin14
895:info:build checking target system type... yes
896:info:build checking for strchr... i386-pc-mingw32
897:info:build checking for x86_64-apple-darwin14-gcc... /usr/bin/clang
898:info:build checking for C compiler default output file name... checking for C compiler default output file name... yes
899:info:build checking for C compiler default output file name... a.out
900:info:build checking whether the C compiler works... checking for strdup... yes
901:info:build a.out
902:info:build checking whether the C compiler works... checking whether we are cross compiling... no
903:info:build checking for suffix of executables... yes
904:info:build checking whether we are cross compiling... no
905:info:build checking for suffix of executables... a.out
906:info:build checking whether the C compiler works... yes
907:info:build checking whether we are cross compiling...
908:info:build no
909:info:build checking for suffix of executables... checking for suffix of object files...
910:info:build checking for suffix of object files... yes
911:info:build o
912:info:build checking whether we are using the GNU C compiler... checking for strncasecmp...
913:info:build checking for suffix of object files... o
914:info:build checking whether we are using the GNU C compiler... yes
915:info:build checking whether /usr/bin/clang accepts -g... o
916:info:build checking whether we are using the GNU C compiler... yes
917:info:build checking whether /usr/bin/clang accepts -g... yes
918:info:build checking for /usr/bin/clang option to accept ISO C89... yes
919:info:build yes
920:info:build checking whether /usr/bin/clang accepts -g... yes
921:info:build checking for /usr/bin/clang option to accept ISO C89... checking for strndup... yes
922:info:build checking for /usr/bin/clang option to accept ISO C89... none needed
923:info:build checking for library containing strerror... none needed
924:info:build checking for library containing strerror... yes
925:info:build none needed
926:info:build checking for library containing strerror... checking for strrchr... none required
927:info:build none required
928:info:build checking for a BSD-compatible install... /usr/bin/install -c
929:info:build checking whether build environment is sane... checking for a BSD-compatible install... /usr/bin/install -c
930:info:build checking whether build environment is sane... yes
931:info:build none required
932:info:build checking for a BSD-compatible install... /usr/bin/install -c
933:info:build checking whether build environment is sane... checking for strstr... yes
934:info:build checking for strtod... yes
935:info:build checking for strtol... yes
936:info:build checking for strtoul... yes
937:info:build checking for strverscmp... no
938:info:build checking for tmpnam... yes
939:info:build checking for vasprintf... yes
940:info:build checking for vfprintf... yes
941:info:build checking for vprintf... yes
942:info:build checking for vsnprintf... yes
943:info:build checking for vsprintf... yes
944:info:build yes
945:info:build checking for a thread-safe mkdir -p... checking for a thread-safe mkdir -p... /opt/local/bin/gmkdir -p
946:info:build checking for gawk... gawk
947:info:build /opt/local/bin/gmkdir -p
948:info:build checking whether /Applications/Xcode.app/Contents/Developer/usr/bin/make sets $(MAKE)... checking for gawk... gawk
949:info:build checking whether /Applications/Xcode.app/Contents/Developer/usr/bin/make sets $(MAKE)... yes
950:info:build yes
951:info:build checking for a thread-safe mkdir -p... yes
952:info:build yes
953:info:build /opt/local/bin/gmkdir -p
954:info:build checking for gawk... gawk
955:info:build checking whether /Applications/Xcode.app/Contents/Developer/usr/bin/make sets $(MAKE)... checking for waitpid... checking for style of include used by /Applications/Xcode.app/Contents/Developer/usr/bin/make... checking for style of include used by /Applications/Xcode.app/Contents/Developer/usr/bin/make... GNU
956:info:build GNU
957:info:build yes
958:info:build checking dependency style of /usr/bin/clang... checking dependency style of /usr/bin/clang... checking for style of include used by /Applications/Xcode.app/Contents/Developer/usr/bin/make... GNU
959:info:build checking dependency style of /usr/bin/clang... yes
960:info:build checking for setproctitle... no
961:info:build checking whether alloca needs Cray hooks... gcc3
962:info:build checking for x86_64-apple-darwin14-gcc... (cached) /usr/bin/clang
963:info:build gcc3
964:info:build checking for x86_64-apple-darwin14-gcc... (cached) /usr/bin/clang
965:info:build no
966:info:build checking stack direction for C alloca... gcc3
967:info:build checking for x86_64-apple-darwin14-gcc... (cached) /usr/bin/clang
968:info:build checking whether we are using the GNU C compiler... (cached) yes
969:info:build checking whether /usr/bin/clang accepts -g... (cached) yes
970:info:build checking for /usr/bin/clang option to accept ISO C89... (cached) none needed
971:info:build checking how to run the C preprocessor... -1
972:info:build checking whether we are using the GNU C compiler... (cached) yes
973:info:build checking whether /usr/bin/clang accepts -g... (cached) yes
974:info:build checking for /usr/bin/clang option to accept ISO C89... (cached) none needed
975:info:build checking how to run the C preprocessor... checking for vfork.h... checking whether we are using the GNU C compiler... (cached) yes
976:info:build checking whether /usr/bin/clang accepts -g... (cached) yes
977:info:build checking for /usr/bin/clang option to accept ISO C89... (cached) none needed
978:info:build checking how to run the C preprocessor... no
979:info:build checking for fork... /usr/bin/clang -E
980:info:build /usr/bin/clang -E
981:info:build /usr/bin/clang -E
982:info:build yes
983:info:build checking for vfork... checking for grep that handles long lines and -e... checking for grep that handles long lines and -e... /opt/local/bin/grep
984:info:build checking for egrep... /opt/local/bin/grep
985:info:build checking for egrep... /opt/local/bin/grep -E
986:info:build checking for ANSI C header files... /opt/local/bin/grep -E
987:info:build checking for ANSI C header files... checking for grep that handles long lines and -e... /opt/local/bin/grep
988:info:build checking for egrep... /opt/local/bin/grep -E
989:info:build checking for ANSI C header files... yes
990:info:build checking for working fork... yes
991:info:build checking for working vfork... (cached) yes
992:info:build checking for _doprnt... yes
993:info:build checking for sys/types.h... yes
994:info:build checking for sys/types.h... yes
995:info:build checking for sys/types.h... no
996:info:build checking for sys_errlist... yes
997:info:build checking for sys/stat.h... yes
998:info:build yes
999:info:build checking for sys/stat.h... checking for sys/stat.h... yes
1000:info:build checking for sys_nerr... yes
1001:info:build yes
1002:info:build checking for stdlib.h... yes
1003:info:build checking for stdlib.h... yes
1004:info:build checking for stdlib.h... checking for sys_siglist... yes
1005:info:build yes
1006:info:build checking for string.h... checking for string.h... yes
1007:info:build checking for string.h... yes
1008:info:build yes
1009:info:build checking for external symbol _system_configuration... yes
1010:info:build yes
1011:info:build checking for memory.h... checking for memory.h... checking for memory.h... no
1012:info:build yes
1013:info:build yes
1014:info:build checking for __fsetlocking... checking for strings.h... checking for strings.h... yes
1015:info:build checking for strings.h... yes
1016:info:build yes
1017:info:build checking for inttypes.h... no
1018:info:build checking for inttypes.h... checking for canonicalize_file_name... yes
1019:info:build checking for inttypes.h... yes
1020:info:build yes
1021:info:build checking for stdint.h... checking for stdint.h... yes
1022:info:build no
1023:info:build checking for dup3... checking for stdint.h... yes
1024:info:build yes
1025:info:build checking for unistd.h... checking for unistd.h... yes
1026:info:build checking for unistd.h... no
1027:info:build checking for getrusage... yes
1028:info:build yes
1029:info:build checking minix/config.h usability... checking minix/config.h usability... yes
1030:info:build yes
1031:info:build checking minix/config.h usability... checking for getsysinfo... no
1032:info:build checking minix/config.h presence... no
1033:info:build checking minix/config.h presence... no
1034:info:build checking for minix/config.h... no
1035:info:build no
1036:info:build checking minix/config.h presence... checking whether it is safe to define __EXTENSIONS__... no
1037:info:build checking for minix/config.h... no
1038:info:build checking whether it is safe to define __EXTENSIONS__... no
1039:info:build checking for gettimeofday... (cached) yes
1040:info:build no
1041:info:build checking for minix/config.h... no
1042:info:build checking whether it is safe to define __EXTENSIONS__... checking for on_exit... yes
1043:info:build checking for special C compiler options needed for large files... no
1044:info:build checking for _FILE_OFFSET_BITS value needed for large files... yes
1045:info:build checking for special C compiler options needed for large files... no
1046:info:build checking for _FILE_OFFSET_BITS value needed for large files... no
1047:info:build yes
1048:info:build checking how to print strings... checking for special C compiler options needed for large files... no
1049:info:build checking for _FILE_OFFSET_BITS value needed for large files... no
1050:info:build printf
1051:info:build checking for a sed that does not truncate output... checking how to print strings... /opt/local/bin/gsed
1052:info:build printf
1053:info:build checking for a sed that does not truncate output... checking for fgrep... /opt/local/bin/gsed
1054:info:build checking for fgrep... no
1055:info:build /opt/local/bin/grep -F
1056:info:build checking for ld used by /usr/bin/clang... checking for psignal... /opt/local/bin/grep -F
1057:info:build checking for ld used by /usr/bin/clang... no
1058:info:build checking how to print strings... printf
1059:info:build checking for a sed that does not truncate output... /Applications/Xcode.app/Contents/Developer/Toolchains/XcodeDefault.xctoolchain/usr/bin/ld
1060:info:build checking if the linker (/Applications/Xcode.app/Contents/Developer/Toolchains/XcodeDefault.xctoolchain/usr/bin/ld) is GNU ld... /opt/local/bin/gsed
1061:info:build /Applications/Xcode.app/Contents/Developer/Toolchains/XcodeDefault.xctoolchain/usr/bin/ld
1062:info:build checking if the linker (/Applications/Xcode.app/Contents/Developer/Toolchains/XcodeDefault.xctoolchain/usr/bin/ld) is GNU ld... checking for fgrep... no
1063:info:build checking for BSD- or MS-compatible name lister (nm)... nm
1064:info:build checking the name lister (nm) interface... no
1065:info:build checking for BSD- or MS-compatible name lister (nm)... nm
1066:info:build checking the name lister (nm) interface... /opt/local/bin/grep -F
1067:info:build checking for ld used by /usr/bin/clang... yes
1068:info:build /Applications/Xcode.app/Contents/Developer/Toolchains/XcodeDefault.xctoolchain/usr/bin/ld
1069:info:build checking if the linker (/Applications/Xcode.app/Contents/Developer/Toolchains/XcodeDefault.xctoolchain/usr/bin/ld) is GNU ld... no
1070:info:build checking for BSD- or MS-compatible name lister (nm)... nm
1071:info:build checking the name lister (nm) interface... checking for pstat_getdynamic... BSD nm
1072:info:build checking whether ln -s works... yes
1073:info:build checking the maximum length of command line arguments... BSD nm
1074:info:build checking whether ln -s works... yes
1075:info:build checking the maximum length of command line arguments... 196608
1076:info:build checking whether the shell understands some XSI constructs... 196608
1077:info:build checking whether the shell understands some XSI constructs... yes
1078:info:build checking whether the shell understands "+="... yes
1079:info:build checking whether the shell understands "+="... BSD nm
1080:info:build checking whether ln -s works... yes
1081:info:build checking the maximum length of command line arguments... yes
1082:info:build yes
1083:info:build checking for /Applications/Xcode.app/Contents/Developer/Toolchains/XcodeDefault.xctoolchain/usr/bin/ld option to reload object files... -r
1084:info:build checking for /Applications/Xcode.app/Contents/Developer/Toolchains/XcodeDefault.xctoolchain/usr/bin/ld option to reload object files... -r
1085:info:build checking for x86_64-apple-darwin14-objdump... objdump
1086:info:build checking how to recognize dependent libraries... checking for x86_64-apple-darwin14-objdump... objdump
1087:info:build checking how to recognize dependent libraries... pass_all
1088:info:build checking for x86_64-apple-darwin14-ar... pass_all
1089:info:build ar
1090:info:build checking for x86_64-apple-darwin14-ar... ar
1091:info:build 196608
1092:info:build checking whether the shell understands some XSI constructs... checking for x86_64-apple-darwin14-strip... checking for x86_64-apple-darwin14-strip... no
1093:info:build no
1094:info:build checking for strip... checking for strip... strip
1095:info:build strip
1096:info:build checking for x86_64-apple-darwin14-ranlib... ranlib
1097:info:build checking for x86_64-apple-darwin14-ranlib... ranlib
1098:info:build yes
1099:info:build checking whether the shell understands "+="... checking command to parse nm output from /usr/bin/clang object... checking command to parse nm output from /usr/bin/clang object... yes
1100:info:build checking for /Applications/Xcode.app/Contents/Developer/Toolchains/XcodeDefault.xctoolchain/usr/bin/ld option to reload object files... -r
1101:info:build checking for x86_64-apple-darwin14-objdump... objdump
1102:info:build checking how to recognize dependent libraries... pass_all
1103:info:build checking for x86_64-apple-darwin14-ar... ar
1104:info:build checking for x86_64-apple-darwin14-strip... no
1105:info:build checking for strip... strip
1106:info:build checking for x86_64-apple-darwin14-ranlib... ranlib
1107:info:build checking command to parse nm output from /usr/bin/clang object... no
1108:info:build checking for pstat_getstatic... no
1109:info:build checking for realpath... yes
1110:info:build checking for sbrk... ok
1111:info:build checking for x86_64-apple-darwin14-dsymutil... no
1112:info:build checking for dsymutil... ok
1113:info:build dsymutil
1114:info:build checking for x86_64-apple-darwin14-nmedit... no
1115:info:build checking for nmedit... nmedit
1116:info:build checking for x86_64-apple-darwin14-lipo... no
1117:info:build checking for x86_64-apple-darwin14-dsymutil... checking for lipo... no
1118:info:build lipo
1119:info:build checking for dsymutil... checking for x86_64-apple-darwin14-otool... ok
1120:info:build dsymutil
1121:info:build checking for x86_64-apple-darwin14-nmedit... no
1122:info:build no
1123:info:build checking for otool... checking for nmedit... nmedit
1124:info:build checking for x86_64-apple-darwin14-lipo... otool
1125:info:build checking for x86_64-apple-darwin14-otool64... no
1126:info:build checking for lipo... no
1127:info:build lipo
1128:info:build checking for otool64... checking for x86_64-apple-darwin14-otool... no
1129:info:build checking for -single_module linker flag... no
1130:info:build checking for otool... otool
1131:info:build checking for x86_64-apple-darwin14-otool64... no
1132:info:build checking for otool64... checking for x86_64-apple-darwin14-dsymutil... no
1133:info:build checking for dsymutil... no
1134:info:build checking for -single_module linker flag... dsymutil
1135:info:build checking for x86_64-apple-darwin14-nmedit... no
1136:info:build checking for nmedit... nmedit
1137:info:build checking for x86_64-apple-darwin14-lipo... no
1138:info:build checking for lipo... lipo
1139:info:build checking for x86_64-apple-darwin14-otool... no
1140:info:build checking for otool... otool
1141:info:build checking for x86_64-apple-darwin14-otool64... no
1142:info:build checking for otool64... no
1143:info:build checking for -single_module linker flag... yes
1144:info:build checking for spawnve... yes
1145:info:build checking for -exported_symbols_list linker flag... yes
1146:info:build checking for -exported_symbols_list linker flag... yes
1147:info:build checking for -exported_symbols_list linker flag... no
1148:info:build checking for spawnvpe... yes
1149:info:build checking for -force_load linker flag... yes
1150:info:build checking for -force_load linker flag... yes
1151:info:build checking for -force_load linker flag... no
1152:info:build checking for strerror... yes
1153:info:build checking for dlfcn.h... yes
1154:info:build checking for dlfcn.h... yes
1155:info:build checking for dlfcn.h... yes
1156:info:build checking for strsignal... yes
1157:info:build yes
1158:info:build checking for objdir... checking for objdir... .libs
1159:info:build .libs
1160:info:build yes
1161:info:build yes
1162:info:build checking for objdir... .libs
1163:info:build checking for sysconf... checking if /usr/bin/clang supports -fno-rtti -fno-exceptions... checking if /usr/bin/clang supports -fno-rtti -fno-exceptions... yes
1164:info:build checking for sysctl... yes
1165:info:build checking for /usr/bin/clang option to produce PIC... -fno-common -DPIC
1166:info:build checking if /usr/bin/clang PIC flag -fno-common -DPIC works... yes
1167:info:build checking for /usr/bin/clang option to produce PIC... -fno-common -DPIC
1168:info:build checking if /usr/bin/clang PIC flag -fno-common -DPIC works... checking if /usr/bin/clang supports -fno-rtti -fno-exceptions... yes
1169:info:build checking if /usr/bin/clang static flag -static works... yes
1170:info:build yes
1171:info:build yes
1172:info:build checking if /usr/bin/clang static flag -static works... checking for /usr/bin/clang option to produce PIC... -fno-common -DPIC
1173:info:build checking if /usr/bin/clang PIC flag -fno-common -DPIC works... checking for sysmp... no
1174:info:build checking if /usr/bin/clang supports -c -o file.o... no
1175:info:build checking if /usr/bin/clang supports -c -o file.o... yes
1176:info:build checking if /usr/bin/clang static flag -static works... no
1177:info:build checking for table... no
1178:info:build checking if /usr/bin/clang supports -c -o file.o... yes
1179:info:build checking if /usr/bin/clang supports -c -o file.o... (cached) yes
1180:info:build checking whether the /usr/bin/clang linker (/Applications/Xcode.app/Contents/Developer/Toolchains/XcodeDefault.xctoolchain/usr/bin/ld) supports shared libraries... yes
1181:info:build checking dynamic linker characteristics... yes
1182:info:build checking if /usr/bin/clang supports -c -o file.o... (cached) yes
1183:info:build checking whether the /usr/bin/clang linker (/Applications/Xcode.app/Contents/Developer/Toolchains/XcodeDefault.xctoolchain/usr/bin/ld) supports shared libraries... yes
1184:info:build checking dynamic linker characteristics... darwin14 dyld
1185:info:build checking how to hardcode library paths into programs... immediate
1186:info:build checking whether stripping libraries is possible... darwin14 dyld
1187:info:build checking how to hardcode library paths into programs... immediate
1188:info:build checking whether stripping libraries is possible... no
1189:info:build checking for times... yes
1190:info:build checking if /usr/bin/clang supports -c -o file.o... (cached) yes
1191:info:build checking whether the /usr/bin/clang linker (/Applications/Xcode.app/Contents/Developer/Toolchains/XcodeDefault.xctoolchain/usr/bin/ld) supports shared libraries... yes
1192:info:build checking dynamic linker characteristics... yes
1193:info:build checking if libtool supports shared libraries... yes
1194:info:build checking whether to build shared libraries... yes
1195:info:build checking whether to build static libraries... yes
1196:info:build yes
1197:info:build checking if libtool supports shared libraries... yes
1198:info:build checking whether to build shared libraries... yes
1199:info:build checking whether to build static libraries... yes
1200:info:build Setting warning flags = -W -Wall -Wstrict-prototypes -Wmissing-prototypes -Wshadow
1201:info:build checking for bison... bison -y
1202:info:build checking for flex... flex
1203:info:build darwin14 dyld
1204:info:build checking how to hardcode library paths into programs... immediate
1205:info:build checking whether stripping libraries is possible... Setting warning flags = -W -Wall -Wstrict-prototypes -Wmissing-prototypes -Wshadow
1206:info:build checking whether byte ordering is bigendian... yes
1207:info:build checking if libtool supports shared libraries... yes
1208:info:build checking whether to build shared libraries... yes
1209:info:build checking whether to build static libraries... yes
1210:info:build checking for setmode... yes
1211:info:build checking lex output file root... lex.yy
1212:info:build checking lex library... checking for wait3... yes
1213:info:build checking whether NLS is requested... yes
1214:info:build checking for catalogs to be installed... yes
1215:info:build checking for wait4... no
1216:info:build yes
1217:info:build checking for bison... bison -y
1218:info:build checking for flex... flex
1219:info:build checking whether basename is declared... checking lex output file root... lex.yy
1220:info:build checking lex library... no
1221:info:build checking whether ffs is declared... yes
1222:info:build checking whether asprintf is declared... yes
1223:info:build checking whether vasprintf is declared...  bg da de es fi fr ga id ms nl pt_BR ro ru rw sv tr vi bg da de es fi fr ga id ms nl pt_BR ro ru rw sv tr vi
1224:info:build checking whether NLS is requested... yes
1225:info:build yes
1226:info:build checking for msgfmt... checking whether snprintf is declared... /opt/local/bin/msgfmt
1227:info:build checking for gmsgfmt... /opt/local/bin/msgfmt
1228:info:build checking for xgettext... /opt/local/bin/xgettext
1229:info:build checking for msgmerge... /opt/local/bin/msgmerge
1230:info:build yes
1231:info:build -lfl
1232:info:build checking whether yytext is a pointer... checking whether vsnprintf is declared... checking whether to enable maintainer-specific portions of Makefiles... no
1233:info:build checking sys/gmon_out.h usability... yes
1234:info:build checking whether calloc is declared... no
1235:info:build checking sys/gmon_out.h presence... -lfl
1236:info:build checking whether yytext is a pointer... yes
1237:info:build no
1238:info:build checking for sys/gmon_out.h... no
1239:info:build checking for a known getopt prototype in unistd.h... checking whether getenv is declared... yes
1240:info:build checking for library containing fabs... yes
1241:info:build checking whether getopt is declared... yes
1242:info:build checking whether NLS is requested... yes
1243:info:build checking for catalogs to be installed... none required
1244:info:build yes
1245:info:build Setting warning flags = -W -Wall -Wstrict-prototypes -Wmissing-prototypes -Wshadow
1246:info:build checking whether malloc is declared... yes
1247:info:build checking whether NLS is requested... yes
1248:info:build checking for catalogs to be installed... configure: updating cache ./config.cache
1249:info:build configure: creating ./config.status
1250:info:build yes
1251:info:build checking whether realloc is declared... yes
1252:info:build  es fr id ru rw tr es fr id ru rw tr
1253:info:build checking whether NLS is requested... yes
1254:info:build checking whether sbrk is declared... checking for msgfmt... /opt/local/bin/msgfmt
1255:info:build checking for gmsgfmt... /opt/local/bin/msgfmt
1256:info:build checking for xgettext... /opt/local/bin/xgettext
1257:info:build checking for msgmerge... /opt/local/bin/msgmerge
1258:info:build yes
1259:info:build checking whether strverscmp is declared... checking whether to enable maintainer-specific portions of Makefiles... no
1260:info:build checking for string.h... (cached) yes
1261:info:build  bg da es fi fr id ja ro ru rw sk sv tr uk vi zh_CN zh_TW bg da es fi fr id ja ro ru rw sk sv tr uk vi zh_CN zh_TW
1262:info:build checking whether NLS is requested... yes
1263:info:build checking for stdlib.h... (cached) yes
1264:info:build checking for msgfmt... checking for memory.h... (cached) yes
1265:info:build /opt/local/bin/msgfmt
1266:info:build checking for gmsgfmt... /opt/local/bin/msgfmt
1267:info:build no
1268:info:build checking for strings.h... (cached) yes
1269:info:build checking whether canonicalize_file_name must be declared... checking for xgettext... /opt/local/bin/xgettext
1270:info:build checking for unistd.h... (cached) yes
1271:info:build checking for msgmerge... /opt/local/bin/msgmerge
1272:info:build checking errno.h usability... yes
1273:info:build checking whether to enable maintainer-specific portions of Makefiles... no
1274:info:build checking for stdlib.h... (cached) yes
1275:info:build checking for x86_64-apple-darwin14-ranlib... (cached) ranlib
1276:info:build checking for string.h... (cached) yes
1277:info:build yes
1278:info:build checking errno.h presence... checking for unistd.h... (cached) yes
1279:info:build checking for getpagesize... (cached) yes
1280:info:build checking for strings.h... (cached) yes
1281:info:build checking for working mmap... yes
1282:info:build checking for errno.h... yes
1283:info:build checking for stdlib.h... (cached) yes
1284:info:build checking for sys/types.h... (cached) yes
1285:info:build checking for unistd.h... (cached) yes
1286:info:build checking limits.h usability... checking fcntl.h usability... yes
1287:info:build checking limits.h presence... yes
1288:info:build checking fcntl.h presence... yes
1289:info:build checking for working strncmp... yes
1290:info:build checking for limits.h... yes
1291:info:build yes
1292:info:build checking for fcntl.h... yes
1293:info:build checking time.h usability... checking sys/file.h usability... yes
1294:info:build yes
1295:info:build checking time.h presence... yes
1296:info:build checking sys/file.h presence... yes
1297:info:build checking for time.h... yes
1298:info:build yes
1299:info:build checking for sys/file.h... yes
1300:info:build configure: updating cache ./config.cache
1301:info:build checking for sys/stat.h... (cached) yes
1302:info:build checking limits.h usability... checking whether compiling a cross-assembler... yes
1303:info:build checking for working alloca.h... configure: creating ./config.status
1304:info:build yes
1305:info:build checking limits.h presence... yes
1306:info:build checking for alloca... yes
1307:info:build checking for limits.h... yes
1308:info:build checking sys/param.h usability... yes
1309:info:build checking for inline... inline
1310:info:build checking for unlink... yes
1311:info:build checking sys/param.h presence... yes
1312:info:build checking for sys/param.h... yes
1313:info:build checking for sys/wait.h that is POSIX.1 compatible... yes
1314:info:build checking for sbrk... yes
1315:info:build checking for working alloca.h... yes
1316:info:build checking for working assert macro... yes
1317:info:build checking for alloca... yes
1318:info:build yes
1319:info:build checking whether declaration is required for errno... checking for sbrk... config.status: creating Makefile
1320:info:build config.status: creating testsuite/Makefile
1321:info:build yes
1322:info:build no
1323:info:build checking for a known getopt prototype in unistd.h... checking for utimes... config.status: creating config.h
1324:info:build yes
1325:info:build checking whether declaration is required for environ... config.status: executing default commands
1326:info:build yes
1327:info:build checking for setmode... yes
1328:info:build checking whether declaration is required for ffs... yes
1329:info:build mkdir ./ld
1330:info:build Configuring in ./ld
1331:info:build checking for getc_unlocked... no
1332:info:build checking whether declaration is required for free... yes
1333:info:build checking for strcoll... no
1334:info:build checking whether declaration is required for malloc... yes
1335:info:build checking for mkstemp... no
1336:info:build checking whether declaration is required for sbrk... yes
1337:info:build checking for mkdtemp... yes
1338:info:build checking for library containing frexp... no
1339:info:build checking whether declaration is required for strstr... configure: creating cache ./config.cache
1340:info:build none required
1341:info:build checking for time_t in time.h... checking build system type... no
1342:info:build checking whether mempcpy is declared... x86_64-apple-darwin14
1343:info:build checking host system type... yes
1344:info:build checking for time_t in sys/types.h... x86_64-apple-darwin14
1345:info:build checking target system type... no
1346:info:build yes
1347:info:build checking for a known getopt prototype in unistd.h... i386-pc-mingw32
1348:info:build checking for x86_64-apple-darwin14-gcc... /usr/bin/clang
1349:info:build checking whether vsnprintf is declared... config.status: creating Makefile
1350:info:build yes
1351:info:build checking for utime.h... config.status: creating po/Makefile.in
1352:info:build yes
1353:info:build checking for library containing zlibVersion... yes
1354:info:build checking for C compiler default output file name... checking whether fprintf is declared... config.status: creating gconfig.h
1355:info:build a.out
1356:info:build checking whether the C compiler works... yes
1357:info:build checking whether we are cross compiling... no
1358:info:build checking for suffix of executables... yes
1359:info:build config.status: executing depfiles commands
1360:info:build checking whether stpcpy is declared...
1361:info:build checking for suffix of object files... yes
1362:info:build -lz
1363:info:build checking zlib.h usability... checking whether strstr is declared... o
1364:info:build checking whether we are using the GNU C compiler... yes
1365:info:build yes
1366:info:build checking zlib.h presence... yes
1367:info:build checking whether /usr/bin/clang accepts -g... checking whether sbrk is declared... yes
1368:info:build checking for zlib.h... yes
1369:info:build yes
1370:info:build checking for /usr/bin/clang option to accept ISO C89... checking for struct tm.tm_gmtoff in time.h... yes
1371:info:build checking whether getenv is declared... yes
1372:info:build checking for struct stat.st_mtim.tv_sec in sys/stat.h... none needed
1373:info:build checking for library containing strerror... config.status: executing libtool commands
1374:info:build yes
1375:info:build no
1376:info:build checking for struct stat.st_mtim.tv_nsec in sys/stat.h... checking whether environ is declared... none required
1377:info:build checking for a BSD-compatible install... /usr/bin/install -c
1378:info:build checking whether build environment is sane... config.status: executing default-1 commands
1379:info:build no
1380:info:build config.status: creating po/POTFILES
1381:info:build config.status: creating po/Makefile
1382:info:build no
1383:info:build checking whether getc_unlocked is declared... configure: updating cache ./config.cache
1384:info:build configure: creating ./config.status
1385:info:build yes
1386:info:build checking whether snprintf is declared... mkdir ./bfd
1387:info:build Configuring in ./bfd
1388:info:build yes
1389:info:build checking whether vsnprintf is declared... yes
1390:info:build checking for library containing zlibVersion... -lz
1391:info:build checking zlib.h usability... yes
1392:info:build checking zlib.h presence... configure: creating cache ./config.cache
1393:info:build yes
1394:info:build checking for zlib.h... yes
1395:info:build checking iconv.h usability... checking build system type... x86_64-apple-darwin14
1396:info:build checking host system type... yes
1397:info:build checking iconv.h presence... x86_64-apple-darwin14
1398:info:build checking target system type... yes
1399:info:build checking for iconv.h... yes
1400:info:build checking for ld used by GCC... i386-pc-mingw32
1401:info:build checking for x86_64-apple-darwin14-gcc... /usr/bin/clang
1402:info:build /Applications/Xcode.app/Contents/Developer/Toolchains/XcodeDefault.xctoolchain/usr/bin/ld
1403:info:build checking if the linker (/Applications/Xcode.app/Contents/Developer/Toolchains/XcodeDefault.xctoolchain/usr/bin/ld) is GNU ld... no
1404:info:build checking for shared library run path origin... yes
1405:info:build checking for a thread-safe mkdir -p... /opt/local/bin/gmkdir -p
1406:info:build checking for gawk... gawk
1407:info:build checking whether /Applications/Xcode.app/Contents/Developer/usr/bin/make sets $(MAKE)... checking for C compiler default output file name... done
1408:info:build checking for iconv... yes
1409:info:build checking for style of include used by /Applications/Xcode.app/Contents/Developer/usr/bin/make... GNU
1410:info:build a.out
1411:info:build checking whether the C compiler works... yes
1412:info:build checking dependency style of /usr/bin/clang... checking whether we are cross compiling... no
1413:info:build checking for suffix of executables...
1414:info:build checking for suffix of object files... o
1415:info:build checking whether we are using the GNU C compiler... yes
1416:info:build checking whether /usr/bin/clang accepts -g... gcc3
1417:info:build checking whether to enable maintainer-specific portions of Makefiles... no
1418:info:build yes
1419:info:build checking how to run the C preprocessor... checking how to link with libiconv... -liconv
1420:info:build checking for iconv declaration... yes
1421:info:build checking for /usr/bin/clang option to accept ISO C89... install-shextern size_t iconv (iconv_t cd, char * *inbuf, size_t *inbytesleft, char * *outbuf, size_t *outbytesleft);
1422:info:build /usr/bin/clang -E
1423:info:build none needed
1424:info:build checking for library containing strerror... checking for grep that handles long lines and -e... /opt/local/bin/grep
1425:info:build checking for egrep... configure: updating cache ./config.cache
1426:info:build /opt/local/bin/grep -E
1427:info:build configure: creating ./config.status
1428:info:build none required
1429:info:build checking for a BSD-compatible install... /usr/bin/install -c
1430:info:build checking whether build environment is sane... Setting warning flags = -W -Wall -Wstrict-prototypes -Wmissing-prototypes -Wshadow
1431:info:build checking for x86_64-apple-darwin14-gcc... (cached) /usr/bin/clang
1432:info:build checking whether we are using the GNU C compiler... (cached) yes
1433:info:build checking whether /usr/bin/clang accepts -g... (cached) yes
1434:info:build checking for /usr/bin/clang option to accept ISO C89... (cached) none needed
1435:info:build checking for ANSI C header files... yes
1436:info:build checking for sys/types.h... yes
1437:info:build checking for sys/stat.h... yes
1438:info:build checking for stdlib.h... yes
1439:info:build checking for string.h... yes
1440:info:build checking for memory.h... yes
1441:info:build checking for strings.h... yes
1442:info:build checking for inttypes.h... yes
1443:info:build checking for a thread-safe mkdir -p... /opt/local/bin/gmkdir -p
1444:info:build checking for gawk... gawk
1445:info:build checking whether /Applications/Xcode.app/Contents/Developer/usr/bin/make sets $(MAKE)... config.status: creating .gdbinit
1446:info:build yes
1447:info:build yes
1448:info:build checking for style of include used by /Applications/Xcode.app/Contents/Developer/usr/bin/make... config.status: creating Makefile
1449:info:build GNU
1450:info:build checking for stdint.h... checking dependency style of /usr/bin/clang... yes
1451:info:build checking for unistd.h... config.status: creating doc/Makefile
1452:info:build config.status: creating po/Makefile.in
1453:info:build yes
1454:info:build checking minix/config.h usability... gcc3
1455:info:build checking for x86_64-apple-darwin14-ar... ar
1456:info:build checking for x86_64-apple-darwin14-ranlib... ranlib
1457:info:build checking for x86_64-apple-darwin14-gcc... (cached) /usr/bin/clang
1458:info:build config.status: creating config.h
1459:info:build no
1460:info:build checking minix/config.h presence... checking whether we are using the GNU C compiler... (cached) yes
1461:info:build checking whether /usr/bin/clang accepts -g... (cached) yes
1462:info:build checking for /usr/bin/clang option to accept ISO C89... (cached) none needed
1463:info:build checking how to run the C preprocessor... config.status: executing depfiles commands
1464:info:build no
1465:info:build checking for minix/config.h... no
1466:info:build checking whether it is safe to define __EXTENSIONS__... /usr/bin/clang -E
1467:info:build yes
1468:info:build checking for special C compiler options needed for large files... no
1469:info:build checking for _FILE_OFFSET_BITS value needed for large files... checking for grep that handles long lines and -e... no
1470:info:build /opt/local/bin/grep
1471:info:build checking for egrep... checking how to print strings... printf
1472:info:build checking for a sed that does not truncate output... /opt/local/bin/grep -E
1473:info:build checking for ANSI C header files... /opt/local/bin/gsed
1474:info:build checking for fgrep... /opt/local/bin/grep -F
1475:info:build checking for ld used by /usr/bin/clang... /Applications/Xcode.app/Contents/Developer/Toolchains/XcodeDefault.xctoolchain/usr/bin/ld
1476:info:build checking if the linker (/Applications/Xcode.app/Contents/Developer/Toolchains/XcodeDefault.xctoolchain/usr/bin/ld) is GNU ld... no
1477:info:build checking for BSD- or MS-compatible name lister (nm)... nm
1478:info:build checking the name lister (nm) interface... BSD nm
1479:info:build checking whether ln -s works... yes
1480:info:build checking the maximum length of command line arguments... 196608
1481:info:build checking whether the shell understands some XSI constructs... yes
1482:info:build checking whether the shell understands "+="... yes
1483:info:build checking for /Applications/Xcode.app/Contents/Developer/Toolchains/XcodeDefault.xctoolchain/usr/bin/ld option to reload object files... -r
1484:info:build checking for x86_64-apple-darwin14-objdump... objdump
1485:info:build checking how to recognize dependent libraries... pass_all
1486:info:build checking for x86_64-apple-darwin14-ar... ar
1487:info:build checking for x86_64-apple-darwin14-strip... no
1488:info:build checking for strip... strip
1489:info:build checking for x86_64-apple-darwin14-ranlib... ranlib
1490:info:build checking command to parse nm output from /usr/bin/clang object... yes
1491:info:build checking for sys/types.h... yes
1492:info:build checking for sys/stat.h... yes
1493:info:build ok
1494:info:build checking for x86_64-apple-darwin14-dsymutil... no
1495:info:build checking for dsymutil... dsymutil
1496:info:build checking for x86_64-apple-darwin14-nmedit... no
1497:info:build checking for nmedit... nmedit
1498:info:build checking for x86_64-apple-darwin14-lipo... no
1499:info:build checking for lipo... lipo
1500:info:build checking for x86_64-apple-darwin14-otool... no
1501:info:build checking for otool... otool
1502:info:build checking for x86_64-apple-darwin14-otool64... no
1503:info:build checking for otool64... no
1504:info:build checking for -single_module linker flag... checking for stdlib.h... yes
1505:info:build yes
1506:info:build checking for -exported_symbols_list linker flag... checking for string.h... yes
1507:info:build checking for -force_load linker flag... yes
1508:info:build checking for memory.h... yes
1509:info:build checking for strings.h... yes
1510:info:build checking for dlfcn.h... yes
1511:info:build config.status: creating Makefile
1512:info:build checking for inttypes.h... yes
1513:info:build checking for objdir... .libs
1514:info:build config.status: creating doc/Makefile
1515:info:build yes
1516:info:build checking for stdint.h... config.status: creating po/Makefile.in
1517:info:build yes
1518:info:build checking if /usr/bin/clang supports -fno-rtti -fno-exceptions... checking for unistd.h... config.status: creating config.h
1519:info:build config.status: executing depfiles commands
1520:info:build yes
1521:info:build yes
1522:info:build checking for /usr/bin/clang option to produce PIC... -fno-common -DPIC
1523:info:build checking if /usr/bin/clang PIC flag -fno-common -DPIC works... config.status: executing libtool commands
1524:info:build checking minix/config.h usability... yes
1525:info:build checking if /usr/bin/clang static flag -static works... config.status: executing default-1 commands
1526:info:build no
1527:info:build checking minix/config.h presence... config.status: creating po/POTFILES
1528:info:build no
1529:info:build checking if /usr/bin/clang supports -c -o file.o... config.status: creating po/Makefile
1530:info:build no
1531:info:build checking for minix/config.h... no
1532:info:build checking whether it is safe to define __EXTENSIONS__... config.status: executing default commands
1533:info:build yes
1534:info:build checking how to print strings... printf
1535:info:build checking for a sed that does not truncate output... yes
1536:info:build checking if /usr/bin/clang supports -c -o file.o... (cached) yes
1537:info:build checking whether the /usr/bin/clang linker (/Applications/Xcode.app/Contents/Developer/Toolchains/XcodeDefault.xctoolchain/usr/bin/ld) supports shared libraries... yes
1538:info:build checking dynamic linker characteristics... /opt/local/bin/gsed
1539:info:build checking for fgrep... /opt/local/bin/grep -F
1540:info:build checking for ld used by /usr/bin/clang... darwin14 dyld
1541:info:build checking how to hardcode library paths into programs... immediate
1542:info:build checking whether stripping libraries is possible... /Applications/Xcode.app/Contents/Developer/Toolchains/XcodeDefault.xctoolchain/usr/bin/ld
1543:info:build checking if the linker (/Applications/Xcode.app/Contents/Developer/Toolchains/XcodeDefault.xctoolchain/usr/bin/ld) is GNU ld... yes
1544:info:build checking if libtool supports shared libraries... yes
1545:info:build checking whether to build shared libraries... yes
1546:info:build checking whether to build static libraries... yes
1547:info:build checking whether NLS is requested... yes
1548:info:build no
1549:info:build checking for BSD- or MS-compatible name lister (nm)... nm
1550:info:build checking for catalogs to be installed... checking the name lister (nm) interface... make[2]: Entering directory `/opt/local/var/macports/build/_opt_local_var_macports_sources_rsync.macports.org_release_tarballs_ports_cross_i386-mingw32-binutils/i386-mingw32-binutils/work/build/libiberty'
1551:info:build if [ x"" != x ] && [ ! -d pic ]; then \
1552:info:build       mkdir pic; \
1553:info:build     else true; fi
1554:info:build touch stamp-picdir
1555:info:build echo ./regex.o ./cplus-dem.o ./cp-demangle.o ./md5.o ./sha1.o ./alloca.o ./argv.o ./choose-temp.o ./concat.o ./cp-demint.o ./crc32.o ./dyn-string.o ./fdmatch.o ./fibheap.o ./filename_cmp.o ./floatformat.o ./fnmatch.o ./fopen_unlocked.o ./getopt.o ./getopt1.o ./getpwd.o ./getruntime.o ./hashtab.o ./hex.o ./lbasename.o ./lrealpath.o ./make-relative-prefix.o ./make-temp-file.o ./objalloc.o ./obstack.o ./partition.o ./pexecute.o ./physmem.o ./pex-common.o ./pex-one.o ./pex-unix.o ./safe-ctype.o ./simple-object.o ./simple-object-coff.o ./simple-object-elf.o ./simple-object-mach-o.o ./sort.o ./spaces.o ./splay-tree.o ./strerror.o ./strsignal.o ./unlink-if-ordinary.o ./xatexit.o ./xexit.o ./xmalloc.o ./xmemdup.o ./xstrdup.o ./xstrerror.o ./xstrndup.o > required-list
1556:info:build make[3]: Entering directory `/opt/local/var/macports/build/_opt_local_var_macports_sources_rsync.macports.org_release_tarballs_ports_cross_i386-mingw32-binutils/i386-mingw32-binutils/work/build/libiberty/testsuite'
1557:info:build make[3]: Nothing to be done for `all'.
1558:info:build make[3]: Leaving directory `/opt/local/var/macports/build/_opt_local_var_macports_sources_rsync.macports.org_release_tarballs_ports_cross_i386-mingw32-binutils/i386-mingw32-binutils/work/build/libiberty/testsuite'
1559:info:build if [ x"" != x ]; then \
1560:info:build       /usr/bin/clang -c -DHAVE_CONFIG_H -pipe -Os -I/opt/local/include -arch x86_64  -I. -I/opt/local/var/macports/build/_opt_local_var_macports_sources_rsync.macports.org_release_tarballs_ports_cross_i386-mingw32-binutils/i386-mingw32-binutils/work/binutils-2.21/libiberty/../include  -W -Wall -Wwrite-strings -Wc++-compat -Wstrict-prototypes -pedantic   /opt/local/var/macports/build/_opt_local_var_macports_sources_rsync.macports.org_release_tarballs_ports_cross_i386-mingw32-binutils/i386-mingw32-binutils/work/binutils-2.21/libiberty/regex.c -o pic/regex.o; \
1561:info:build     else true; fi
1562:info:build /usr/bin/clang -c -DHAVE_CONFIG_H -pipe -Os -I/opt/local/include -arch x86_64  -I. -I/opt/local/var/macports/build/_opt_local_var_macports_sources_rsync.macports.org_release_tarballs_ports_cross_i386-mingw32-binutils/i386-mingw32-binutils/work/binutils-2.21/libiberty/../include  -W -Wall -Wwrite-strings -Wc++-compat -Wstrict-prototypes -pedantic  /opt/local/var/macports/build/_opt_local_var_macports_sources_rsync.macports.org_release_tarballs_ports_cross_i386-mingw32-binutils/i386-mingw32-binutils/work/binutils-2.21/libiberty/regex.c -o regex.o
1563:info:build BSD nm
1564:info:build checking whether ln -s works... yes
1565:info:build checking the maximum length of command line arguments... 196608
1566:info:build checking whether the shell understands some XSI constructs... yes
1567:info:build checking whether the shell understands "+="... yes
1568:info:build checking for /Applications/Xcode.app/Contents/Developer/Toolchains/XcodeDefault.xctoolchain/usr/bin/ld option to reload object files... -r
1569:info:build checking for x86_64-apple-darwin14-objdump... objdump
1570:info:build checking how to recognize dependent libraries... pass_all
1571:info:build checking for x86_64-apple-darwin14-ar... (cached) ar
1572:info:build checking for x86_64-apple-darwin14-strip... no
1573:info:build checking for strip... strip
1574:info:build checking for x86_64-apple-darwin14-ranlib... (cached) ranlib
1575:info:build checking command to parse nm output from /usr/bin/clang object... config.status: executing libtool commands
1576:info:build  bg da es fi fr ga id ja sv tr vi zh_CN zh_TW bg da es fi fr ga id ja sv tr vi zh_CN zh_TW
1577:info:build checking whether NLS is requested... yes
1578:info:build ok
1579:info:build checking for x86_64-apple-darwin14-dsymutil... no
1580:info:build checking for dsymutil... dsymutil
1581:info:build checking for x86_64-apple-darwin14-nmedit... no
1582:info:build checking for nmedit... nmedit
1583:info:build checking for x86_64-apple-darwin14-lipo... no
1584:info:build checking for lipo... lipo
1585:info:build checking for x86_64-apple-darwin14-otool... no
1586:info:build checking for otool... otool
1587:info:build checking for x86_64-apple-darwin14-otool64... no
1588:info:build checking for otool64... no
1589:info:build checking for -single_module linker flag... checking for msgfmt... config.status: executing default-1 commands
1590:info:build /opt/local/bin/msgfmt
1591:info:build checking for gmsgfmt... /opt/local/bin/msgfmt
1592:info:build checking for xgettext... /opt/local/bin/xgettext
1593:info:build config.status: creating po/POTFILES
1594:info:build config.status: creating po/Makefile
1595:info:build yes
1596:info:build checking for -exported_symbols_list linker flag... checking for msgmerge... /opt/local/bin/msgmerge
1597:info:build checking for bison... bison -y
1598:info:build checking for flex... flex
1599:info:build yes
1600:info:build checking for -force_load linker flag... checking lex output file root... lex.yy
1601:info:build checking lex library... if [ x"" != x ]; then \
1602:info:build       /usr/bin/clang -c -DHAVE_CONFIG_H -pipe -Os -I/opt/local/include -arch x86_64  -I. -I/opt/local/var/macports/build/_opt_local_var_macports_sources_rsync.macports.org_release_tarballs_ports_cross_i386-mingw32-binutils/i386-mingw32-binutils/work/binutils-2.21/libiberty/../include  -W -Wall -Wwrite-strings -Wc++-compat -Wstrict-prototypes -pedantic   /opt/local/var/macports/build/_opt_local_var_macports_sources_rsync.macports.org_release_tarballs_ports_cross_i386-mingw32-binutils/i386-mingw32-binutils/work/binutils-2.21/libiberty/cplus-dem.c -o pic/cplus-dem.o; \
1603:info:build     else true; fi
1604:info:build /usr/bin/clang -c -DHAVE_CONFIG_H -pipe -Os -I/opt/local/include -arch x86_64  -I. -I/opt/local/var/macports/build/_opt_local_var_macports_sources_rsync.macports.org_release_tarballs_ports_cross_i386-mingw32-binutils/i386-mingw32-binutils/work/binutils-2.21/libiberty/../include  -W -Wall -Wwrite-strings -Wc++-compat -Wstrict-prototypes -pedantic  /opt/local/var/macports/build/_opt_local_var_macports_sources_rsync.macports.org_release_tarballs_ports_cross_i386-mingw32-binutils/i386-mingw32-binutils/work/binutils-2.21/libiberty/cplus-dem.c -o cplus-dem.o
1605:info:build yes
1606:info:build checking for dlfcn.h... yes
1607:info:build checking for objdir... .libs
1608:info:build checking if /usr/bin/clang supports -fno-rtti -fno-exceptions... yes
1609:info:build checking for /usr/bin/clang option to produce PIC... -fno-common -DPIC
1610:info:build checking if /usr/bin/clang PIC flag -fno-common -DPIC works... yes
1611:info:build checking if /usr/bin/clang static flag -static works... -lfl
1612:info:build checking whether yytext is a pointer... no
1613:info:build checking if /usr/bin/clang supports -c -o file.o... yes
1614:info:build checking if /usr/bin/clang supports -c -o file.o... (cached) yes
1615:info:build checking whether the /usr/bin/clang linker (/Applications/Xcode.app/Contents/Developer/Toolchains/XcodeDefault.xctoolchain/usr/bin/ld) supports shared libraries... yes
1616:info:build checking dynamic linker characteristics... darwin14 dyld
1617:info:build checking how to hardcode library paths into programs... immediate
1618:info:build checking for dlopen in -ldl... yes
1619:info:build checking whether to enable maintainer-specific portions of Makefiles... no
1620:info:build checking how to compare bootstrapped objects... cmp --ignore-initial=16 $$f1 $$f2
1621:info:build mkdir ./opcodes
1622:info:build checking for string.h... (cached) yes
1623:info:build Configuring in ./opcodes
1624:info:build yes
1625:info:build checking whether a program can dlopen itself... checking for strings.h... (cached) yes
1626:info:build checking for stdlib.h... (cached) yes
1627:info:build checking for unistd.h... (cached) yes
1628:info:build yes
1629:info:build checking whether a statically linked program can dlopen itself... checking elf-hints.h usability... yes
1630:info:build checking whether stripping libraries is possible... yes
1631:info:build checking if libtool supports shared libraries... yes
1632:info:build checking whether to build shared libraries... no
1633:info:build checking whether to build static libraries... yes
1634:info:build checking for special C compiler options needed for large files... no
1635:info:build checking for _FILE_OFFSET_BITS value needed for large files... no
1636:info:build checking elf-hints.h presence... no
1637:info:build no
1638:info:build checking for elf-hints.h... no
1639:info:build checking limits.h usability... Setting warning flags = -W -Wall -Wstrict-prototypes -Wmissing-prototypes -Wshadow
1640:info:build checking whether to enable maintainer-specific portions of Makefiles... no
1641:info:build checking whether to install libbfd... no
1642:info:build checking whether NLS is requested... yes
1643:info:build checking for catalogs to be installed... yes
1644:info:build checking limits.h presence... yes
1645:info:build checking for limits.h... yes
1646:info:build checking sys/param.h usability... configure: creating cache ./config.cache
1647:info:build yes
1648:info:build checking sys/param.h presence... checking build system type... yes
1649:info:build checking for sys/param.h... yes
1650:info:build x86_64-apple-darwin14
1651:info:build checking host system type... checking fcntl.h usability... x86_64-apple-darwin14
1652:info:build checking target system type... i386-pc-mingw32
1653:info:build checking for x86_64-apple-darwin14-gcc... /usr/bin/clang
1654:info:build yes
1655:info:build checking fcntl.h presence... yes
1656:info:build checking for fcntl.h... yes
1657:info:build checking sys/file.h usability...  da es fi fr id ja ro ru rw sv tr vi zh_CN da es fi fr id ja ro ru rw sv tr vi zh_CN
1658:info:build checking whether NLS is requested... yes
1659:info:build checking for msgfmt... checking for C compiler default output file name... /opt/local/bin/msgfmt
1660:info:build checking for gmsgfmt... /opt/local/bin/msgfmt
1661:info:build checking for xgettext... /opt/local/bin/xgettext
1662:info:build yes
1663:info:build checking sys/file.h presence... checking for msgmerge... a.out
1664:info:build checking whether the C compiler works... yes
1665:info:build /opt/local/bin/msgmerge
1666:info:build checking whether we are cross compiling... no
1667:info:build checking for suffix of executables... yes
1668:info:build checking for sys/file.h... yes
1669:info:build checking sys/time.h usability... checking size of long long...
1670:info:build checking for suffix of object files... if [ x"" != x ]; then \
1671:info:build       /usr/bin/clang -c -DHAVE_CONFIG_H -pipe -Os -I/opt/local/include -arch x86_64  -I. -I/opt/local/var/macports/build/_opt_local_var_macports_sources_rsync.macports.org_release_tarballs_ports_cross_i386-mingw32-binutils/i386-mingw32-binutils/work/binutils-2.21/libiberty/../include  -W -Wall -Wwrite-strings -Wc++-compat -Wstrict-prototypes -pedantic   /opt/local/var/macports/build/_opt_local_var_macports_sources_rsync.macports.org_release_tarballs_ports_cross_i386-mingw32-binutils/i386-mingw32-binutils/work/binutils-2.21/libiberty/cp-demangle.c -o pic/cp-demangle.o; \
1672:info:build     else true; fi
1673:info:build /usr/bin/clang -c -DHAVE_CONFIG_H -pipe -Os -I/opt/local/include -arch x86_64  -I. -I/opt/local/var/macports/build/_opt_local_var_macports_sources_rsync.macports.org_release_tarballs_ports_cross_i386-mingw32-binutils/i386-mingw32-binutils/work/binutils-2.21/libiberty/../include  -W -Wall -Wwrite-strings -Wc++-compat -Wstrict-prototypes -pedantic  /opt/local/var/macports/build/_opt_local_var_macports_sources_rsync.macports.org_release_tarballs_ports_cross_i386-mingw32-binutils/i386-mingw32-binutils/work/binutils-2.21/libiberty/cp-demangle.c -o cp-demangle.o
1674:info:build o
1675:info:build checking whether we are using the GNU C compiler... yes
1676:info:build checking sys/time.h presence... In file included from /opt/local/var/macports/build/_opt_local_var_macports_sources_rsync.macports.org_release_tarballs_ports_cross_i386-mingw32-binutils/i386-mingw32-binutils/work/binutils-2.21/libiberty/cp-demangle.c:128:
1677:info:build /opt/local/var/macports/build/_opt_local_var_macports_sources_rsync.macports.org_release_tarballs_ports_cross_i386-mingw32-binutils/i386-mingw32-binutils/work/binutils-2.21/libiberty/../include/libiberty.h:88:23: error: expected ';' after top level declarator
1678:info:build extern void expandargv PARAMS ((int *, char ***));
1679:info:build                       ^
1680:info:build                       ;
1681:info:build /opt/local/var/macports/build/_opt_local_var_macports_sources_rsync.macports.org_release_tarballs_ports_cross_i386-mingw32-binutils/i386-mingw32-binutils/work/binutils-2.21/libiberty/../include/libiberty.h:92:21: error: expected ';' after top level declarator
1682:info:build extern int writeargv PARAMS ((char **, FILE *));
1683:info:build                     ^
1684:info:build                     ;
1685:info:build 2 errors generated.
1686:info:build make[2]: *** [cp-demangle.o] Error 1
1687:info:build make[2]: Leaving directory `/opt/local/var/macports/build/_opt_local_var_macports_sources_rsync.macports.org_release_tarballs_ports_cross_i386-mingw32-binutils/i386-mingw32-binutils/work/build/libiberty'
1688:info:build yes
1689:info:build checking for sys/time.h... yes
1690:info:build make[1]: *** [all-libiberty] Error 2
1691:info:build make[1]: *** Waiting for unfinished jobs....
1692:info:build yes
1693:info:build checking whether /usr/bin/clang accepts -g... 8
1694:info:build checking for sys/stat.h... (cached) yes
1695:info:build checking size of void *... checking for glob... yes
1696:info:build checking for /usr/bin/clang option to accept ISO C89... yes
1697:info:build none needed
1698:info:build checking for library containing strerror... 8
1699:info:build checking size of long... checking for mkstemp... yes
1700:info:build none required
1701:info:build checking for a BSD-compatible install... /usr/bin/install -c
1702:info:build checking whether build environment is sane... checking for realpath... 8
1703:info:build checking alloca.h usability... yes
1704:info:build yes
1705:info:build checking alloca.h presence... checking for sbrk... yes
1706:info:build checking for alloca.h... yes
1707:info:build checking stddef.h usability... yes
1708:info:build yes
1709:info:build checking stddef.h presence... checking for waitpid... yes
1710:info:build checking for stddef.h... yes
1711:info:build checking for string.h... (cached) yes
1712:info:build checking for strings.h... (cached) yes
1713:info:build yes
1714:info:build checking for stdlib.h... (cached) yes
1715:info:build checking for open... checking time.h usability... yes
1716:info:build yes
1717:info:build checking time.h presence... checking for lseek... yes
1718:info:build checking for time.h... yes
1719:info:build checking for unistd.h... (cached) yes
1720:info:build checking fcntl.h usability... yes
1721:info:build checking for close... yes
1722:info:build checking fcntl.h presence... yes
1723:info:build checking for fcntl.h... yes
1724:info:build yes
1725:info:build checking sys/file.h usability... checking for dirent.h that defines DIR... yes
1726:info:build yes
1727:info:build checking sys/file.h presence... checking for library containing opendir... yes
1728:info:build checking for sys/file.h... yes
1729:info:build checking sys/time.h usability... none required
1730:info:build checking for dlfcn.h... (cached) yes
1731:info:build checking for library containing dlopen... yes
1732:info:build checking sys/time.h presence... none required
1733:info:build yes
1734:info:build checking for sys/time.h... yes
1735:info:build checking for dlopen... checking for sys/stat.h... (cached) yes
1736:info:build looking for a compliant stdint.h in stdint.h, checking for uintmax_t... yes
1737:info:build checking for dlsym... yes
1738:info:build checking for uintptr_t... yes
1739:info:build yes
1740:info:build checking for dlclose... checking for a thread-safe mkdir -p... /opt/local/bin/gmkdir -p
1741:info:build checking for gawk... gawk
1742:info:build checking whether /Applications/Xcode.app/Contents/Developer/usr/bin/make sets $(MAKE)... yes
1743:info:build checking for style of include used by /Applications/Xcode.app/Contents/Developer/usr/bin/make... yes
1744:info:build yes
1745:info:build checking for int_least32_t... GNU
1746:info:build checking for a known getopt prototype in unistd.h... checking dependency style of /usr/bin/clang... yes
1747:info:build checking whether strstr is declared... yes
1748:info:build checking for int_fast32_t... yes
1749:info:build checking whether free is declared... gcc3
1750:info:build checking for x86_64-apple-darwin14-gcc... (cached) /usr/bin/clang
1751:info:build yes
1752:info:build yes
1753:info:build checking for uint64_t... checking whether sbrk is declared... checking whether we are using the GNU C compiler... (cached) yes
1754:info:build checking whether /usr/bin/clang accepts -g... (cached) yes
1755:info:build checking for /usr/bin/clang option to accept ISO C89... (cached) none needed
1756:info:build checking how to run the C preprocessor... yes
1757:info:build checking whether getenv is declared... yes
1758:info:build checking what to include in bfd_stdint.h... stdint.h (already complete)
1759:info:build checking whether time.h and sys/time.h may both be included... /usr/bin/clang -E
1760:info:build yes
1761:info:build yes
1762:info:build checking for dirent.h that defines DIR... checking whether environ is declared... checking for grep that handles long lines and -e... yes
1763:info:build /opt/local/bin/grep
1764:info:build checking for egrep... /opt/local/bin/grep -E
1765:info:build checking for ANSI C header files... checking for library containing opendir... no
1766:info:build checking for library containing zlibVersion... none required
1767:info:build checking whether string.h and strings.h may both be included... yes
1768:info:build checking for fcntl... -lz
1769:info:build checking zlib.h usability... yes
1770:info:build yes
1771:info:build checking for sys/types.h... checking for getpagesize... yes
1772:info:build checking zlib.h presence... yes
1773:info:build yes
1774:info:build checking for zlib.h... yes
1775:info:build checking whether ANSI C string concatenation works... yes
1776:info:build checking for sys/stat.h... checking for setitimer... yes
1777:info:build yes
1778:info:build checking for stdlib.h... yes
1779:info:build checking for sysconf... yes
1780:info:build checking for string.h... configure: updating cache ./config.cache
1781:info:build configure: creating ./config.status
1782:info:build yes
1783:info:build yes
1784:info:build checking for fdopen... checking for memory.h... yes
1785:info:build yes
1786:info:build checking for strings.h... checking for getuid... yes
1787:info:build yes
1788:info:build checking for inttypes.h... checking for getgid... yes
1789:info:build checking for stdint.h... yes
1790:info:build checking for fileno... yes
1791:info:build checking for unistd.h... yes
1792:info:build checking for strtoull... yes
1793:info:build checking minix/config.h usability... yes
1794:info:build checking whether basename is declared... no
1795:info:build checking minix/config.h presence... no
1796:info:build checking for minix/config.h... no
1797:info:build checking whether it is safe to define __EXTENSIONS__... no
1798:info:build checking whether ftello is declared... yes
1799:info:build checking for x86_64-apple-darwin14-ar... ar
1800:info:build checking for x86_64-apple-darwin14-ranlib... ranlib
1801:info:build checking how to print strings... printf
1802:info:build checking for a sed that does not truncate output... /opt/local/bin/gsed
1803:info:build checking for fgrep... /opt/local/bin/grep -F
1804:info:build checking for ld used by /usr/bin/clang... yes
1805:info:build checking whether ftello64 is declared... /Applications/Xcode.app/Contents/Developer/Toolchains/XcodeDefault.xctoolchain/usr/bin/ld
1806:info:build checking if the linker (/Applications/Xcode.app/Contents/Developer/Toolchains/XcodeDefault.xctoolchain/usr/bin/ld) is GNU ld... no
1807:info:build checking for BSD- or MS-compatible name lister (nm)... nm
1808:info:build checking the name lister (nm) interface... no
1809:info:build BSD nm
1810:info:build checking whether ln -s works... yes
1811:info:build checking the maximum length of command line arguments... checking whether fseeko is declared... 196608
1812:info:build checking whether the shell understands some XSI constructs... yes
1813:info:build checking whether the shell understands "+="... yes
1814:info:build checking for /Applications/Xcode.app/Contents/Developer/Toolchains/XcodeDefault.xctoolchain/usr/bin/ld option to reload object files... -r
1815:info:build checking for x86_64-apple-darwin14-objdump... objdump
1816:info:build checking how to recognize dependent libraries... pass_all
1817:info:build checking for x86_64-apple-darwin14-ar... (cached) ar
1818:info:build checking for x86_64-apple-darwin14-strip... no
1819:info:build checking for strip... strip
1820:info:build checking for x86_64-apple-darwin14-ranlib... (cached) ranlib
1821:info:build checking command to parse nm output from /usr/bin/clang object... yes
1822:info:build checking whether fseeko64 is declared... no
1823:info:build checking whether ffs is declared... yes
1824:info:build checking whether free is declared... ok
1825:info:build checking for x86_64-apple-darwin14-dsymutil... no
1826:info:build checking for dsymutil... dsymutil
1827:info:build checking for x86_64-apple-darwin14-nmedit... no
1828:info:build checking for nmedit... nmedit
1829:info:build checking for x86_64-apple-darwin14-lipo... no
1830:info:build checking for lipo... lipo
1831:info:build checking for x86_64-apple-darwin14-otool... no
1832:info:build checking for otool... otool
1833:info:build checking for x86_64-apple-darwin14-otool64... no
1834:info:build checking for otool64... no
1835:info:build checking for -single_module linker flag... yes
1836:info:build yes
1837:info:build checking for -exported_symbols_list linker flag... checking whether getenv is declared... yes
1838:info:build yes
1839:info:build checking for -force_load linker flag... checking whether malloc is declared... yes
1840:info:build checking whether realloc is declared... yes
1841:info:build checking for dlfcn.h... yes
1842:info:build checking whether stpcpy is declared... yes
1843:info:build checking for objdir... .libs
1844:info:build yes
1845:info:build checking whether strstr is declared... checking if /usr/bin/clang supports -fno-rtti -fno-exceptions... yes
1846:info:build checking whether snprintf is declared... yes
1847:info:build checking for /usr/bin/clang option to produce PIC... -fno-common -DPIC
1848:info:build checking if /usr/bin/clang PIC flag -fno-common -DPIC works... yes
1849:info:build checking whether vsnprintf is declared... yes
1850:info:build checking if /usr/bin/clang static flag -static works... yes
1851:info:build no
1852:info:build checking if /usr/bin/clang supports -c -o file.o... checking for library containing zlibVersion... yes
1853:info:build checking if /usr/bin/clang supports -c -o file.o... (cached) yes
1854:info:build checking whether the /usr/bin/clang linker (/Applications/Xcode.app/Contents/Developer/Toolchains/XcodeDefault.xctoolchain/usr/bin/ld) supports shared libraries... yes
1855:info:build checking dynamic linker characteristics... darwin14 dyld
1856:info:build checking how to hardcode library paths into programs... immediate
1857:info:build checking whether stripping libraries is possible... yes
1858:info:build checking if libtool supports shared libraries... yes
1859:info:build checking whether to build shared libraries... no
1860:info:build checking whether to build static libraries... yes
1861:info:build -lz
1862:info:build checking zlib.h usability... Setting warning flags = -W -Wall -Wstrict-prototypes -Wmissing-prototypes -Wshadow
1863:info:build checking whether to enable maintainer-specific portions of Makefiles... no
1864:info:build checking whether to install libbfd... no
1865:info:build checking whether NLS is requested... yes
1866:info:build checking for catalogs to be installed... yes
1867:info:build checking zlib.h presence... yes
1868:info:build checking for zlib.h... yes
1869:info:build checking linker --as-needed support... no
1870:info:build checking for gcc version with buggy 64-bit support... no
1871:info:build checking for ftello... config.status: creating Makefile
1872:info:build config.status: creating po/Makefile.in
1873:info:build yes
1874:info:build checking for ftello64... config.status: creating config.h
1875:info:build  da de es fi fr ga id nl pt_BR ro sv tr vi zh_CN da de es fi fr ga id nl pt_BR ro sv tr vi zh_CN
1876:info:build checking whether NLS is requested... yes
1877:info:build config.status: executing depfiles commands
1878:info:build no
1879:info:build checking for msgfmt... checking for fseeko... /opt/local/bin/msgfmt
1880:info:build checking for gmsgfmt... /opt/local/bin/msgfmt
1881:info:build checking for xgettext... /opt/local/bin/xgettext
1882:info:build checking for msgmerge... /opt/local/bin/msgmerge
1883:info:build yes
1884:info:build checking for fseeko64... checking for string.h... (cached) yes
1885:info:build checking for strings.h... (cached) yes
1886:info:build checking for stdlib.h... (cached) yes
1887:info:build no
1888:info:build checking limits.h usability... checking for fopen64... yes
1889:info:build checking limits.h presence... no
1890:info:build checking size of off_t... yes
1891:info:build checking for limits.h... yes
1892:info:build checking whether basename is declared... 8
1893:info:build checking file_ptr type... BFD_HOST_64_BIT
1894:info:build checking for stdlib.h... (cached) no
1895:info:build yes
1896:info:build checking whether stpcpy is declared... checking for unistd.h... (cached) yes
1897:info:build checking for getpagesize... (cached) yes
1898:info:build checking for working mmap... yes
1899:info:build checking linker --as-needed support... no
1900:info:build yes
1901:info:build checking for madvise... configure: updating cache ./config.cache
1902:info:build configure: creating ./config.status
1903:info:build yes
1904:info:build checking for mprotect... yes
1905:info:build configure: updating cache ./config.cache
1906:info:build configure: creating ./config.status
1907:info:build config.status: executing libtool commands
1908:info:build config.status: creating Makefile
1909:info:build config.status: executing default-1 commands
1910:info:build config.status: creating po/Makefile.in
1911:info:build config.status: creating po/POTFILES
1912:info:build config.status: creating po/Makefile
1913:info:build config.status: creating config.h
1914:info:build config.status: executing depfiles commands
1915:info:build config.status: creating Makefile
1916:info:build config.status: creating doc/Makefile
1917:info:build config.status: creating bfd-in3.h
1918:info:build config.status: creating po/Makefile.in
1919:info:build config.status: creating config.h
1920:info:build config.status: executing depfiles commands
1921:info:build config.status: executing libtool commands
1922:info:build config.status: executing default-1 commands
1923:info:build config.status: creating po/POTFILES
1924:info:build config.status: creating po/Makefile
1925:info:build config.status: executing libtool commands
1926:info:build config.status: executing default-1 commands
1927:info:build config.status: executing bfd_stdint.h commands
1928:info:build config.status: executing default commands
1929:info:build make[1]: Leaving directory `/opt/local/var/macports/build/_opt_local_var_macports_sources_rsync.macports.org_release_tarballs_ports_cross_i386-mingw32-binutils/i386-mingw32-binutils/work/build'
1930:info:build make: *** [all] Error 2
1931:info:build make: Leaving directory `/opt/local/var/macports/build/_opt_local_var_macports_sources_rsync.macports.org_release_tarballs_ports_cross_i386-mingw32-binutils/i386-mingw32-binutils/work/build'
1932:info:build Command failed:  cd "/opt/local/var/macports/build/_opt_local_var_macports_sources_rsync.macports.org_release_tarballs_ports_cross_i386-mingw32-binutils/i386-mingw32-binutils/work/build" && /usr/bin/make -j4 -w all
1933:info:build Exit code: 2
1934:error:build org.macports.build for port i386-mingw32-binutils returned: command execution failed
1935:debug:build Error code: CHILDSTATUS 48303 2
1936:debug:build Backtrace: command execution failed
1937    while executing
1938"system -nice 0 $fullcmdstring"
1939    ("eval" body line 1)
1940    invoked from within
1941"eval system $notty $nice \$fullcmdstring"
1942    invoked from within
1943"command_exec build"
1944    (procedure "portbuild::build_main" line 8)
1945    invoked from within
1946"portbuild::build_main org.macports.build"
1947    ("eval" body line 1)
1948    invoked from within
1949"eval $procedure $targetname"
1950:info:build Warning: targets not executed for i386-mingw32-binutils: org.macports.activate org.macports.build org.macports.destroot org.macports.install
1951:notice:build Please see the log file for port i386-mingw32-binutils for details:
1952    /opt/local/var/macports/logs/_opt_local_var_macports_sources_rsync.macports.org_release_tarballs_ports_cross_i386-mingw32-binutils/i386-mingw32-binutils/main.log