Ticket #55785: main.log

File main.log, 49.1 KB (added by tehcog (tehcog), 3 years ago)

main.log

Line 
1version:1
2:debug:main Executing org.macports.main (qpdf)
3:debug:main dropping privileges: euid changed to 502, egid changed to 501.
4:debug:fetch fetch phase started at Sat Feb  3 19:05:50 EST 2018
5:notice:fetch --->  Fetching distfiles for qpdf
6:debug:fetch Executing org.macports.fetch (qpdf)
7version:1
8:msg:main --->  Computing dependencies for qpdf:info:main .:debug:main qpdf has no conflicts
9:debug:main Searching for dependency: jpeg
10:debug:main Found Dependency: receipt exists for jpeg
11:debug:main Searching for dependency: zlib
12:debug:main Found Dependency: receipt exists for zlib
13:debug:main Executing org.macports.main (qpdf)
14:debug:main dropping privileges: euid changed to 502, egid changed to 501.
15:debug:archivefetch archivefetch phase started at Sat Feb  3 19:05:51 EST 2018
16:msg:archivefetch --->  Fetching archive for qpdf
17:debug:archivefetch Executing org.macports.archivefetch (qpdf)
18:debug:archivefetch euid/egid changed to: 0/0
19:debug:archivefetch chowned /opt/local/var/macports/incoming to macports
20:debug:archivefetch euid/egid changed to: 502/501
21:info:archivefetch --->  qpdf-7.1.0_0.darwin_13.x86_64.tbz2 doesn't seem to exist in /opt/local/var/macports/incoming/verified
22:msg:archivefetch --->  Attempting to fetch qpdf-7.1.0_0.darwin_13.x86_64.tbz2 from https://packages.macports.org/qpdf
23:debug:archivefetch Fetching archive failed: The requested URL returned error: 404 Not Found
24:msg:archivefetch --->  Attempting to fetch qpdf-7.1.0_0.darwin_13.x86_64.tbz2 from http://ywg.ca.packages.macports.org/mirror/macports/packages/qpdf
25:debug:archivefetch Fetching archive failed: The requested URL returned error: 404 Not Found
26:msg:archivefetch --->  Attempting to fetch qpdf-7.1.0_0.darwin_13.x86_64.tbz2 from http://sea.us.packages.macports.org/macports/packages/qpdf
27:debug:archivefetch Fetching archive failed: The requested URL returned error: 404 Not Found
28:debug:archivefetch Privilege de-escalation not attempted as not running as root.
29:debug:archivefetch Skipping completed org.macports.fetch (qpdf)
30:debug:archivefetch Privilege de-escalation not attempted as not running as root.
31:debug:checksum checksum phase started at Sat Feb  3 19:05:52 EST 2018
32:notice:checksum --->  Verifying checksums for qpdf
33:debug:checksum Executing org.macports.checksum (qpdf)
34:info:checksum --->  Checksumming qpdf-7.1.0.tar.gz
35:debug:checksum Calculated (rmd160) is 5f4aa26e31a323290d6bba8744214446f015a390
36:debug:checksum Correct (rmd160) checksum for qpdf-7.1.0.tar.gz
37:debug:checksum Calculated (sha256) is 27054bfb83a4f4f70053c6d4c2de5e18ddf60c9a8edbce219ac1bdcf03f16a2e
38:debug:checksum Correct (sha256) checksum for qpdf-7.1.0.tar.gz
39:debug:checksum Calculated (size) is 7097479
40:debug:checksum Correct (size) checksum for qpdf-7.1.0.tar.gz
41:debug:checksum Privilege de-escalation not attempted as not running as root.
42:debug:extract extract phase started at Sat Feb  3 19:05:52 EST 2018
43:notice:extract --->  Extracting qpdf
44:debug:extract Executing org.macports.extract (qpdf)
45:info:extract --->  Extracting qpdf-7.1.0.tar.gz
46:debug:extract setting option extract.args to '/opt/local/var/macports/distfiles/qpdf/qpdf-7.1.0.tar.gz'
47:debug:extract Environment:
48:debug:extract CC_PRINT_OPTIONS='YES'
49:debug:extract CC_PRINT_OPTIONS_FILE='/opt/local/var/macports/build/_opt_local_var_macports_sources_rsync.macports.org_release_tarballs_ports_textproc_qpdf/qpdf/work/.CC_PRINT_OPTIONS'
50:debug:extract CPATH='/opt/local/include'
51:debug:extract LIBRARY_PATH='/opt/local/lib'
52:debug:extract MACOSX_DEPLOYMENT_TARGET='10.9'
53:info:extract Executing:  cd "/opt/local/var/macports/build/_opt_local_var_macports_sources_rsync.macports.org_release_tarballs_ports_textproc_qpdf/qpdf/work" && /usr/bin/gzip -dc '/opt/local/var/macports/distfiles/qpdf/qpdf-7.1.0.tar.gz' | /usr/bin/tar -xf -
54:debug:extract system:  cd "/opt/local/var/macports/build/_opt_local_var_macports_sources_rsync.macports.org_release_tarballs_ports_textproc_qpdf/qpdf/work" && /usr/bin/gzip -dc '/opt/local/var/macports/distfiles/qpdf/qpdf-7.1.0.tar.gz' | /usr/bin/tar -xf -
55:debug:extract euid/egid changed to: 0/0
56:debug:extract chowned /opt/local/var/macports/build/_opt_local_var_macports_sources_rsync.macports.org_release_tarballs_ports_textproc_qpdf/qpdf/work to macports
57:debug:extract euid/egid changed to: 502/501
58:debug:extract Privilege de-escalation not attempted as not running as root.
59:debug:patch patch phase started at Sat Feb  3 19:05:53 EST 2018
60:debug:patch Executing org.macports.patch (qpdf)
61:debug:patch Privilege de-escalation not attempted as not running as root.
62:debug:configure configure phase started at Sat Feb  3 19:05:53 EST 2018
63:notice:configure --->  Configuring qpdf
64:debug:configure Preferred compilers: clang macports-clang-4.0 macports-clang-3.9 macports-clang-3.8 macports-clang-3.7 macports-clang-3.4 macports-llvm-gcc-4.2 apple-gcc-4.2
65:debug:configure Using compiler 'Xcode Clang'
66:debug:configure Executing org.macports.configure (qpdf)
67:debug:configure Environment:
68:debug:configure CC='/usr/bin/clang'
69:debug:configure CC_PRINT_OPTIONS='YES'
70:debug:configure CC_PRINT_OPTIONS_FILE='/opt/local/var/macports/build/_opt_local_var_macports_sources_rsync.macports.org_release_tarballs_ports_textproc_qpdf/qpdf/work/.CC_PRINT_OPTIONS'
71:debug:configure CFLAGS='-pipe -Os -arch x86_64'
72:debug:configure CPATH='/opt/local/include'
73:debug:configure CPPFLAGS='-I/opt/local/include'
74:debug:configure CXX='/usr/bin/clang++'
75:debug:configure CXXFLAGS='-pipe -Os -stdlib=libc++ -arch x86_64'
76:debug:configure F77FLAGS='-m64'
77:debug:configure F90FLAGS='-pipe -Os -m64'
78:debug:configure FCFLAGS='-pipe -Os -m64'
79:debug:configure FFLAGS='-pipe -Os'
80:debug:configure INSTALL='/usr/bin/install -c'
81:debug:configure LDFLAGS='-L/opt/local/lib -Wl,-headerpad_max_install_names -arch x86_64'
82:debug:configure LIBRARY_PATH='/opt/local/lib'
83:debug:configure MACOSX_DEPLOYMENT_TARGET='10.9'
84:debug:configure OBJC='/usr/bin/clang'
85:debug:configure OBJCFLAGS='-pipe -Os -arch x86_64'
86:debug:configure OBJCXX='/usr/bin/clang++'
87:debug:configure OBJCXXFLAGS='-pipe -Os -stdlib=libc++ -arch x86_64'
88:info:configure Executing:  cd "/opt/local/var/macports/build/_opt_local_var_macports_sources_rsync.macports.org_release_tarballs_ports_textproc_qpdf/qpdf/work/qpdf-7.1.0" && ./configure --prefix=/opt/local
89:debug:configure system:  cd "/opt/local/var/macports/build/_opt_local_var_macports_sources_rsync.macports.org_release_tarballs_ports_textproc_qpdf/qpdf/work/qpdf-7.1.0" && ./configure --prefix=/opt/local
90:info:configure checking for gcc... /usr/bin/clang
91:info:configure checking whether the C compiler works... yes
92:info:configure checking for C compiler default output file name... a.out
93:info:configure checking for suffix of executables...
94:info:configure checking whether we are cross compiling... no
95:info:configure checking for suffix of object files... o
96:info:configure checking whether we are using the GNU C compiler... yes
97:info:configure checking whether /usr/bin/clang accepts -g... yes
98:info:configure checking for /usr/bin/clang option to accept ISO C89... none needed
99:info:configure checking for /usr/bin/clang option to accept ISO C99... none needed
100:info:configure checking whether we are using the GNU C++ compiler... yes
101:info:configure checking whether /usr/bin/clang++ accepts -g... yes
102:info:configure checking how to run the C preprocessor... /usr/bin/clang -E
103:info:configure checking for grep that handles long lines and -e... /opt/local/bin/grep
104:info:configure checking for egrep... /opt/local/bin/grep -E
105:info:configure checking for ANSI C header files... yes
106:info:configure checking build system type... x86_64-apple-darwin13.4.0
107:info:configure checking host system type... x86_64-apple-darwin13.4.0
108:info:configure checking how to print strings... printf
109:info:configure checking for a sed that does not truncate output... /opt/local/bin/gsed
110:info:configure checking for fgrep... /opt/local/bin/grep -F
111:info:configure checking for ld used by /usr/bin/clang... /Applications/Utilities/Xcode.app/Contents/Developer/Toolchains/XcodeDefault.xctoolchain/usr/bin/ld
112:info:configure checking if the linker (/Applications/Utilities/Xcode.app/Contents/Developer/Toolchains/XcodeDefault.xctoolchain/usr/bin/ld) is GNU ld... no
113:info:configure checking for BSD- or MS-compatible name lister (nm)... /opt/local/bin/nm -B
114:info:configure checking the name lister (/opt/local/bin/nm -B) interface... BSD nm
115:info:configure checking whether ln -s works... yes
116:info:configure checking the maximum length of command line arguments... 196608
117:info:configure checking how to convert x86_64-apple-darwin13.4.0 file names to x86_64-apple-darwin13.4.0 format... func_convert_file_noop
118:info:configure checking how to convert x86_64-apple-darwin13.4.0 file names to toolchain format... func_convert_file_noop
119:info:configure checking for /Applications/Utilities/Xcode.app/Contents/Developer/Toolchains/XcodeDefault.xctoolchain/usr/bin/ld option to reload object files... -r
120:info:configure checking for objdump... no
121:info:configure checking how to recognize dependent libraries... pass_all
122:info:configure checking for dlltool... no
123:info:configure checking how to associate runtime and link libraries... printf %s\n
124:info:configure checking for ar... ar
125:info:configure checking for archiver @FILE support... no
126:info:configure checking for strip... strip
127:info:configure checking for ranlib... ranlib
128:info:configure checking for gawk... gawk
129:info:configure checking command to parse /opt/local/bin/nm -B output from /usr/bin/clang object... ok
130:info:configure checking for sysroot... no
131:info:configure checking for a working dd... /bin/dd
132:info:configure checking how to truncate binary pipes... /bin/dd bs=4096 count=1
133:info:configure checking for mt... no
134:info:configure checking if : is a manifest tool... no
135:info:configure checking for dsymutil... dsymutil
136:info:configure checking for nmedit... nmedit
137:info:configure checking for lipo... lipo
138:info:configure checking for otool... otool
139:info:configure checking for otool64... no
140:info:configure checking for -single_module linker flag... yes
141:info:configure checking for -exported_symbols_list linker flag... yes
142:info:configure checking for -force_load linker flag... yes
143:info:configure checking for sys/types.h... yes
144:info:configure checking for sys/stat.h... yes
145:info:configure checking for stdlib.h... yes
146:info:configure checking for string.h... yes
147:info:configure checking for memory.h... yes
148:info:configure checking for strings.h... yes
149:info:configure checking for inttypes.h... yes
150:info:configure checking for stdint.h... yes
151:info:configure checking for unistd.h... yes
152:info:configure checking for dlfcn.h... yes
153:info:configure checking for objdir... .libs
154:info:configure checking if /usr/bin/clang supports -fno-rtti -fno-exceptions... yes
155:info:configure checking for /usr/bin/clang option to produce PIC... -fno-common -DPIC
156:info:configure checking if /usr/bin/clang PIC flag -fno-common -DPIC works... yes
157:info:configure checking if /usr/bin/clang static flag -static works... no
158:info:configure checking if /usr/bin/clang supports -c -o file.o... yes
159:info:configure checking if /usr/bin/clang supports -c -o file.o... (cached) yes
160:info:configure checking whether the /usr/bin/clang linker (/Applications/Utilities/Xcode.app/Contents/Developer/Toolchains/XcodeDefault.xctoolchain/usr/bin/ld) supports shared libraries... yes
161:info:configure checking dynamic linker characteristics... darwin13.4.0 dyld
162:info:configure checking how to hardcode library paths into programs... immediate
163:info:configure checking whether stripping libraries is possible... yes
164:info:configure checking if libtool supports shared libraries... yes
165:info:configure checking whether to build shared libraries... yes
166:info:configure checking whether to build static libraries... yes
167:info:configure checking how to run the C++ preprocessor... /usr/bin/clang++ -E
168:info:configure checking for ld used by /usr/bin/clang++... /Applications/Utilities/Xcode.app/Contents/Developer/Toolchains/XcodeDefault.xctoolchain/usr/bin/ld
169:info:configure checking if the linker (/Applications/Utilities/Xcode.app/Contents/Developer/Toolchains/XcodeDefault.xctoolchain/usr/bin/ld) is GNU ld... no
170:info:configure checking whether the /usr/bin/clang++ linker (/Applications/Utilities/Xcode.app/Contents/Developer/Toolchains/XcodeDefault.xctoolchain/usr/bin/ld) supports shared libraries... yes
171:info:configure checking for /usr/bin/clang++ option to produce PIC... -fno-common -DPIC
172:info:configure checking if /usr/bin/clang++ PIC flag -fno-common -DPIC works... yes
173:info:configure checking if /usr/bin/clang++ static flag -static works... no
174:info:configure checking if /usr/bin/clang++ supports -c -o file.o... yes
175:info:configure checking if /usr/bin/clang++ supports -c -o file.o... (cached) yes
176:info:configure checking whether the /usr/bin/clang++ linker (/Applications/Utilities/Xcode.app/Contents/Developer/Toolchains/XcodeDefault.xctoolchain/usr/bin/ld) supports shared libraries... yes
177:info:configure checking dynamic linker characteristics... darwin13.4.0 dyld
178:info:configure checking how to hardcode library paths into programs... immediate
179:info:configure no
180:info:configure yes
181:info:configure checking for "/dev/urandom"... yes
182:info:configure checking for whether to use external libraries distribution... no
183:info:configure checking zlib.h usability... yes
184:info:configure checking zlib.h presence... yes
185:info:configure checking for zlib.h... yes
186:info:configure checking for library containing deflate... -lz
187:info:configure checking jpeglib.h usability... yes
188:info:configure checking jpeglib.h presence... yes
189:info:configure checking for jpeglib.h... yes
190:info:configure checking for library containing jpeg_destroy... -ljpeg
191:info:configure checking for Advapi32 library... no
192:info:configure checking for special C compiler options needed for large files... no
193:info:configure checking for _FILE_OFFSET_BITS value needed for large files... no
194:info:configure checking for _LARGEFILE_SOURCE value needed for large files... no
195:info:configure checking for fseeko64... no
196:info:configure checking for uint16_t... yes
197:info:configure checking for uint32_t... yes
198:info:configure checking for random... yes
199:info:configure checking if LD -Wl,--version-script works... no
200:info:configure checking for gnu make >= 3.81 (make)... yes
201:info:configure checking for gnu make >= 3.81 (gmake)... yes
202:info:configure checking for whether /usr/bin/clang supports -MD -MF x.dep -MP... yes
203:info:configure checking which build rules to use... libtool
204:info:configure checking for whether /usr/bin/clang supports -Wall... yes
205:info:configure checking for whether /usr/bin/clang++ supports -Wold-style-cast... yes
206:info:configure checking for whether to use -Werror... no
207:info:configure checking for xml to xhtml docbook stylesheets... no
208:info:configure checking for xml to fo docbook stylesheets... no
209:info:configure checking for docbook 4.x xml DTD... no
210:info:configure checking for fop... fop
211:info:configure checking for xsltproc... xsltproc
212:info:configure checking for xmllint... xmllint
213:info:configure configure: creating ./config.status
214:info:configure config.status: creating autoconf.mk
215:info:configure config.status: creating manual/html.xsl
216:info:configure config.status: creating manual/print.xsl
217:info:configure config.status: creating libqpdf.pc
218:info:configure config.status: creating libqpdf.map
219:info:configure config.status: creating libqpdf/qpdf/qpdf-config.h
220:info:configure config.status: executing libtool commands
221:debug:configure Privilege de-escalation not attempted as not running as root.
222:debug:build build phase started at Sat Feb  3 19:05:58 EST 2018
223:notice:build --->  Building qpdf
224:debug:build Executing org.macports.build (qpdf)
225:debug:build Environment:
226:debug:build CC_PRINT_OPTIONS='YES'
227:debug:build CC_PRINT_OPTIONS_FILE='/opt/local/var/macports/build/_opt_local_var_macports_sources_rsync.macports.org_release_tarballs_ports_textproc_qpdf/qpdf/work/.CC_PRINT_OPTIONS'
228:debug:build CPATH='/opt/local/include'
229:debug:build LIBRARY_PATH='/opt/local/lib'
230:debug:build MACOSX_DEPLOYMENT_TARGET='10.9'
231:info:build Executing:  cd "/opt/local/var/macports/build/_opt_local_var_macports_sources_rsync.macports.org_release_tarballs_ports_textproc_qpdf/qpdf/work/qpdf-7.1.0" && /usr/bin/make -j8 -w all
232:debug:build system:  cd "/opt/local/var/macports/build/_opt_local_var_macports_sources_rsync.macports.org_release_tarballs_ports_textproc_qpdf/qpdf/work/qpdf-7.1.0" && /usr/bin/make -j8 -w all
233:info:build make: Entering directory `/opt/local/var/macports/build/_opt_local_var_macports_sources_rsync.macports.org_release_tarballs_ports_textproc_qpdf/qpdf/work/qpdf-7.1.0'
234:info:build sed -e 's:@PACKAGE_VERSION@:7.1.0:g' \
235:info:build         -e 's:@docdir@:/opt/local/share/doc/qpdf:g' \
236:info:build         < manual/qpdf.1.in > doc/qpdf.1
237:info:build sed -e 's:@PACKAGE_VERSION@:7.1.0:g' \
238:info:build         -e 's:@docdir@:/opt/local/share/doc/qpdf:g' \
239:info:build         < manual/fix-qdf.1.in > doc/fix-qdf.1
240:info:build sed -e 's:@PACKAGE_VERSION@:7.1.0:g' \
241:info:build         -e 's:@docdir@:/opt/local/share/doc/qpdf:g' \
242:info:build         < manual/zlib-flate.1.in > doc/zlib-flate.1
243:info:build /bin/bash ./libtool --quiet --mode=compile /usr/bin/clang++ -pipe -Os -stdlib=libc++ -arch x86_64 -Wold-style-cast -Wall -MD -MF libqpdf/build/BitStream.tdep -MP -Iinclude -Ilibqpdf -I/opt/local/include -c libqpdf/BitStream.cc -o libqpdf/build/BitStream.o; sed -e 's/\.o:/.lo:/' < libqpdf/build/BitStream.tdep > libqpdf/build/BitStream.dep
244:info:build /bin/bash ./libtool --quiet --mode=compile /usr/bin/clang++ -pipe -Os -stdlib=libc++ -arch x86_64 -Wold-style-cast -Wall -MD -MF libqpdf/build/BitWriter.tdep -MP -Iinclude -Ilibqpdf -I/opt/local/include -c libqpdf/BitWriter.cc -o libqpdf/build/BitWriter.o; sed -e 's/\.o:/.lo:/' < libqpdf/build/BitWriter.tdep > libqpdf/build/BitWriter.dep
245:info:build /bin/bash ./libtool --quiet --mode=compile /usr/bin/clang++ -pipe -Os -stdlib=libc++ -arch x86_64 -Wold-style-cast -Wall -MD -MF libqpdf/build/Buffer.tdep -MP -Iinclude -Ilibqpdf -I/opt/local/include -c libqpdf/Buffer.cc -o libqpdf/build/Buffer.o; sed -e 's/\.o:/.lo:/' < libqpdf/build/Buffer.tdep > libqpdf/build/Buffer.dep
246:info:build /bin/bash ./libtool --quiet --mode=compile /usr/bin/clang++ -pipe -Os -stdlib=libc++ -arch x86_64 -Wold-style-cast -Wall -MD -MF libqpdf/build/BufferInputSource.tdep -MP -Iinclude -Ilibqpdf -I/opt/local/include -c libqpdf/BufferInputSource.cc -o libqpdf/build/BufferInputSource.o; sed -e 's/\.o:/.lo:/' < libqpdf/build/BufferInputSource.tdep > libqpdf/build/BufferInputSource.dep
247:info:build /bin/bash ./libtool --quiet --mode=compile /usr/bin/clang++ -pipe -Os -stdlib=libc++ -arch x86_64 -Wold-style-cast -Wall -MD -MF libqpdf/build/FileInputSource.tdep -MP -Iinclude -Ilibqpdf -I/opt/local/include -c libqpdf/FileInputSource.cc -o libqpdf/build/FileInputSource.o; sed -e 's/\.o:/.lo:/' < libqpdf/build/FileInputSource.tdep > libqpdf/build/FileInputSource.dep
248:info:build /bin/bash ./libtool --quiet --mode=compile /usr/bin/clang++ -pipe -Os -stdlib=libc++ -arch x86_64 -Wold-style-cast -Wall -MD -MF libqpdf/build/InputSource.tdep -MP -Iinclude -Ilibqpdf -I/opt/local/include -c libqpdf/InputSource.cc -o libqpdf/build/InputSource.o; sed -e 's/\.o:/.lo:/' < libqpdf/build/InputSource.tdep > libqpdf/build/InputSource.dep
249:info:build /bin/bash ./libtool --quiet --mode=compile /usr/bin/clang++ -pipe -Os -stdlib=libc++ -arch x86_64 -Wold-style-cast -Wall -MD -MF libqpdf/build/InsecureRandomDataProvider.tdep -MP -Iinclude -Ilibqpdf -I/opt/local/include -c libqpdf/InsecureRandomDataProvider.cc -o libqpdf/build/InsecureRandomDataProvider.o; sed -e 's/\.o:/.lo:/' < libqpdf/build/InsecureRandomDataProvider.tdep > libqpdf/build/InsecureRandomDataProvider.dep
250:info:build /bin/bash ./libtool --quiet --mode=compile /usr/bin/clang++ -pipe -Os -stdlib=libc++ -arch x86_64 -Wold-style-cast -Wall -MD -MF libqpdf/build/MD5.tdep -MP -Iinclude -Ilibqpdf -I/opt/local/include -c libqpdf/MD5.cc -o libqpdf/build/MD5.o; sed -e 's/\.o:/.lo:/' < libqpdf/build/MD5.tdep > libqpdf/build/MD5.dep
251:info:build /bin/bash ./libtool --quiet --mode=compile /usr/bin/clang++ -pipe -Os -stdlib=libc++ -arch x86_64 -Wold-style-cast -Wall -MD -MF libqpdf/build/OffsetInputSource.tdep -MP -Iinclude -Ilibqpdf -I/opt/local/include -c libqpdf/OffsetInputSource.cc -o libqpdf/build/OffsetInputSource.o; sed -e 's/\.o:/.lo:/' < libqpdf/build/OffsetInputSource.tdep > libqpdf/build/OffsetInputSource.dep
252:info:build /bin/bash ./libtool --quiet --mode=compile /usr/bin/clang++ -pipe -Os -stdlib=libc++ -arch x86_64 -Wold-style-cast -Wall -MD -MF libqpdf/build/Pipeline.tdep -MP -Iinclude -Ilibqpdf -I/opt/local/include -c libqpdf/Pipeline.cc -o libqpdf/build/Pipeline.o; sed -e 's/\.o:/.lo:/' < libqpdf/build/Pipeline.tdep > libqpdf/build/Pipeline.dep
253:info:build /bin/bash ./libtool --quiet --mode=compile /usr/bin/clang++ -pipe -Os -stdlib=libc++ -arch x86_64 -Wold-style-cast -Wall -MD -MF libqpdf/build/Pl_AES_PDF.tdep -MP -Iinclude -Ilibqpdf -I/opt/local/include -c libqpdf/Pl_AES_PDF.cc -o libqpdf/build/Pl_AES_PDF.o; sed -e 's/\.o:/.lo:/' < libqpdf/build/Pl_AES_PDF.tdep > libqpdf/build/Pl_AES_PDF.dep
254:info:build /bin/bash ./libtool --quiet --mode=compile /usr/bin/clang++ -pipe -Os -stdlib=libc++ -arch x86_64 -Wold-style-cast -Wall -MD -MF libqpdf/build/Pl_ASCII85Decoder.tdep -MP -Iinclude -Ilibqpdf -I/opt/local/include -c libqpdf/Pl_ASCII85Decoder.cc -o libqpdf/build/Pl_ASCII85Decoder.o; sed -e 's/\.o:/.lo:/' < libqpdf/build/Pl_ASCII85Decoder.tdep > libqpdf/build/Pl_ASCII85Decoder.dep
255:info:build /bin/bash ./libtool --quiet --mode=compile /usr/bin/clang++ -pipe -Os -stdlib=libc++ -arch x86_64 -Wold-style-cast -Wall -MD -MF libqpdf/build/Pl_ASCIIHexDecoder.tdep -MP -Iinclude -Ilibqpdf -I/opt/local/include -c libqpdf/Pl_ASCIIHexDecoder.cc -o libqpdf/build/Pl_ASCIIHexDecoder.o; sed -e 's/\.o:/.lo:/' < libqpdf/build/Pl_ASCIIHexDecoder.tdep > libqpdf/build/Pl_ASCIIHexDecoder.dep
256:info:build /bin/bash ./libtool --quiet --mode=compile /usr/bin/clang++ -pipe -Os -stdlib=libc++ -arch x86_64 -Wold-style-cast -Wall -MD -MF libqpdf/build/Pl_Buffer.tdep -MP -Iinclude -Ilibqpdf -I/opt/local/include -c libqpdf/Pl_Buffer.cc -o libqpdf/build/Pl_Buffer.o; sed -e 's/\.o:/.lo:/' < libqpdf/build/Pl_Buffer.tdep > libqpdf/build/Pl_Buffer.dep
257:info:build /bin/bash ./libtool --quiet --mode=compile /usr/bin/clang++ -pipe -Os -stdlib=libc++ -arch x86_64 -Wold-style-cast -Wall -MD -MF libqpdf/build/Pl_Concatenate.tdep -MP -Iinclude -Ilibqpdf -I/opt/local/include -c libqpdf/Pl_Concatenate.cc -o libqpdf/build/Pl_Concatenate.o; sed -e 's/\.o:/.lo:/' < libqpdf/build/Pl_Concatenate.tdep > libqpdf/build/Pl_Concatenate.dep
258:info:build /bin/bash ./libtool --quiet --mode=compile /usr/bin/clang++ -pipe -Os -stdlib=libc++ -arch x86_64 -Wold-style-cast -Wall -MD -MF libqpdf/build/Pl_Count.tdep -MP -Iinclude -Ilibqpdf -I/opt/local/include -c libqpdf/Pl_Count.cc -o libqpdf/build/Pl_Count.o; sed -e 's/\.o:/.lo:/' < libqpdf/build/Pl_Count.tdep > libqpdf/build/Pl_Count.dep
259:info:build /bin/bash ./libtool --quiet --mode=compile /usr/bin/clang++ -pipe -Os -stdlib=libc++ -arch x86_64 -Wold-style-cast -Wall -MD -MF libqpdf/build/Pl_DCT.tdep -MP -Iinclude -Ilibqpdf -I/opt/local/include -c libqpdf/Pl_DCT.cc -o libqpdf/build/Pl_DCT.o; sed -e 's/\.o:/.lo:/' < libqpdf/build/Pl_DCT.tdep > libqpdf/build/Pl_DCT.dep
260:info:build /bin/bash ./libtool --quiet --mode=compile /usr/bin/clang++ -pipe -Os -stdlib=libc++ -arch x86_64 -Wold-style-cast -Wall -MD -MF libqpdf/build/Pl_Discard.tdep -MP -Iinclude -Ilibqpdf -I/opt/local/include -c libqpdf/Pl_Discard.cc -o libqpdf/build/Pl_Discard.o; sed -e 's/\.o:/.lo:/' < libqpdf/build/Pl_Discard.tdep > libqpdf/build/Pl_Discard.dep
261:info:build /bin/bash ./libtool --quiet --mode=compile /usr/bin/clang++ -pipe -Os -stdlib=libc++ -arch x86_64 -Wold-style-cast -Wall -MD -MF libqpdf/build/Pl_Flate.tdep -MP -Iinclude -Ilibqpdf -I/opt/local/include -c libqpdf/Pl_Flate.cc -o libqpdf/build/Pl_Flate.o; sed -e 's/\.o:/.lo:/' < libqpdf/build/Pl_Flate.tdep > libqpdf/build/Pl_Flate.dep
262:info:build /bin/bash ./libtool --quiet --mode=compile /usr/bin/clang++ -pipe -Os -stdlib=libc++ -arch x86_64 -Wold-style-cast -Wall -MD -MF libqpdf/build/Pl_LZWDecoder.tdep -MP -Iinclude -Ilibqpdf -I/opt/local/include -c libqpdf/Pl_LZWDecoder.cc -o libqpdf/build/Pl_LZWDecoder.o; sed -e 's/\.o:/.lo:/' < libqpdf/build/Pl_LZWDecoder.tdep > libqpdf/build/Pl_LZWDecoder.dep
263:info:build /bin/bash ./libtool --quiet --mode=compile /usr/bin/clang++ -pipe -Os -stdlib=libc++ -arch x86_64 -Wold-style-cast -Wall -MD -MF libqpdf/build/Pl_MD5.tdep -MP -Iinclude -Ilibqpdf -I/opt/local/include -c libqpdf/Pl_MD5.cc -o libqpdf/build/Pl_MD5.o; sed -e 's/\.o:/.lo:/' < libqpdf/build/Pl_MD5.tdep > libqpdf/build/Pl_MD5.dep
264:info:build /bin/bash ./libtool --quiet --mode=compile /usr/bin/clang++ -pipe -Os -stdlib=libc++ -arch x86_64 -Wold-style-cast -Wall -MD -MF libqpdf/build/Pl_PNGFilter.tdep -MP -Iinclude -Ilibqpdf -I/opt/local/include -c libqpdf/Pl_PNGFilter.cc -o libqpdf/build/Pl_PNGFilter.o; sed -e 's/\.o:/.lo:/' < libqpdf/build/Pl_PNGFilter.tdep > libqpdf/build/Pl_PNGFilter.dep
265:info:build /bin/bash ./libtool --quiet --mode=compile /usr/bin/clang++ -pipe -Os -stdlib=libc++ -arch x86_64 -Wold-style-cast -Wall -MD -MF libqpdf/build/Pl_QPDFTokenizer.tdep -MP -Iinclude -Ilibqpdf -I/opt/local/include -c libqpdf/Pl_QPDFTokenizer.cc -o libqpdf/build/Pl_QPDFTokenizer.o; sed -e 's/\.o:/.lo:/' < libqpdf/build/Pl_QPDFTokenizer.tdep > libqpdf/build/Pl_QPDFTokenizer.dep
266:info:build /bin/bash ./libtool --quiet --mode=compile /usr/bin/clang++ -pipe -Os -stdlib=libc++ -arch x86_64 -Wold-style-cast -Wall -MD -MF libqpdf/build/Pl_RC4.tdep -MP -Iinclude -Ilibqpdf -I/opt/local/include -c libqpdf/Pl_RC4.cc -o libqpdf/build/Pl_RC4.o; sed -e 's/\.o:/.lo:/' < libqpdf/build/Pl_RC4.tdep > libqpdf/build/Pl_RC4.dep
267:info:build libqpdf/Pl_PNGFilter.cc:221:19: error: no member named 'abs' in namespace 'std'
268:info:build     int pa = std::abs(p - a);
269:info:build              ~~~~~^
270:info:build /bin/bash ./libtool --quiet --mode=compile /usr/bin/clang++ -pipe -Os -stdlib=libc++ -arch x86_64 -Wold-style-cast -Wall -MD -MF libqpdf/build/Pl_RunLength.tdep -MP -Iinclude -Ilibqpdf -I/opt/local/include -c libqpdf/Pl_RunLength.cc -o libqpdf/build/Pl_RunLength.o; sed -e 's/\.o:/.lo:/' < libqpdf/build/Pl_RunLength.tdep > libqpdf/build/Pl_RunLength.dep
271:info:build libqpdf/Pl_PNGFilter.cc:222:19: error: no member named 'abs' in namespace 'std'
272:info:build     int pb = std::abs(p - b);
273:info:build              ~~~~~^
274:info:build libqpdf/Pl_PNGFilter.cc:223:19: error: no member named 'abs' in namespace 'std'
275:info:build     int pc = std::abs(p - c);
276:info:build              ~~~~~^
277:info:build 3 errors generated.
278:info:build /bin/bash ./libtool --quiet --mode=compile /usr/bin/clang++ -pipe -Os -stdlib=libc++ -arch x86_64 -Wold-style-cast -Wall -MD -MF libqpdf/build/Pl_SHA2.tdep -MP -Iinclude -Ilibqpdf -I/opt/local/include -c libqpdf/Pl_SHA2.cc -o libqpdf/build/Pl_SHA2.o; sed -e 's/\.o:/.lo:/' < libqpdf/build/Pl_SHA2.tdep > libqpdf/build/Pl_SHA2.dep
279:info:build /bin/bash ./libtool --quiet --mode=compile /usr/bin/clang++ -pipe -Os -stdlib=libc++ -arch x86_64 -Wold-style-cast -Wall -MD -MF libqpdf/build/Pl_StdioFile.tdep -MP -Iinclude -Ilibqpdf -I/opt/local/include -c libqpdf/Pl_StdioFile.cc -o libqpdf/build/Pl_StdioFile.o; sed -e 's/\.o:/.lo:/' < libqpdf/build/Pl_StdioFile.tdep > libqpdf/build/Pl_StdioFile.dep
280:info:build /bin/bash ./libtool --quiet --mode=compile /usr/bin/clang++ -pipe -Os -stdlib=libc++ -arch x86_64 -Wold-style-cast -Wall -MD -MF libqpdf/build/Pl_TIFFPredictor.tdep -MP -Iinclude -Ilibqpdf -I/opt/local/include -c libqpdf/Pl_TIFFPredictor.cc -o libqpdf/build/Pl_TIFFPredictor.o; sed -e 's/\.o:/.lo:/' < libqpdf/build/Pl_TIFFPredictor.tdep > libqpdf/build/Pl_TIFFPredictor.dep
281:info:build /bin/bash ./libtool --quiet --mode=compile /usr/bin/clang++ -pipe -Os -stdlib=libc++ -arch x86_64 -Wold-style-cast -Wall -MD -MF libqpdf/build/QPDF.tdep -MP -Iinclude -Ilibqpdf -I/opt/local/include -c libqpdf/QPDF.cc -o libqpdf/build/QPDF.o; sed -e 's/\.o:/.lo:/' < libqpdf/build/QPDF.tdep > libqpdf/build/QPDF.dep
282:info:build /bin/bash ./libtool --quiet --mode=compile /usr/bin/clang++ -pipe -Os -stdlib=libc++ -arch x86_64 -Wold-style-cast -Wall -MD -MF libqpdf/build/QPDFExc.tdep -MP -Iinclude -Ilibqpdf -I/opt/local/include -c libqpdf/QPDFExc.cc -o libqpdf/build/QPDFExc.o; sed -e 's/\.o:/.lo:/' < libqpdf/build/QPDFExc.tdep > libqpdf/build/QPDFExc.dep
283:info:build /bin/bash ./libtool --quiet --mode=compile /usr/bin/clang++ -pipe -Os -stdlib=libc++ -arch x86_64 -Wold-style-cast -Wall -MD -MF libqpdf/build/QPDFObjGen.tdep -MP -Iinclude -Ilibqpdf -I/opt/local/include -c libqpdf/QPDFObjGen.cc -o libqpdf/build/QPDFObjGen.o; sed -e 's/\.o:/.lo:/' < libqpdf/build/QPDFObjGen.tdep > libqpdf/build/QPDFObjGen.dep
284:info:build /bin/bash ./libtool --quiet --mode=compile /usr/bin/clang++ -pipe -Os -stdlib=libc++ -arch x86_64 -Wold-style-cast -Wall -MD -MF libqpdf/build/QPDFObject.tdep -MP -Iinclude -Ilibqpdf -I/opt/local/include -c libqpdf/QPDFObject.cc -o libqpdf/build/QPDFObject.o; sed -e 's/\.o:/.lo:/' < libqpdf/build/QPDFObject.tdep > libqpdf/build/QPDFObject.dep
285:info:build /bin/bash ./libtool --quiet --mode=compile /usr/bin/clang++ -pipe -Os -stdlib=libc++ -arch x86_64 -Wold-style-cast -Wall -MD -MF libqpdf/build/QPDFObjectHandle.tdep -MP -Iinclude -Ilibqpdf -I/opt/local/include -c libqpdf/QPDFObjectHandle.cc -o libqpdf/build/QPDFObjectHandle.o; sed -e 's/\.o:/.lo:/' < libqpdf/build/QPDFObjectHandle.tdep > libqpdf/build/QPDFObjectHandle.dep
286:info:build /bin/bash ./libtool --quiet --mode=compile /usr/bin/clang++ -pipe -Os -stdlib=libc++ -arch x86_64 -Wold-style-cast -Wall -MD -MF libqpdf/build/QPDFTokenizer.tdep -MP -Iinclude -Ilibqpdf -I/opt/local/include -c libqpdf/QPDFTokenizer.cc -o libqpdf/build/QPDFTokenizer.o; sed -e 's/\.o:/.lo:/' < libqpdf/build/QPDFTokenizer.tdep > libqpdf/build/QPDFTokenizer.dep
287:info:build /bin/bash ./libtool --quiet --mode=compile /usr/bin/clang++ -pipe -Os -stdlib=libc++ -arch x86_64 -Wold-style-cast -Wall -MD -MF libqpdf/build/QPDFWriter.tdep -MP -Iinclude -Ilibqpdf -I/opt/local/include -c libqpdf/QPDFWriter.cc -o libqpdf/build/QPDFWriter.o; sed -e 's/\.o:/.lo:/' < libqpdf/build/QPDFWriter.tdep > libqpdf/build/QPDFWriter.dep
288:info:build /bin/bash ./libtool --quiet --mode=compile /usr/bin/clang++ -pipe -Os -stdlib=libc++ -arch x86_64 -Wold-style-cast -Wall -MD -MF libqpdf/build/QPDFXRefEntry.tdep -MP -Iinclude -Ilibqpdf -I/opt/local/include -c libqpdf/QPDFXRefEntry.cc -o libqpdf/build/QPDFXRefEntry.o; sed -e 's/\.o:/.lo:/' < libqpdf/build/QPDFXRefEntry.tdep > libqpdf/build/QPDFXRefEntry.dep
289:info:build /bin/bash ./libtool --quiet --mode=compile /usr/bin/clang++ -pipe -Os -stdlib=libc++ -arch x86_64 -Wold-style-cast -Wall -MD -MF libqpdf/build/QPDF_Array.tdep -MP -Iinclude -Ilibqpdf -I/opt/local/include -c libqpdf/QPDF_Array.cc -o libqpdf/build/QPDF_Array.o; sed -e 's/\.o:/.lo:/' < libqpdf/build/QPDF_Array.tdep > libqpdf/build/QPDF_Array.dep
290:info:build /bin/bash ./libtool --quiet --mode=compile /usr/bin/clang++ -pipe -Os -stdlib=libc++ -arch x86_64 -Wold-style-cast -Wall -MD -MF libqpdf/build/QPDF_Bool.tdep -MP -Iinclude -Ilibqpdf -I/opt/local/include -c libqpdf/QPDF_Bool.cc -o libqpdf/build/QPDF_Bool.o; sed -e 's/\.o:/.lo:/' < libqpdf/build/QPDF_Bool.tdep > libqpdf/build/QPDF_Bool.dep
291:info:build /bin/bash ./libtool --quiet --mode=compile /usr/bin/clang++ -pipe -Os -stdlib=libc++ -arch x86_64 -Wold-style-cast -Wall -MD -MF libqpdf/build/QPDF_Dictionary.tdep -MP -Iinclude -Ilibqpdf -I/opt/local/include -c libqpdf/QPDF_Dictionary.cc -o libqpdf/build/QPDF_Dictionary.o; sed -e 's/\.o:/.lo:/' < libqpdf/build/QPDF_Dictionary.tdep > libqpdf/build/QPDF_Dictionary.dep
292:info:build /bin/bash ./libtool --quiet --mode=compile /usr/bin/clang++ -pipe -Os -stdlib=libc++ -arch x86_64 -Wold-style-cast -Wall -MD -MF libqpdf/build/QPDF_InlineImage.tdep -MP -Iinclude -Ilibqpdf -I/opt/local/include -c libqpdf/QPDF_InlineImage.cc -o libqpdf/build/QPDF_InlineImage.o; sed -e 's/\.o:/.lo:/' < libqpdf/build/QPDF_InlineImage.tdep > libqpdf/build/QPDF_InlineImage.dep
293:info:build /bin/bash ./libtool --quiet --mode=compile /usr/bin/clang++ -pipe -Os -stdlib=libc++ -arch x86_64 -Wold-style-cast -Wall -MD -MF libqpdf/build/QPDF_Integer.tdep -MP -Iinclude -Ilibqpdf -I/opt/local/include -c libqpdf/QPDF_Integer.cc -o libqpdf/build/QPDF_Integer.o; sed -e 's/\.o:/.lo:/' < libqpdf/build/QPDF_Integer.tdep > libqpdf/build/QPDF_Integer.dep
294:info:build /bin/bash ./libtool --quiet --mode=compile /usr/bin/clang++ -pipe -Os -stdlib=libc++ -arch x86_64 -Wold-style-cast -Wall -MD -MF libqpdf/build/QPDF_Name.tdep -MP -Iinclude -Ilibqpdf -I/opt/local/include -c libqpdf/QPDF_Name.cc -o libqpdf/build/QPDF_Name.o; sed -e 's/\.o:/.lo:/' < libqpdf/build/QPDF_Name.tdep > libqpdf/build/QPDF_Name.dep
295:info:build /bin/bash ./libtool --quiet --mode=compile /usr/bin/clang++ -pipe -Os -stdlib=libc++ -arch x86_64 -Wold-style-cast -Wall -MD -MF libqpdf/build/QPDF_Null.tdep -MP -Iinclude -Ilibqpdf -I/opt/local/include -c libqpdf/QPDF_Null.cc -o libqpdf/build/QPDF_Null.o; sed -e 's/\.o:/.lo:/' < libqpdf/build/QPDF_Null.tdep > libqpdf/build/QPDF_Null.dep
296:info:build /bin/bash ./libtool --quiet --mode=compile /usr/bin/clang++ -pipe -Os -stdlib=libc++ -arch x86_64 -Wold-style-cast -Wall -MD -MF libqpdf/build/QPDF_Operator.tdep -MP -Iinclude -Ilibqpdf -I/opt/local/include -c libqpdf/QPDF_Operator.cc -o libqpdf/build/QPDF_Operator.o; sed -e 's/\.o:/.lo:/' < libqpdf/build/QPDF_Operator.tdep > libqpdf/build/QPDF_Operator.dep
297:info:build /bin/bash ./libtool --quiet --mode=compile /usr/bin/clang++ -pipe -Os -stdlib=libc++ -arch x86_64 -Wold-style-cast -Wall -MD -MF libqpdf/build/QPDF_Real.tdep -MP -Iinclude -Ilibqpdf -I/opt/local/include -c libqpdf/QPDF_Real.cc -o libqpdf/build/QPDF_Real.o; sed -e 's/\.o:/.lo:/' < libqpdf/build/QPDF_Real.tdep > libqpdf/build/QPDF_Real.dep
298:info:build /bin/bash ./libtool --quiet --mode=compile /usr/bin/clang++ -pipe -Os -stdlib=libc++ -arch x86_64 -Wold-style-cast -Wall -MD -MF libqpdf/build/QPDF_Reserved.tdep -MP -Iinclude -Ilibqpdf -I/opt/local/include -c libqpdf/QPDF_Reserved.cc -o libqpdf/build/QPDF_Reserved.o; sed -e 's/\.o:/.lo:/' < libqpdf/build/QPDF_Reserved.tdep > libqpdf/build/QPDF_Reserved.dep
299:info:build /bin/bash ./libtool --quiet --mode=compile /usr/bin/clang++ -pipe -Os -stdlib=libc++ -arch x86_64 -Wold-style-cast -Wall -MD -MF libqpdf/build/QPDF_Stream.tdep -MP -Iinclude -Ilibqpdf -I/opt/local/include -c libqpdf/QPDF_Stream.cc -o libqpdf/build/QPDF_Stream.o; sed -e 's/\.o:/.lo:/' < libqpdf/build/QPDF_Stream.tdep > libqpdf/build/QPDF_Stream.dep
300:info:build /bin/bash ./libtool --quiet --mode=compile /usr/bin/clang++ -pipe -Os -stdlib=libc++ -arch x86_64 -Wold-style-cast -Wall -MD -MF libqpdf/build/QPDF_String.tdep -MP -Iinclude -Ilibqpdf -I/opt/local/include -c libqpdf/QPDF_String.cc -o libqpdf/build/QPDF_String.o; sed -e 's/\.o:/.lo:/' < libqpdf/build/QPDF_String.tdep > libqpdf/build/QPDF_String.dep
301:info:build /bin/bash ./libtool --quiet --mode=compile /usr/bin/clang++ -pipe -Os -stdlib=libc++ -arch x86_64 -Wold-style-cast -Wall -MD -MF libqpdf/build/QPDF_encryption.tdep -MP -Iinclude -Ilibqpdf -I/opt/local/include -c libqpdf/QPDF_encryption.cc -o libqpdf/build/QPDF_encryption.o; sed -e 's/\.o:/.lo:/' < libqpdf/build/QPDF_encryption.tdep > libqpdf/build/QPDF_encryption.dep
302:info:build /bin/bash ./libtool --quiet --mode=compile /usr/bin/clang++ -pipe -Os -stdlib=libc++ -arch x86_64 -Wold-style-cast -Wall -MD -MF libqpdf/build/QPDF_linearization.tdep -MP -Iinclude -Ilibqpdf -I/opt/local/include -c libqpdf/QPDF_linearization.cc -o libqpdf/build/QPDF_linearization.o; sed -e 's/\.o:/.lo:/' < libqpdf/build/QPDF_linearization.tdep > libqpdf/build/QPDF_linearization.dep
303:info:build /bin/bash ./libtool --quiet --mode=compile /usr/bin/clang++ -pipe -Os -stdlib=libc++ -arch x86_64 -Wold-style-cast -Wall -MD -MF libqpdf/build/QPDF_optimization.tdep -MP -Iinclude -Ilibqpdf -I/opt/local/include -c libqpdf/QPDF_optimization.cc -o libqpdf/build/QPDF_optimization.o; sed -e 's/\.o:/.lo:/' < libqpdf/build/QPDF_optimization.tdep > libqpdf/build/QPDF_optimization.dep
304:info:build /bin/bash ./libtool --quiet --mode=compile /usr/bin/clang++ -pipe -Os -stdlib=libc++ -arch x86_64 -Wold-style-cast -Wall -MD -MF libqpdf/build/QPDF_pages.tdep -MP -Iinclude -Ilibqpdf -I/opt/local/include -c libqpdf/QPDF_pages.cc -o libqpdf/build/QPDF_pages.o; sed -e 's/\.o:/.lo:/' < libqpdf/build/QPDF_pages.tdep > libqpdf/build/QPDF_pages.dep
305:info:build /bin/bash ./libtool --quiet --mode=compile /usr/bin/clang++ -pipe -Os -stdlib=libc++ -arch x86_64 -Wold-style-cast -Wall -MD -MF libqpdf/build/QTC.tdep -MP -Iinclude -Ilibqpdf -I/opt/local/include -c libqpdf/QTC.cc -o libqpdf/build/QTC.o; sed -e 's/\.o:/.lo:/' < libqpdf/build/QTC.tdep > libqpdf/build/QTC.dep
306:info:build /bin/bash ./libtool --quiet --mode=compile /usr/bin/clang++ -pipe -Os -stdlib=libc++ -arch x86_64 -Wold-style-cast -Wall -MD -MF libqpdf/build/QUtil.tdep -MP -Iinclude -Ilibqpdf -I/opt/local/include -c libqpdf/QUtil.cc -o libqpdf/build/QUtil.o; sed -e 's/\.o:/.lo:/' < libqpdf/build/QUtil.tdep > libqpdf/build/QUtil.dep
307:info:build /bin/bash ./libtool --quiet --mode=compile /usr/bin/clang++ -pipe -Os -stdlib=libc++ -arch x86_64 -Wold-style-cast -Wall -MD -MF libqpdf/build/RC4.tdep -MP -Iinclude -Ilibqpdf -I/opt/local/include -c libqpdf/RC4.cc -o libqpdf/build/RC4.o; sed -e 's/\.o:/.lo:/' < libqpdf/build/RC4.tdep > libqpdf/build/RC4.dep
308:info:build /bin/bash ./libtool --quiet --mode=compile /usr/bin/clang++ -pipe -Os -stdlib=libc++ -arch x86_64 -Wold-style-cast -Wall -MD -MF libqpdf/build/SecureRandomDataProvider.tdep -MP -Iinclude -Ilibqpdf -I/opt/local/include -c libqpdf/SecureRandomDataProvider.cc -o libqpdf/build/SecureRandomDataProvider.o; sed -e 's/\.o:/.lo:/' < libqpdf/build/SecureRandomDataProvider.tdep > libqpdf/build/SecureRandomDataProvider.dep
309:info:build /bin/bash ./libtool --quiet --mode=compile /usr/bin/clang++ -pipe -Os -stdlib=libc++ -arch x86_64 -Wold-style-cast -Wall -MD -MF libqpdf/build/qpdf-c.tdep -MP -Iinclude -Ilibqpdf -I/opt/local/include -c libqpdf/qpdf-c.cc -o libqpdf/build/qpdf-c.o; sed -e 's/\.o:/.lo:/' < libqpdf/build/qpdf-c.tdep > libqpdf/build/qpdf-c.dep
310:info:build /bin/bash ./libtool --quiet --mode=compile /usr/bin/clang++ -pipe -Os -stdlib=libc++ -arch x86_64 -Wold-style-cast -Wall -MD -MF libqpdf/build/rijndael.tdep -MP -Iinclude -Ilibqpdf -I/opt/local/include -c libqpdf/rijndael.cc -o libqpdf/build/rijndael.o; sed -e 's/\.o:/.lo:/' < libqpdf/build/rijndael.tdep > libqpdf/build/rijndael.dep
311:info:build /bin/bash ./libtool --quiet --mode=compile /usr/bin/clang -pipe -Os -arch x86_64 -Wall -MD -MF libqpdf/build/sha2.tdep -MP -Iinclude -Ilibqpdf -I/opt/local/include -c libqpdf/sha2.c -o libqpdf/build/sha2.o; sed -e 's/\.o:/.lo:/' < libqpdf/build/sha2.tdep > libqpdf/build/sha2.dep
312:info:build /bin/bash ./libtool --quiet --mode=compile /usr/bin/clang -pipe -Os -arch x86_64 -Wall -MD -MF libqpdf/build/sha2big.tdep -MP -Iinclude -Ilibqpdf -I/opt/local/include -c libqpdf/sha2big.c -o libqpdf/build/sha2big.o; sed -e 's/\.o:/.lo:/' < libqpdf/build/sha2big.tdep > libqpdf/build/sha2big.dep
313:info:build /usr/bin/clang++ -pipe -Os -stdlib=libc++ -arch x86_64 -Wold-style-cast -Wall -MD -MF zlib-flate/build/zlib-flate.dep -MP -Iinclude -I/opt/local/include -c zlib-flate/zlib-flate.cc -o zlib-flate/build/zlib-flate.o
314:info:build /usr/bin/clang++ -pipe -Os -stdlib=libc++ -arch x86_64 -Wold-style-cast -Wall -MD -MF libtests/build/aes.dep -MP -Iinclude -Ilibqpdf -I/opt/local/include -c libtests/aes.cc -o libtests/build/aes.o
315:info:build /usr/bin/clang++ -pipe -Os -stdlib=libc++ -arch x86_64 -Wold-style-cast -Wall -MD -MF libtests/build/ascii85.dep -MP -Iinclude -Ilibqpdf -I/opt/local/include -c libtests/ascii85.cc -o libtests/build/ascii85.o
316:info:build /usr/bin/clang++ -pipe -Os -stdlib=libc++ -arch x86_64 -Wold-style-cast -Wall -MD -MF libtests/build/bits.dep -MP -Iinclude -Ilibqpdf -I/opt/local/include -c libtests/bits.cc -o libtests/build/bits.o
317:info:build /usr/bin/clang++ -pipe -Os -stdlib=libc++ -arch x86_64 -Wold-style-cast -Wall -MD -MF libtests/build/buffer.dep -MP -Iinclude -Ilibqpdf -I/opt/local/include -c libtests/buffer.cc -o libtests/build/buffer.o
318:info:build /usr/bin/clang++ -pipe -Os -stdlib=libc++ -arch x86_64 -Wold-style-cast -Wall -MD -MF libtests/build/concatenate.dep -MP -Iinclude -Ilibqpdf -I/opt/local/include -c libtests/concatenate.cc -o libtests/build/concatenate.o
319:info:build /usr/bin/clang++ -pipe -Os -stdlib=libc++ -arch x86_64 -Wold-style-cast -Wall -MD -MF libtests/build/dct_compress.dep -MP -Iinclude -Ilibqpdf -I/opt/local/include -c libtests/dct_compress.cc -o libtests/build/dct_compress.o
320:info:build /usr/bin/clang++ -pipe -Os -stdlib=libc++ -arch x86_64 -Wold-style-cast -Wall -MD -MF libtests/build/dct_uncompress.dep -MP -Iinclude -Ilibqpdf -I/opt/local/include -c libtests/dct_uncompress.cc -o libtests/build/dct_uncompress.o
321:info:build /usr/bin/clang++ -pipe -Os -stdlib=libc++ -arch x86_64 -Wold-style-cast -Wall -MD -MF libtests/build/flate.dep -MP -Iinclude -Ilibqpdf -I/opt/local/include -c libtests/flate.cc -o libtests/build/flate.o
322:info:build /usr/bin/clang++ -pipe -Os -stdlib=libc++ -arch x86_64 -Wold-style-cast -Wall -MD -MF libtests/build/hex.dep -MP -Iinclude -Ilibqpdf -I/opt/local/include -c libtests/hex.cc -o libtests/build/hex.o
323:info:build /usr/bin/clang++ -pipe -Os -stdlib=libc++ -arch x86_64 -Wold-style-cast -Wall -MD -MF libtests/build/input_source.dep -MP -Iinclude -Ilibqpdf -I/opt/local/include -c libtests/input_source.cc -o libtests/build/input_source.o
324:info:build /usr/bin/clang++ -pipe -Os -stdlib=libc++ -arch x86_64 -Wold-style-cast -Wall -MD -MF libtests/build/lzw.dep -MP -Iinclude -Ilibqpdf -I/opt/local/include -c libtests/lzw.cc -o libtests/build/lzw.o
325:info:build /usr/bin/clang++ -pipe -Os -stdlib=libc++ -arch x86_64 -Wold-style-cast -Wall -MD -MF libtests/build/md5.dep -MP -Iinclude -Ilibqpdf -I/opt/local/include -c libtests/md5.cc -o libtests/build/md5.o
326:info:build /usr/bin/clang++ -pipe -Os -stdlib=libc++ -arch x86_64 -Wold-style-cast -Wall -MD -MF libtests/build/pointer_holder.dep -MP -Iinclude -Ilibqpdf -I/opt/local/include -c libtests/pointer_holder.cc -o libtests/build/pointer_holder.o
327:info:build /usr/bin/clang++ -pipe -Os -stdlib=libc++ -arch x86_64 -Wold-style-cast -Wall -MD -MF libtests/build/predictors.dep -MP -Iinclude -Ilibqpdf -I/opt/local/include -c libtests/predictors.cc -o libtests/build/predictors.o
328:info:build /usr/bin/clang++ -pipe -Os -stdlib=libc++ -arch x86_64 -Wold-style-cast -Wall -MD -MF libtests/build/qutil.dep -MP -Iinclude -Ilibqpdf -I/opt/local/include -c libtests/qutil.cc -o libtests/build/qutil.o
329:info:build /usr/bin/clang++ -pipe -Os -stdlib=libc++ -arch x86_64 -Wold-style-cast -Wall -MD -MF libtests/build/random.dep -MP -Iinclude -Ilibqpdf -I/opt/local/include -c libtests/random.cc -o libtests/build/random.o
330:info:build /usr/bin/clang++ -pipe -Os -stdlib=libc++ -arch x86_64 -Wold-style-cast -Wall -MD -MF libtests/build/rc4.dep -MP -Iinclude -Ilibqpdf -I/opt/local/include -c libtests/rc4.cc -o libtests/build/rc4.o
331:info:build /usr/bin/clang++ -pipe -Os -stdlib=libc++ -arch x86_64 -Wold-style-cast -Wall -MD -MF libtests/build/runlength.dep -MP -Iinclude -Ilibqpdf -I/opt/local/include -c libtests/runlength.cc -o libtests/build/runlength.o
332:info:build /usr/bin/clang++ -pipe -Os -stdlib=libc++ -arch x86_64 -Wold-style-cast -Wall -MD -MF libtests/build/sha2.dep -MP -Iinclude -Ilibqpdf -I/opt/local/include -c libtests/sha2.cc -o libtests/build/sha2.o
333:info:build /usr/bin/clang++ -pipe -Os -stdlib=libc++ -arch x86_64 -Wold-style-cast -Wall -MD -MF qpdf/build/qpdf.dep -MP -Iinclude -I/opt/local/include -c qpdf/qpdf.cc -o qpdf/build/qpdf.o
334:info:build /usr/bin/clang++ -pipe -Os -stdlib=libc++ -arch x86_64 -Wold-style-cast -Wall -MD -MF qpdf/build/test_driver.dep -MP -Iinclude -I/opt/local/include -c qpdf/test_driver.cc -o qpdf/build/test_driver.o
335:info:build /usr/bin/clang++ -pipe -Os -stdlib=libc++ -arch x86_64 -Wold-style-cast -Wall -MD -MF qpdf/build/pdf_from_scratch.dep -MP -Iinclude -I/opt/local/include -c qpdf/pdf_from_scratch.cc -o qpdf/build/pdf_from_scratch.o
336:info:build /usr/bin/clang++ -pipe -Os -stdlib=libc++ -arch x86_64 -Wold-style-cast -Wall -MD -MF qpdf/build/test_large_file.dep -MP -Iinclude -I/opt/local/include -c qpdf/test_large_file.cc -o qpdf/build/test_large_file.o
337:info:build /usr/bin/clang -pipe -Os -arch x86_64 -Wall -MD -MF qpdf/build/qpdf-ctest.dep -MP -Iinclude -I/opt/local/include -c qpdf/qpdf-ctest.c -o qpdf/build/qpdf-ctest.o
338:info:build /usr/bin/clang++ -pipe -Os -stdlib=libc++ -arch x86_64 -Wold-style-cast -Wall -MD -MF examples/build/pdf-bookmarks.dep -MP -Iinclude -I/opt/local/include -c examples/pdf-bookmarks.cc -o examples/build/pdf-bookmarks.o
339:info:build /usr/bin/clang++ -pipe -Os -stdlib=libc++ -arch x86_64 -Wold-style-cast -Wall -MD -MF examples/build/pdf-mod-info.dep -MP -Iinclude -I/opt/local/include -c examples/pdf-mod-info.cc -o examples/build/pdf-mod-info.o
340:info:build /usr/bin/clang++ -pipe -Os -stdlib=libc++ -arch x86_64 -Wold-style-cast -Wall -MD -MF examples/build/pdf-npages.dep -MP -Iinclude -I/opt/local/include -c examples/pdf-npages.cc -o examples/build/pdf-npages.o
341:info:build /usr/bin/clang++ -pipe -Os -stdlib=libc++ -arch x86_64 -Wold-style-cast -Wall -MD -MF examples/build/pdf-double-page-size.dep -MP -Iinclude -I/opt/local/include -c examples/pdf-double-page-size.cc -o examples/build/pdf-double-page-size.o
342:info:build /usr/bin/clang++ -pipe -Os -stdlib=libc++ -arch x86_64 -Wold-style-cast -Wall -MD -MF examples/build/pdf-invert-images.dep -MP -Iinclude -I/opt/local/include -c examples/pdf-invert-images.cc -o examples/build/pdf-invert-images.o
343:info:build /usr/bin/clang++ -pipe -Os -stdlib=libc++ -arch x86_64 -Wold-style-cast -Wall -MD -MF examples/build/pdf-create.dep -MP -Iinclude -I/opt/local/include -c examples/pdf-create.cc -o examples/build/pdf-create.o
344:info:build /usr/bin/clang++ -pipe -Os -stdlib=libc++ -arch x86_64 -Wold-style-cast -Wall -MD -MF examples/build/pdf-parse-content.dep -MP -Iinclude -I/opt/local/include -c examples/pdf-parse-content.cc -o examples/build/pdf-parse-content.o
345:info:build /usr/bin/clang++ -pipe -Os -stdlib=libc++ -arch x86_64 -Wold-style-cast -Wall -MD -MF examples/build/pdf-split-pages.dep -MP -Iinclude -I/opt/local/include -c examples/pdf-split-pages.cc -o examples/build/pdf-split-pages.o
346:info:build /usr/bin/clang -pipe -Os -arch x86_64 -Wall -MD -MF examples/build/pdf-linearize.dep -MP -Iinclude -I/opt/local/include -c examples/pdf-linearize.c -o examples/build/pdf-linearize.o
347:info:build /bin/bash ./libtool --mode=link /usr/bin/clang++ -pipe -Os -stdlib=libc++ -arch x86_64 -Wold-style-cast -Wall  -o libqpdf/build/libqpdf.la libqpdf/build/BitStream.lo libqpdf/build/BitWriter.lo libqpdf/build/Buffer.lo libqpdf/build/BufferInputSource.lo libqpdf/build/FileInputSource.lo libqpdf/build/InputSource.lo libqpdf/build/InsecureRandomDataProvider.lo libqpdf/build/MD5.lo libqpdf/build/OffsetInputSource.lo libqpdf/build/Pipeline.lo libqpdf/build/Pl_AES_PDF.lo libqpdf/build/Pl_ASCII85Decoder.lo libqpdf/build/Pl_ASCIIHexDecoder.lo libqpdf/build/Pl_Buffer.lo libqpdf/build/Pl_Concatenate.lo libqpdf/build/Pl_Count.lo libqpdf/build/Pl_DCT.lo libqpdf/build/Pl_Discard.lo libqpdf/build/Pl_Flate.lo libqpdf/build/Pl_LZWDecoder.lo libqpdf/build/Pl_MD5.lo libqpdf/build/Pl_PNGFilter.lo libqpdf/build/Pl_QPDFTokenizer.lo libqpdf/build/Pl_RC4.lo libqpdf/build/Pl_RunLength.lo libqpdf/build/Pl_SHA2.lo libqpdf/build/Pl_StdioFile.lo libqpdf/build/Pl_TIFFPredictor.lo libqpdf/build/QPDF.lo libqpdf/build/QPDFExc.lo libqpdf/build/QPDFObjGen.lo libqpdf/build/QPDFObject.lo libqpdf/build/QPDFObjectHandle.lo libqpdf/build/QPDFTokenizer.lo libqpdf/build/QPDFWriter.lo libqpdf/build/QPDFXRefEntry.lo libqpdf/build/QPDF_Array.lo libqpdf/build/QPDF_Bool.lo libqpdf/build/QPDF_Dictionary.lo libqpdf/build/QPDF_InlineImage.lo libqpdf/build/QPDF_Integer.lo libqpdf/build/QPDF_Name.lo libqpdf/build/QPDF_Null.lo libqpdf/build/QPDF_Operator.lo libqpdf/build/QPDF_Real.lo libqpdf/build/QPDF_Reserved.lo libqpdf/build/QPDF_Stream.lo libqpdf/build/QPDF_String.lo libqpdf/build/QPDF_encryption.lo libqpdf/build/QPDF_linearization.lo libqpdf/build/QPDF_optimization.lo libqpdf/build/QPDF_pages.lo libqpdf/build/QTC.lo libqpdf/build/QUtil.lo libqpdf/build/RC4.lo libqpdf/build/SecureRandomDataProvider.lo libqpdf/build/qpdf-c.lo libqpdf/build/rijndael.lo libqpdf/build/sha2.lo libqpdf/build/sha2big.lo -ljpeg -lz  -L/opt/local/lib -Wl,-headerpad_max_install_names -arch x86_64 -rpath /opt/local/lib -version-info 20:0:2 -no-undefined
348:info:build libtool:   error: 'libqpdf/build/Pl_PNGFilter.lo' is not a valid libtool object
349:info:build make: *** [libqpdf/build/libqpdf.la] Error 1
350:info:build make: *** Waiting for unfinished jobs....
351:info:build make: Leaving directory `/opt/local/var/macports/build/_opt_local_var_macports_sources_rsync.macports.org_release_tarballs_ports_textproc_qpdf/qpdf/work/qpdf-7.1.0'
352:info:build Command failed:  cd "/opt/local/var/macports/build/_opt_local_var_macports_sources_rsync.macports.org_release_tarballs_ports_textproc_qpdf/qpdf/work/qpdf-7.1.0" && /usr/bin/make -j8 -w all
353:info:build Exit code: 2
354:error:build Failed to build qpdf: command execution failed
355:debug:build Error code: CHILDSTATUS 46904 2
356:debug:build Backtrace: command execution failed
357:debug:build     while executing
358:debug:build "system {*}$notty {*}$nice $fullcmdstring"
359:debug:build     invoked from within
360:debug:build "command_exec build"
361:debug:build     (procedure "portbuild::build_main" line 8)
362:debug:build     invoked from within
363:debug:build "$procedure $targetname"
364:error:build See /opt/local/var/macports/logs/_opt_local_var_macports_sources_rsync.macports.org_release_tarballs_ports_textproc_qpdf/qpdf/main.log for details.