Ticket #56991: python-main.log

File python-main.log, 194.6 KB (added by contextnerror, 2 months ago)
Line 
1version:1
2:debug:clean Starting logging for python310 @3.10.8_0+lto+optimizations+universal
3:debug:sysinfo macOS 10.14.6 (darwin/18.7.0) arch i386
4:debug:sysinfo MacPorts 2.8.0
5:debug:sysinfo Xcode none, CLT 11.3.1.0.1.1576735732
6:debug:sysinfo SDK 10.13
7:debug:sysinfo MACOSX_DEPLOYMENT_TARGET: 10.13
8:msg:clean --->  Computing dependencies for python310:info:clean .:debug:clean python310 has no conflicts
9:debug:clean Searching for dependency: xz
10:debug:clean Found Dependency: receipt exists for xz
11:debug:clean Searching for dependency: pkgconfig
12:debug:clean Found Dependency: receipt exists for pkgconfig
13:debug:clean Searching for dependency: bzip2
14:debug:clean Found Dependency: receipt exists for bzip2
15:debug:clean Searching for dependency: expat
16:debug:clean Found Dependency: receipt exists for expat
17:debug:clean Searching for dependency: gettext-runtime
18:debug:clean Found Dependency: receipt exists for gettext-runtime
19:debug:clean Searching for dependency: libedit
20:debug:clean Found Dependency: receipt exists for libedit
21:debug:clean Searching for dependency: libffi
22:debug:clean Found Dependency: receipt exists for libffi
23:debug:clean Searching for dependency: ncurses
24:debug:clean Found Dependency: receipt exists for ncurses
25:debug:clean Searching for dependency: openssl
26:debug:clean Found Dependency: receipt exists for openssl
27:debug:clean Searching for dependency: sqlite3
28:debug:clean Found Dependency: receipt exists for sqlite3
29:debug:clean Searching for dependency: zlib
30:debug:clean Found Dependency: receipt exists for zlib
31:debug:clean Searching for dependency: python_select
32:debug:clean Found Dependency: receipt exists for python_select
33:debug:clean Searching for dependency: python3_select
34:debug:clean Found Dependency: receipt exists for python3_select
35:debug:main Executing org.macports.main (python310)
36:debug:main dropping privileges: euid changed to 502, egid changed to 501.
37:debug:archivefetch archivefetch phase started at Thu Nov 24 08:39:44 PST 2022
38:msg:archivefetch --->  Fetching archive for python310
39:debug:archivefetch Executing org.macports.archivefetch (python310)
40:debug:archivefetch euid/egid changed to: 0/0
41:debug:archivefetch chowned /opt/local/var/macports/incoming to macports
42:debug:archivefetch euid/egid changed to: 502/501
43:info:archivefetch --->  python310-3.10.8_0+lto+optimizations+universal.darwin_18.i386-x86_64.tbz2 doesn't seem to exist in /opt/local/var/macports/incoming/verified
44:msg:archivefetch --->  Attempting to fetch python310-3.10.8_0+lto+optimizations+universal.darwin_18.i386-x86_64.tbz2 from http://packages.macports.org/python310
45:debug:archivefetch Fetching archive failed: The requested URL returned error: 404
46:msg:archivefetch --->  Attempting to fetch python310-3.10.8_0+lto+optimizations+universal.darwin_18.i386-x86_64.tbz2 from http://mirror.fcix.net/macports/packages/python310
47:debug:archivefetch Fetching archive failed: The requested URL returned error: 404
48:msg:archivefetch --->  Attempting to fetch python310-3.10.8_0+lto+optimizations+universal.darwin_18.i386-x86_64.tbz2 from http://ywg.ca.packages.macports.org/mirror/macports/packages/python310
49:debug:archivefetch Fetching archive failed: The requested URL returned error: 404
50:debug:archivefetch Privilege de-escalation not attempted as not running as root.
51:debug:fetch fetch phase started at Thu Nov 24 08:39:45 PST 2022
52:notice:fetch --->  Fetching distfiles for python310
53:debug:fetch Executing org.macports.fetch (python310)
54:debug:fetch Privilege de-escalation not attempted as not running as root.
55:debug:checksum checksum phase started at Thu Nov 24 08:39:45 PST 2022
56:notice:checksum --->  Verifying checksums for python310
57:debug:checksum Executing org.macports.checksum (python310)
58:info:checksum --->  Checksumming Python-3.10.8.tar.xz
59:debug:checksum Calculated (md5) is e92356b012ed4d0e09675131d39b1bde
60:debug:checksum Correct (md5) checksum for Python-3.10.8.tar.xz
61:debug:checksum Calculated (rmd160) is e798facc3419b78c1eb980a2e63a9ec5e9cc586b
62:debug:checksum Correct (rmd160) checksum for Python-3.10.8.tar.xz
63:debug:checksum Calculated (sha256) is 6a30ecde59c47048013eb5a658c9b5dec277203d2793667f578df7671f7f03f3
64:debug:checksum Correct (sha256) checksum for Python-3.10.8.tar.xz
65:debug:checksum Privilege de-escalation not attempted as not running as root.
66:debug:extract extract phase started at Thu Nov 24 08:39:45 PST 2022
67:notice:extract --->  Extracting python310
68:debug:extract setting option extract.cmd to /opt/local/bin/xz
69:debug:extract Executing org.macports.extract (python310)
70:info:extract --->  Extracting Python-3.10.8.tar.xz
71:debug:extract setting option extract.args to '/opt/local/var/macports/distfiles/python310/Python-3.10.8.tar.xz'
72:debug:extract Environment:
73:debug:extract CC_PRINT_OPTIONS='YES'
74:debug:extract CC_PRINT_OPTIONS_FILE='/opt/local/var/macports/build/_opt_local_var_macports_sources_rsync.macports.org_macports_release_tarballs_ports_lang_python310/python310/work/.CC_PRINT_OPTIONS'
75:debug:extract CPATH='/opt/local/include'
76:debug:extract DEVELOPER_DIR='/Library/Developer/CommandLineTools'
77:debug:extract LIBRARY_PATH='/opt/local/lib'
78:debug:extract MACOSX_DEPLOYMENT_TARGET='10.13'
79:debug:extract SDKROOT='/Library/Developer/CommandLineTools/SDKs/MacOSX10.13.sdk'
80:info:extract Executing:  cd "/opt/local/var/macports/build/_opt_local_var_macports_sources_rsync.macports.org_macports_release_tarballs_ports_lang_python310/python310/work" && /opt/local/bin/xz -dc '/opt/local/var/macports/distfiles/python310/Python-3.10.8.tar.xz' | /usr/bin/tar -xf -
81:debug:extract system:  cd "/opt/local/var/macports/build/_opt_local_var_macports_sources_rsync.macports.org_macports_release_tarballs_ports_lang_python310/python310/work" && /opt/local/bin/xz -dc '/opt/local/var/macports/distfiles/python310/Python-3.10.8.tar.xz' | /usr/bin/tar -xf -
82:debug:extract euid/egid changed to: 0/0
83:debug:extract chowned /opt/local/var/macports/build/_opt_local_var_macports_sources_rsync.macports.org_macports_release_tarballs_ports_lang_python310/python310/work to macports
84:debug:extract euid/egid changed to: 502/501
85:debug:extract Privilege de-escalation not attempted as not running as root.
86:debug:patch patch phase started at Thu Nov 24 08:39:49 PST 2022
87:debug:patch Executing org.macports.patch (python310)
88:notice:patch --->  Applying patches to python310
89:info:patch --->  Applying patch-setup.py.diff
90:debug:patch Environment:
91:debug:patch CC_PRINT_OPTIONS='YES'
92:debug:patch CC_PRINT_OPTIONS_FILE='/opt/local/var/macports/build/_opt_local_var_macports_sources_rsync.macports.org_macports_release_tarballs_ports_lang_python310/python310/work/.CC_PRINT_OPTIONS'
93:debug:patch CPATH='/opt/local/include'
94:debug:patch DEVELOPER_DIR='/Library/Developer/CommandLineTools'
95:debug:patch LIBRARY_PATH='/opt/local/lib'
96:debug:patch MACOSX_DEPLOYMENT_TARGET='10.13'
97:debug:patch SDKROOT='/Library/Developer/CommandLineTools/SDKs/MacOSX10.13.sdk'
98:info:patch Executing:  cd "/opt/local/var/macports/build/_opt_local_var_macports_sources_rsync.macports.org_macports_release_tarballs_ports_lang_python310/python310/work/Python-3.10.8" && /usr/bin/patch -p0 < '/opt/local/var/macports/sources/rsync.macports.org/macports/release/tarballs/ports/lang/python310/files/patch-setup.py.diff'
99:debug:patch system:  cd "/opt/local/var/macports/build/_opt_local_var_macports_sources_rsync.macports.org_macports_release_tarballs_ports_lang_python310/python310/work/Python-3.10.8" && /usr/bin/patch -p0 < '/opt/local/var/macports/sources/rsync.macports.org/macports/release/tarballs/ports/lang/python310/files/patch-setup.py.diff'
100:info:patch patching file setup.py
101:info:patch Hunk #2 succeeded at 825 (offset 1 line).
102:info:patch Hunk #3 succeeded at 1869 (offset 4 lines).
103:info:patch Hunk #4 succeeded at 2105 (offset 4 lines).
104:info:patch --->  Applying patch-Lib-cgi.py.diff
105:debug:patch Environment:
106:debug:patch CC_PRINT_OPTIONS='YES'
107:debug:patch CC_PRINT_OPTIONS_FILE='/opt/local/var/macports/build/_opt_local_var_macports_sources_rsync.macports.org_macports_release_tarballs_ports_lang_python310/python310/work/.CC_PRINT_OPTIONS'
108:debug:patch CPATH='/opt/local/include'
109:debug:patch DEVELOPER_DIR='/Library/Developer/CommandLineTools'
110:debug:patch LIBRARY_PATH='/opt/local/lib'
111:debug:patch MACOSX_DEPLOYMENT_TARGET='10.13'
112:debug:patch SDKROOT='/Library/Developer/CommandLineTools/SDKs/MacOSX10.13.sdk'
113:info:patch Executing:  cd "/opt/local/var/macports/build/_opt_local_var_macports_sources_rsync.macports.org_macports_release_tarballs_ports_lang_python310/python310/work/Python-3.10.8" && /usr/bin/patch -p0 < '/opt/local/var/macports/sources/rsync.macports.org/macports/release/tarballs/ports/lang/python310/files/patch-Lib-cgi.py.diff'
114:debug:patch system:  cd "/opt/local/var/macports/build/_opt_local_var_macports_sources_rsync.macports.org_macports_release_tarballs_ports_lang_python310/python310/work/Python-3.10.8" && /usr/bin/patch -p0 < '/opt/local/var/macports/sources/rsync.macports.org/macports/release/tarballs/ports/lang/python310/files/patch-Lib-cgi.py.diff'
115:info:patch patching file Lib/cgi.py
116:info:patch --->  Applying patch-configure.diff
117:debug:patch Environment:
118:debug:patch CC_PRINT_OPTIONS='YES'
119:debug:patch CC_PRINT_OPTIONS_FILE='/opt/local/var/macports/build/_opt_local_var_macports_sources_rsync.macports.org_macports_release_tarballs_ports_lang_python310/python310/work/.CC_PRINT_OPTIONS'
120:debug:patch CPATH='/opt/local/include'
121:debug:patch DEVELOPER_DIR='/Library/Developer/CommandLineTools'
122:debug:patch LIBRARY_PATH='/opt/local/lib'
123:debug:patch MACOSX_DEPLOYMENT_TARGET='10.13'
124:debug:patch SDKROOT='/Library/Developer/CommandLineTools/SDKs/MacOSX10.13.sdk'
125:info:patch Executing:  cd "/opt/local/var/macports/build/_opt_local_var_macports_sources_rsync.macports.org_macports_release_tarballs_ports_lang_python310/python310/work/Python-3.10.8" && /usr/bin/patch -p0 < '/opt/local/var/macports/sources/rsync.macports.org/macports/release/tarballs/ports/lang/python310/files/patch-configure.diff'
126:debug:patch system:  cd "/opt/local/var/macports/build/_opt_local_var_macports_sources_rsync.macports.org_macports_release_tarballs_ports_lang_python310/python310/work/Python-3.10.8" && /usr/bin/patch -p0 < '/opt/local/var/macports/sources/rsync.macports.org/macports/release/tarballs/ports/lang/python310/files/patch-configure.diff'
127:info:patch patching file configure
128:info:patch Hunk #1 succeeded at 3265 (offset 10 lines).
129:info:patch Hunk #2 succeeded at 6588 (offset 23 lines).
130:info:patch Hunk #3 succeeded at 7605 (offset 23 lines).
131:info:patch --->  Applying patch-Lib-ctypes-macholib-dyld.py.diff
132:debug:patch Environment:
133:debug:patch CC_PRINT_OPTIONS='YES'
134:debug:patch CC_PRINT_OPTIONS_FILE='/opt/local/var/macports/build/_opt_local_var_macports_sources_rsync.macports.org_macports_release_tarballs_ports_lang_python310/python310/work/.CC_PRINT_OPTIONS'
135:debug:patch CPATH='/opt/local/include'
136:debug:patch DEVELOPER_DIR='/Library/Developer/CommandLineTools'
137:debug:patch LIBRARY_PATH='/opt/local/lib'
138:debug:patch MACOSX_DEPLOYMENT_TARGET='10.13'
139:debug:patch SDKROOT='/Library/Developer/CommandLineTools/SDKs/MacOSX10.13.sdk'
140:info:patch Executing:  cd "/opt/local/var/macports/build/_opt_local_var_macports_sources_rsync.macports.org_macports_release_tarballs_ports_lang_python310/python310/work/Python-3.10.8" && /usr/bin/patch -p0 < '/opt/local/var/macports/sources/rsync.macports.org/macports/release/tarballs/ports/lang/python310/files/patch-Lib-ctypes-macholib-dyld.py.diff'
141:debug:patch system:  cd "/opt/local/var/macports/build/_opt_local_var_macports_sources_rsync.macports.org_macports_release_tarballs_ports_lang_python310/python310/work/Python-3.10.8" && /usr/bin/patch -p0 < '/opt/local/var/macports/sources/rsync.macports.org/macports/release/tarballs/ports/lang/python310/files/patch-Lib-ctypes-macholib-dyld.py.diff'
142:info:patch patching file Lib/ctypes/macholib/dyld.py
143:info:patch Hunk #1 succeeded at 28 (offset 5 lines).
144:info:patch --->  Applying patch-configure-xcode4bug.diff
145:debug:patch Environment:
146:debug:patch CC_PRINT_OPTIONS='YES'
147:debug:patch CC_PRINT_OPTIONS_FILE='/opt/local/var/macports/build/_opt_local_var_macports_sources_rsync.macports.org_macports_release_tarballs_ports_lang_python310/python310/work/.CC_PRINT_OPTIONS'
148:debug:patch CPATH='/opt/local/include'
149:debug:patch DEVELOPER_DIR='/Library/Developer/CommandLineTools'
150:debug:patch LIBRARY_PATH='/opt/local/lib'
151:debug:patch MACOSX_DEPLOYMENT_TARGET='10.13'
152:debug:patch SDKROOT='/Library/Developer/CommandLineTools/SDKs/MacOSX10.13.sdk'
153:info:patch Executing:  cd "/opt/local/var/macports/build/_opt_local_var_macports_sources_rsync.macports.org_macports_release_tarballs_ports_lang_python310/python310/work/Python-3.10.8" && /usr/bin/patch -p0 < '/opt/local/var/macports/sources/rsync.macports.org/macports/release/tarballs/ports/lang/python310/files/patch-configure-xcode4bug.diff'
154:debug:patch system:  cd "/opt/local/var/macports/build/_opt_local_var_macports_sources_rsync.macports.org_macports_release_tarballs_ports_lang_python310/python310/work/Python-3.10.8" && /usr/bin/patch -p0 < '/opt/local/var/macports/sources/rsync.macports.org/macports/release/tarballs/ports/lang/python310/files/patch-configure-xcode4bug.diff'
155:info:patch patching file configure
156:info:patch Hunk #1 succeeded at 17357 (offset 247 lines).
157:info:patch --->  Applying sysconfig.py.patch
158:debug:patch Environment:
159:debug:patch CC_PRINT_OPTIONS='YES'
160:debug:patch CC_PRINT_OPTIONS_FILE='/opt/local/var/macports/build/_opt_local_var_macports_sources_rsync.macports.org_macports_release_tarballs_ports_lang_python310/python310/work/.CC_PRINT_OPTIONS'
161:debug:patch CPATH='/opt/local/include'
162:debug:patch DEVELOPER_DIR='/Library/Developer/CommandLineTools'
163:debug:patch LIBRARY_PATH='/opt/local/lib'
164:debug:patch MACOSX_DEPLOYMENT_TARGET='10.13'
165:debug:patch SDKROOT='/Library/Developer/CommandLineTools/SDKs/MacOSX10.13.sdk'
166:info:patch Executing:  cd "/opt/local/var/macports/build/_opt_local_var_macports_sources_rsync.macports.org_macports_release_tarballs_ports_lang_python310/python310/work/Python-3.10.8" && /usr/bin/patch -p0 < '/opt/local/var/macports/sources/rsync.macports.org/macports/release/tarballs/ports/lang/python310/files/sysconfig.py.patch'
167:debug:patch system:  cd "/opt/local/var/macports/build/_opt_local_var_macports_sources_rsync.macports.org_macports_release_tarballs_ports_lang_python310/python310/work/Python-3.10.8" && /usr/bin/patch -p0 < '/opt/local/var/macports/sources/rsync.macports.org/macports/release/tarballs/ports/lang/python310/files/sysconfig.py.patch'
168:info:patch patching file Lib/sysconfig.py
169:info:patch Hunk #1 succeeded at 464 (offset 35 lines).
170:debug:patch Executing proc-post-org.macports.patch-patch-0
171:info:patch --->  Patching cgi.py: s|@@PREFIX@@|/opt/local|g
172:debug:patch Executing reinplace: /usr/bin/sed s|@@PREFIX@@|/opt/local|g </opt/local/var/macports/build/_opt_local_var_macports_sources_rsync.macports.org_macports_release_tarballs_ports_lang_python310/python310/work/Python-3.10.8/Lib/cgi.py >@file19
173:debug:patch euid/egid changed to: 0/0
174:debug:patch chowned /opt/local/var/macports/build/_opt_local_var_macports_sources_rsync.macports.org_macports_release_tarballs_ports_lang_python310/python310/work/Python-3.10.8/Lib/cgi.py to macports
175:debug:patch euid/egid changed to: 502/501
176:debug:patch euid/egid changed to: 0/0
177:debug:patch setting attributes on /opt/local/var/macports/build/_opt_local_var_macports_sources_rsync.macports.org_macports_release_tarballs_ports_lang_python310/python310/work/Python-3.10.8/Lib/cgi.py
178:debug:patch euid/egid changed to: 502/501
179:info:patch --->  Patching dyld.py: s|@@PREFIX@@|/opt/local|g
180:debug:patch Executing reinplace: /usr/bin/sed s|@@PREFIX@@|/opt/local|g </opt/local/var/macports/build/_opt_local_var_macports_sources_rsync.macports.org_macports_release_tarballs_ports_lang_python310/python310/work/Python-3.10.8/Lib/ctypes/macholib/dyld.py >@file19
181:debug:patch euid/egid changed to: 0/0
182:debug:patch chowned /opt/local/var/macports/build/_opt_local_var_macports_sources_rsync.macports.org_macports_release_tarballs_ports_lang_python310/python310/work/Python-3.10.8/Lib/ctypes/macholib/dyld.py to macports
183:debug:patch euid/egid changed to: 502/501
184:debug:patch euid/egid changed to: 0/0
185:debug:patch setting attributes on /opt/local/var/macports/build/_opt_local_var_macports_sources_rsync.macports.org_macports_release_tarballs_ports_lang_python310/python310/work/Python-3.10.8/Lib/ctypes/macholib/dyld.py
186:debug:patch euid/egid changed to: 502/501
187:info:patch --->  Patching Makefile.pre.in: s|/setup.py|/setup.py --no-user-cfg|
188:debug:patch Executing reinplace: /usr/bin/sed {s|/setup.py|/setup.py --no-user-cfg|} </opt/local/var/macports/build/_opt_local_var_macports_sources_rsync.macports.org_macports_release_tarballs_ports_lang_python310/python310/work/Python-3.10.8/Makefile.pre.in >@file19
189:debug:patch euid/egid changed to: 0/0
190:debug:patch chowned /opt/local/var/macports/build/_opt_local_var_macports_sources_rsync.macports.org_macports_release_tarballs_ports_lang_python310/python310/work/Python-3.10.8/Makefile.pre.in to macports
191:debug:patch euid/egid changed to: 502/501
192:debug:patch euid/egid changed to: 0/0
193:debug:patch setting attributes on /opt/local/var/macports/build/_opt_local_var_macports_sources_rsync.macports.org_macports_release_tarballs_ports_lang_python310/python310/work/Python-3.10.8/Makefile.pre.in
194:debug:patch euid/egid changed to: 502/501
195:info:patch --->  Patching configure: s|@@APPLICATIONS_DIR@@|/Applications/MacPorts|
196:debug:patch Executing reinplace: /usr/bin/sed s|@@APPLICATIONS_DIR@@|/Applications/MacPorts| </opt/local/var/macports/build/_opt_local_var_macports_sources_rsync.macports.org_macports_release_tarballs_ports_lang_python310/python310/work/Python-3.10.8/configure >@file19
197:debug:patch euid/egid changed to: 0/0
198:debug:patch chowned /opt/local/var/macports/build/_opt_local_var_macports_sources_rsync.macports.org_macports_release_tarballs_ports_lang_python310/python310/work/Python-3.10.8/configure to macports
199:debug:patch euid/egid changed to: 502/501
200:debug:patch euid/egid changed to: 0/0
201:debug:patch setting attributes on /opt/local/var/macports/build/_opt_local_var_macports_sources_rsync.macports.org_macports_release_tarballs_ports_lang_python310/python310/work/Python-3.10.8/configure
202:debug:patch euid/egid changed to: 502/501
203:debug:patch Executing proc-post-org.macports.patch-patch-1
204:info:patch --->  Patching configure: s|@@UNIVERSAL_ARCH_FLAGS@@|-arch x86_64 -arch i386|
205:debug:patch Executing reinplace: /usr/bin/sed {s|@@UNIVERSAL_ARCH_FLAGS@@|-arch x86_64 -arch i386|} </opt/local/var/macports/build/_opt_local_var_macports_sources_rsync.macports.org_macports_release_tarballs_ports_lang_python310/python310/work/Python-3.10.8/configure >@file19
206:debug:patch euid/egid changed to: 0/0
207:debug:patch chowned /opt/local/var/macports/build/_opt_local_var_macports_sources_rsync.macports.org_macports_release_tarballs_ports_lang_python310/python310/work/Python-3.10.8/configure to macports
208:debug:patch euid/egid changed to: 502/501
209:debug:patch euid/egid changed to: 0/0
210:debug:patch setting attributes on /opt/local/var/macports/build/_opt_local_var_macports_sources_rsync.macports.org_macports_release_tarballs_ports_lang_python310/python310/work/Python-3.10.8/configure
211:debug:patch euid/egid changed to: 502/501
212:info:patch --->  Patching configure: s|@@LIPO_32BIT_FLAGS@@|-extract i386|
213:debug:patch Executing reinplace: /usr/bin/sed {s|@@LIPO_32BIT_FLAGS@@|-extract i386|} </opt/local/var/macports/build/_opt_local_var_macports_sources_rsync.macports.org_macports_release_tarballs_ports_lang_python310/python310/work/Python-3.10.8/configure >@file19
214:debug:patch euid/egid changed to: 0/0
215:debug:patch chowned /opt/local/var/macports/build/_opt_local_var_macports_sources_rsync.macports.org_macports_release_tarballs_ports_lang_python310/python310/work/Python-3.10.8/configure to macports
216:debug:patch euid/egid changed to: 502/501
217:debug:patch euid/egid changed to: 0/0
218:debug:patch setting attributes on /opt/local/var/macports/build/_opt_local_var_macports_sources_rsync.macports.org_macports_release_tarballs_ports_lang_python310/python310/work/Python-3.10.8/configure
219:debug:patch euid/egid changed to: 502/501
220:info:patch --->  Patching configure: s|@@LIPO_INTEL64_FLAGS@@||
221:debug:patch Executing reinplace: /usr/bin/sed s|@@LIPO_INTEL64_FLAGS@@|| </opt/local/var/macports/build/_opt_local_var_macports_sources_rsync.macports.org_macports_release_tarballs_ports_lang_python310/python310/work/Python-3.10.8/configure >@file19
222:debug:patch euid/egid changed to: 0/0
223:debug:patch chowned /opt/local/var/macports/build/_opt_local_var_macports_sources_rsync.macports.org_macports_release_tarballs_ports_lang_python310/python310/work/Python-3.10.8/configure to macports
224:debug:patch euid/egid changed to: 502/501
225:debug:patch euid/egid changed to: 0/0
226:debug:patch setting attributes on /opt/local/var/macports/build/_opt_local_var_macports_sources_rsync.macports.org_macports_release_tarballs_ports_lang_python310/python310/work/Python-3.10.8/configure
227:debug:patch euid/egid changed to: 502/501
228:info:patch --->  Patching configure: s|@@ARCH_RUN_32BIT@@|/usr/bin/arch -i386|
229:debug:patch Executing reinplace: /usr/bin/sed {s|@@ARCH_RUN_32BIT@@|/usr/bin/arch -i386|} </opt/local/var/macports/build/_opt_local_var_macports_sources_rsync.macports.org_macports_release_tarballs_ports_lang_python310/python310/work/Python-3.10.8/configure >@file19
230:debug:patch euid/egid changed to: 0/0
231:debug:patch chowned /opt/local/var/macports/build/_opt_local_var_macports_sources_rsync.macports.org_macports_release_tarballs_ports_lang_python310/python310/work/Python-3.10.8/configure to macports
232:debug:patch euid/egid changed to: 502/501
233:debug:patch euid/egid changed to: 0/0
234:debug:patch setting attributes on /opt/local/var/macports/build/_opt_local_var_macports_sources_rsync.macports.org_macports_release_tarballs_ports_lang_python310/python310/work/Python-3.10.8/configure
235:debug:patch euid/egid changed to: 502/501
236:debug:patch Privilege de-escalation not attempted as not running as root.
237:debug:configure configure phase started at Thu Nov 24 08:39:50 PST 2022
238:notice:configure --->  Configuring python310
239:debug:configure Preferred compilers: clang macports-clang-14 macports-clang-13 macports-clang-12 macports-clang-11 macports-clang-10 macports-clang-9.0 macports-clang-8.0 macports-clang-7.0 macports-clang-6.0 macports-clang-5.0
240:debug:configure Using compiler 'Xcode Clang'
241:debug:configure Executing org.macports.configure (python310)
242:debug:configure Environment:
243:debug:configure CC='/usr/bin/clang'
244:debug:configure CC_PRINT_OPTIONS='YES'
245:debug:configure CC_PRINT_OPTIONS_FILE='/opt/local/var/macports/build/_opt_local_var_macports_sources_rsync.macports.org_macports_release_tarballs_ports_lang_python310/python310/work/.CC_PRINT_OPTIONS'
246:debug:configure CFLAGS='-pipe -Os -isysroot/Library/Developer/CommandLineTools/SDKs/MacOSX10.13.sdk -arch x86_64 -arch i386'
247:debug:configure CPATH='/opt/local/include'
248:debug:configure CPPFLAGS='-I/opt/local/include -isysroot/Library/Developer/CommandLineTools/SDKs/MacOSX10.13.sdk'
249:debug:configure CXX='/usr/bin/clang++'
250:debug:configure CXXFLAGS='-pipe -Os -stdlib=libc++ -isysroot/Library/Developer/CommandLineTools/SDKs/MacOSX10.13.sdk -arch x86_64 -arch i386'
251:debug:configure DEVELOPER_DIR='/Library/Developer/CommandLineTools'
252:debug:configure F90FLAGS='-pipe -Os'
253:debug:configure FCFLAGS='-pipe -Os'
254:debug:configure FFLAGS='-pipe -Os'
255:debug:configure INSTALL='/usr/bin/install -c'
256:debug:configure LDFLAGS='-L/opt/local/lib -Wl,-headerpad_max_install_names -Wl,-syslibroot,/Library/Developer/CommandLineTools/SDKs/MacOSX10.13.sdk -arch x86_64 -arch i386'
257:debug:configure LIBRARY_PATH='/opt/local/lib'
258:debug:configure MACOSX_DEPLOYMENT_TARGET='10.13'
259:debug:configure OBJC='/usr/bin/clang'
260:debug:configure OBJCFLAGS='-pipe -Os -isysroot/Library/Developer/CommandLineTools/SDKs/MacOSX10.13.sdk -arch x86_64 -arch i386'
261:debug:configure OBJCXX='/usr/bin/clang++'
262:debug:configure OBJCXXFLAGS='-pipe -Os -stdlib=libc++ -isysroot/Library/Developer/CommandLineTools/SDKs/MacOSX10.13.sdk -arch x86_64 -arch i386'
263:debug:configure PKG_CONFIG_ALLOW_SYSTEM_CFLAGS='1'
264:debug:configure SDKROOT='/Library/Developer/CommandLineTools/SDKs/MacOSX10.13.sdk'
265:debug:configure SETUPTOOLS_USE_DISTUTILS='stdlib'
266:info:configure Executing:  cd "/opt/local/var/macports/build/_opt_local_var_macports_sources_rsync.macports.org_macports_release_tarballs_ports_lang_python310/python310/work/Python-3.10.8" && ./configure --prefix=/opt/local --disable-dependency-tracking --enable-framework=/opt/local/Library/Frameworks --enable-ipv6 --enable-loadable-sqlite-extensions --with-computed-gotos --with-ensurepip=no --with-readline=editline --with-system-expat --with-system-ffi --enable-universalsdk=/Library/Developer/CommandLineTools/SDKs/MacOSX10.13.sdk --enable-optimizations --with-lto
267:debug:configure system:  cd "/opt/local/var/macports/build/_opt_local_var_macports_sources_rsync.macports.org_macports_release_tarballs_ports_lang_python310/python310/work/Python-3.10.8" && ./configure --prefix=/opt/local --disable-dependency-tracking --enable-framework=/opt/local/Library/Frameworks --enable-ipv6 --enable-loadable-sqlite-extensions --with-computed-gotos --with-ensurepip=no --with-readline=editline --with-system-expat --with-system-ffi --enable-universalsdk=/Library/Developer/CommandLineTools/SDKs/MacOSX10.13.sdk --enable-optimizations --with-lto
268:info:configure configure: WARNING: unrecognized options: --disable-dependency-tracking
269:info:configure checking build system type... x86_64-apple-darwin18.7.0
270:info:configure checking host system type... x86_64-apple-darwin18.7.0
271:info:configure checking for python3.10... no
272:info:configure checking for python3... no
273:info:configure checking for python... python
274:info:configure checking for --enable-universalsdk... /Library/Developer/CommandLineTools/SDKs/MacOSX10.13.sdk
275:info:configure checking for --with-universal-archs... intel
276:info:configure checking MACHDEP... "darwin"
277:info:configure checking for gcc... /usr/bin/clang
278:info:configure checking whether the C compiler works... yes
279:info:configure checking for C compiler default output file name... a.out
280:info:configure checking for suffix of executables...
281:info:configure checking whether we are cross compiling... no
282:info:configure checking for suffix of object files... o
283:info:configure checking whether we are using the GNU C compiler... yes
284:info:configure checking whether /usr/bin/clang accepts -g... yes
285:info:configure checking for /usr/bin/clang option to accept ISO C89... none needed
286:info:configure checking how to run the C preprocessor... /usr/bin/clang -E
287:info:configure checking for grep that handles long lines and -e... /usr/bin/grep
288:info:configure checking for a sed that does not truncate output... /opt/local/bin/gsed
289:info:configure checking for --with-cxx-main=<compiler>... no
290:info:configure checking for the platform triplet based on compiler characteristics... darwin
291:info:configure checking for multiarch...
292:info:configure checking for -Wl,--no-as-needed... no
293:info:configure checking for egrep... /usr/bin/grep -E
294:info:configure checking for ANSI C header files... yes
295:info:configure checking for sys/types.h... yes
296:info:configure checking for sys/stat.h... yes
297:info:configure checking for stdlib.h... yes
298:info:configure checking for string.h... yes
299:info:configure checking for memory.h... yes
300:info:configure checking for strings.h... yes
301:info:configure checking for inttypes.h... yes
302:info:configure checking for stdint.h... yes
303:info:configure checking for unistd.h... yes
304:info:configure checking minix/config.h usability... no
305:info:configure checking minix/config.h presence... no
306:info:configure checking for minix/config.h... no
307:info:configure checking whether it is safe to define __EXTENSIONS__... yes
308:info:configure checking for the Android API level... not Android
309:info:configure checking for --with-suffix...
310:info:configure checking for case-insensitive build directory... yes
311:info:configure checking LIBRARY... libpython$(VERSION)$(ABIFLAGS).a
312:info:configure checking LINKCC... $(PURIFY) $(MAINCC)
313:info:configure checking EXPORTSYMS...
314:info:configure checking for GNU ld... no
315:info:configure checking for --enable-shared... no
316:info:configure checking for --enable-profiling... no
317:info:configure checking LDLIBRARY... $(PYTHONFRAMEWORKDIR)/Versions/$(VERSION)/$(PYTHONFRAMEWORK)
318:info:configure checking for ar... ar
319:info:configure checking for readelf... no
320:info:configure checking for a BSD-compatible install... /usr/bin/install -c
321:info:configure checking for a thread-safe mkdir -p... /opt/local/bin/gmkdir -p
322:info:configure checking for --with-pydebug... no
323:info:configure checking for --with-trace-refs... no
324:info:configure checking for --with-assertions... no
325:info:configure checking for --enable-optimizations... yes
326:info:configure checking PROFILE_TASK... -m test --pgo --timeout=$(TESTTIMEOUT)
327:info:configure checking for --with-lto... yes
328:info:configure checking for llvm-ar... no
329:info:configure configure: llvm-ar found via xcrun: /usr/bin/xcrun ar
330:info:configure checking for llvm-profdata... no
331:info:configure configure: llvm-profdata found via xcrun: /usr/bin/xcrun llvm-profdata
332:info:configure checking for -Wextra... yes
333:info:configure checking whether /usr/bin/clang accepts and needs -fno-strict-aliasing... no
334:info:configure checking if we can turn off /usr/bin/clang unused result warning... yes
335:info:configure checking if we can turn off /usr/bin/clang unused parameter warning... yes
336:info:configure checking if we can turn off /usr/bin/clang missing field initializers warning... yes
337:info:configure checking if we can turn on /usr/bin/clang mixed sign comparison warning... yes
338:info:configure checking if we can turn on /usr/bin/clang unreachable code warning... yes
339:info:configure checking if we can turn on /usr/bin/clang strict-prototypes warning... yes
340:info:configure checking if we can make implicit function declaration an error in /usr/bin/clang... yes
341:info:configure checking if we can use visibility in /usr/bin/clang... yes
342:info:configure checking which MACOSX_DEPLOYMENT_TARGET to use... 10.13
343:info:configure checking if specified universal architectures work... yes
344:info:configure checking whether pthreads are available without options... yes
345:info:configure checking whether /usr/bin/clang++ also accepts flags for thread support... no
346:info:configure checking for ANSI C header files... (cached) yes
347:info:configure checking asm/types.h usability... no
348:info:configure checking asm/types.h presence... no
349:info:configure checking for asm/types.h... no
350:info:configure checking crypt.h usability... no
351:info:configure checking crypt.h presence... no
352:info:configure checking for crypt.h... no
353:info:configure checking conio.h usability... no
354:info:configure checking conio.h presence... no
355:info:configure checking for conio.h... no
356:info:configure checking direct.h usability... no
357:info:configure checking direct.h presence... no
358:info:configure checking for direct.h... no
359:info:configure checking dlfcn.h usability... yes
360:info:configure checking dlfcn.h presence... yes
361:info:configure checking for dlfcn.h... yes
362:info:configure checking errno.h usability... yes
363:info:configure checking errno.h presence... yes
364:info:configure checking for errno.h... yes
365:info:configure checking fcntl.h usability... yes
366:info:configure checking fcntl.h presence... yes
367:info:configure checking for fcntl.h... yes
368:info:configure checking grp.h usability... yes
369:info:configure checking grp.h presence... yes
370:info:configure checking for grp.h... yes
371:info:configure checking ieeefp.h usability... no
372:info:configure checking ieeefp.h presence... no
373:info:configure checking for ieeefp.h... no
374:info:configure checking io.h usability... no
375:info:configure checking io.h presence... no
376:info:configure checking for io.h... no
377:info:configure checking langinfo.h usability... yes
378:info:configure checking langinfo.h presence... yes
379:info:configure checking for langinfo.h... yes
380:info:configure checking libintl.h usability... yes
381:info:configure checking libintl.h presence... yes
382:info:configure checking for libintl.h... yes
383:info:configure checking process.h usability... no
384:info:configure checking process.h presence... no
385:info:configure checking for process.h... no
386:info:configure checking pthread.h usability... yes
387:info:configure checking pthread.h presence... yes
388:info:configure checking for pthread.h... yes
389:info:configure checking sched.h usability... yes
390:info:configure checking sched.h presence... yes
391:info:configure checking for sched.h... yes
392:info:configure checking shadow.h usability... no
393:info:configure checking shadow.h presence... no
394:info:configure checking for shadow.h... no
395:info:configure checking signal.h usability... yes
396:info:configure checking signal.h presence... yes
397:info:configure checking for signal.h... yes
398:info:configure checking stropts.h usability... no
399:info:configure checking stropts.h presence... no
400:info:configure checking for stropts.h... no
401:info:configure checking termios.h usability... yes
402:info:configure checking termios.h presence... yes
403:info:configure checking for termios.h... yes
404:info:configure checking utime.h usability... yes
405:info:configure checking utime.h presence... yes
406:info:configure checking for utime.h... yes
407:info:configure checking poll.h usability... yes
408:info:configure checking poll.h presence... yes
409:info:configure checking for poll.h... yes
410:info:configure checking sys/devpoll.h usability... no
411:info:configure checking sys/devpoll.h presence... no
412:info:configure checking for sys/devpoll.h... no
413:info:configure checking sys/epoll.h usability... no
414:info:configure checking sys/epoll.h presence... no
415:info:configure checking for sys/epoll.h... no
416:info:configure checking sys/poll.h usability... yes
417:info:configure checking sys/poll.h presence... yes
418:info:configure checking for sys/poll.h... yes
419:info:configure checking sys/audioio.h usability... no
420:info:configure checking sys/audioio.h presence... no
421:info:configure checking for sys/audioio.h... no
422:info:configure checking sys/xattr.h usability... yes
423:info:configure checking sys/xattr.h presence... yes
424:info:configure checking for sys/xattr.h... yes
425:info:configure checking sys/bsdtty.h usability... no
426:info:configure checking sys/bsdtty.h presence... no
427:info:configure checking for sys/bsdtty.h... no
428:info:configure checking sys/event.h usability... yes
429:info:configure checking sys/event.h presence... yes
430:info:configure checking for sys/event.h... yes
431:info:configure checking sys/file.h usability... yes
432:info:configure checking sys/file.h presence... yes
433:info:configure checking for sys/file.h... yes
434:info:configure checking sys/ioctl.h usability... yes
435:info:configure checking sys/ioctl.h presence... yes
436:info:configure checking for sys/ioctl.h... yes
437:info:configure checking sys/kern_control.h usability... yes
438:info:configure checking sys/kern_control.h presence... yes
439:info:configure checking for sys/kern_control.h... yes
440:info:configure checking sys/loadavg.h usability... no
441:info:configure checking sys/loadavg.h presence... no
442:info:configure checking for sys/loadavg.h... no
443:info:configure checking sys/lock.h usability... yes
444:info:configure checking sys/lock.h presence... yes
445:info:configure checking for sys/lock.h... yes
446:info:configure checking sys/mkdev.h usability... no
447:info:configure checking sys/mkdev.h presence... no
448:info:configure checking for sys/mkdev.h... no
449:info:configure checking sys/modem.h usability... no
450:info:configure checking sys/modem.h presence... no
451:info:configure checking for sys/modem.h... no
452:info:configure checking sys/param.h usability... yes
453:info:configure checking sys/param.h presence... yes
454:info:configure checking for sys/param.h... yes
455:info:configure checking sys/random.h usability... yes
456:info:configure checking sys/random.h presence... yes
457:info:configure checking for sys/random.h... yes
458:info:configure checking sys/select.h usability... yes
459:info:configure checking sys/select.h presence... yes
460:info:configure checking for sys/select.h... yes
461:info:configure checking sys/sendfile.h usability... no
462:info:configure checking sys/sendfile.h presence... no
463:info:configure checking for sys/sendfile.h... no
464:info:configure checking sys/socket.h usability... yes
465:info:configure checking sys/socket.h presence... yes
466:info:configure checking for sys/socket.h... yes
467:info:configure checking sys/statvfs.h usability... yes
468:info:configure checking sys/statvfs.h presence... yes
469:info:configure checking for sys/statvfs.h... yes
470:info:configure checking for sys/stat.h... (cached) yes
471:info:configure checking sys/syscall.h usability... yes
472:info:configure checking sys/syscall.h presence... yes
473:info:configure checking for sys/syscall.h... yes
474:info:configure checking sys/sys_domain.h usability... yes
475:info:configure checking sys/sys_domain.h presence... yes
476:info:configure checking for sys/sys_domain.h... yes
477:info:configure checking sys/termio.h usability... no
478:info:configure checking sys/termio.h presence... no
479:info:configure checking for sys/termio.h... no
480:info:configure checking sys/time.h usability... yes
481:info:configure checking sys/time.h presence... yes
482:info:configure checking for sys/time.h... yes
483:info:configure checking sys/times.h usability... yes
484:info:configure checking sys/times.h presence... yes
485:info:configure checking for sys/times.h... yes
486:info:configure checking for sys/types.h... (cached) yes
487:info:configure checking sys/uio.h usability... yes
488:info:configure checking sys/uio.h presence... yes
489:info:configure checking for sys/uio.h... yes
490:info:configure checking sys/un.h usability... yes
491:info:configure checking sys/un.h presence... yes
492:info:configure checking for sys/un.h... yes
493:info:configure checking sys/utsname.h usability... yes
494:info:configure checking sys/utsname.h presence... yes
495:info:configure checking for sys/utsname.h... yes
496:info:configure checking sys/wait.h usability... yes
497:info:configure checking sys/wait.h presence... yes
498:info:configure checking for sys/wait.h... yes
499:info:configure checking pty.h usability... no
500:info:configure checking pty.h presence... no
501:info:configure checking for pty.h... no
502:info:configure checking libutil.h usability... no
503:info:configure checking libutil.h presence... no
504:info:configure checking for libutil.h... no
505:info:configure checking sys/resource.h usability... yes
506:info:configure checking sys/resource.h presence... yes
507:info:configure checking for sys/resource.h... yes
508:info:configure checking netpacket/packet.h usability... no
509:info:configure checking netpacket/packet.h presence... no
510:info:configure checking for netpacket/packet.h... no
511:info:configure checking sysexits.h usability... yes
512:info:configure checking sysexits.h presence... yes
513:info:configure checking for sysexits.h... yes
514:info:configure checking bluetooth.h usability... no
515:info:configure checking bluetooth.h presence... no
516:info:configure checking for bluetooth.h... no
517:info:configure checking linux/tipc.h usability... no
518:info:configure checking linux/tipc.h presence... no
519:info:configure checking for linux/tipc.h... no
520:info:configure checking linux/random.h usability... no
521:info:configure checking linux/random.h presence... no
522:info:configure checking for linux/random.h... no
523:info:configure checking spawn.h usability... yes
524:info:configure checking spawn.h presence... yes
525:info:configure checking for spawn.h... yes
526:info:configure checking util.h usability... yes
527:info:configure checking util.h presence... yes
528:info:configure checking for util.h... yes
529:info:configure checking alloca.h usability... yes
530:info:configure checking alloca.h presence... yes
531:info:configure checking for alloca.h... yes
532:info:configure checking endian.h usability... no
533:info:configure checking endian.h presence... no
534:info:configure checking for endian.h... no
535:info:configure checking sys/endian.h usability... no
536:info:configure checking sys/endian.h presence... no
537:info:configure checking for sys/endian.h... no
538:info:configure checking sys/sysmacros.h usability... no
539:info:configure checking sys/sysmacros.h presence... no
540:info:configure checking for sys/sysmacros.h... no
541:info:configure checking linux/auxvec.h usability... no
542:info:configure checking linux/auxvec.h presence... no
543:info:configure checking for linux/auxvec.h... no
544:info:configure checking sys/auxv.h usability... no
545:info:configure checking sys/auxv.h presence... no
546:info:configure checking for sys/auxv.h... no
547:info:configure checking linux/memfd.h usability... no
548:info:configure checking linux/memfd.h presence... no
549:info:configure checking for linux/memfd.h... no
550:info:configure checking linux/wait.h usability... no
551:info:configure checking linux/wait.h presence... no
552:info:configure checking for linux/wait.h... no
553:info:configure checking sys/memfd.h usability... no
554:info:configure checking sys/memfd.h presence... no
555:info:configure checking for sys/memfd.h... no
556:info:configure checking sys/mman.h usability... yes
557:info:configure checking sys/mman.h presence... yes
558:info:configure checking for sys/mman.h... yes
559:info:configure checking sys/eventfd.h usability... no
560:info:configure checking sys/eventfd.h presence... no
561:info:configure checking for sys/eventfd.h... no
562:info:configure checking for dirent.h that defines DIR... yes
563:info:configure checking for library containing opendir... none required
564:info:configure checking whether sys/types.h defines makedev... yes
565:info:configure checking bluetooth/bluetooth.h usability... no
566:info:configure checking bluetooth/bluetooth.h presence... no
567:info:configure checking for bluetooth/bluetooth.h... no
568:info:configure checking for net/if.h... yes
569:info:configure checking for linux/netlink.h... no
570:info:configure checking for linux/qrtr.h... no
571:info:configure checking for linux/vm_sockets.h... no
572:info:configure checking for linux/can.h... no
573:info:configure checking for linux/can/bcm.h... no
574:info:configure checking for linux/can/j1939.h... no
575:info:configure checking for linux/can/raw.h... no
576:info:configure checking for clock_t in time.h... yes
577:info:configure checking for makedev... yes
578:info:configure checking for le64toh... no
579:info:configure checking for mode_t... yes
580:info:configure checking for off_t... yes
581:info:configure checking for pid_t... yes
582:info:configure checking for size_t... yes
583:info:configure checking for uid_t in sys/types.h... yes
584:info:configure checking for ssize_t... yes
585:info:configure checking for __uint128_t... no
586:info:configure checking size of int... 4
587:info:configure checking size of long... 8
588:info:configure checking alignment of long... 8
589:info:configure checking size of long long... 8
590:info:configure checking size of void *... 8
591:info:configure checking size of short... 2
592:info:configure checking size of float... 4
593:info:configure checking size of double... 8
594:info:configure checking size of fpos_t... 8
595:info:configure checking size of size_t... 8
596:info:configure checking alignment of size_t... 8
597:info:configure checking size of pid_t... 4
598:info:configure checking size of uintptr_t... 8
599:info:configure checking for long double... yes
600:info:configure checking size of long double... 16
601:info:configure checking size of _Bool... 1
602:info:configure checking size of off_t... 8
603:info:configure checking whether to enable large file support... no
604:info:configure checking size of time_t... 8
605:info:configure checking for pthread_t... yes
606:info:configure checking size of pthread_t... 8
607:info:configure checking size of pthread_key_t... 8
608:info:configure checking whether pthread_key_t is compatible with int... no
609:info:configure checking for --enable-framework... yes
610:info:configure checking for dyld... always on for Darwin
611:info:configure checking for --with-address-sanitizer... no
612:info:configure checking for --with-memory-sanitizer... no
613:info:configure checking for --with-undefined-behavior-sanitizer... no
614:info:configure checking the extension of shared libraries... .so
615:info:configure checking LDSHARED... $(CC) -bundle -undefined dynamic_lookup
616:info:configure checking CCSHARED...
617:info:configure checking LINKFORSHARED... -Wl,-stack_size,1000000  -framework CoreFoundation $(PYTHONFRAMEWORKDIR)/Versions/$(VERSION)/$(PYTHONFRAMEWORK)
618:info:configure checking CFLAGSFORSHARED... $(CCSHARED)
619:info:configure checking SHLIBS... $(LIBS)
620:info:configure checking for sendfile in -lsendfile... no
621:info:configure checking for dlopen in -ldl... yes
622:info:configure checking for shl_load in -ldld... no
623:info:configure checking uuid/uuid.h usability... yes
624:info:configure checking uuid/uuid.h presence... yes
625:info:configure checking for uuid/uuid.h... yes
626:info:configure checking uuid.h usability... no
627:info:configure checking uuid.h presence... no
628:info:configure checking for uuid.h... no
629:info:configure checking for uuid_generate_time_safe... no
630:info:configure checking for uuid_generate_time in -luuid... no
631:info:configure checking for uuid_create... no
632:info:configure checking for uuid_enc_be... no
633:info:configure checking for library containing sem_init... none required
634:info:configure checking for textdomain in -lintl... yes
635:info:configure checking aligned memory access is required... no
636:info:configure checking for --with-hash-algorithm... default
637:info:configure checking for --with-tzpath... "/usr/share/zoneinfo:/usr/lib/zoneinfo:/usr/share/lib/zoneinfo:/etc/zoneinfo"
638:info:configure checking for t_open in -lnsl... no
639:info:configure checking for socket in -lsocket... no
640:info:configure checking for --with-libs... no
641:info:configure checking for pkg-config... /opt/local/bin/pkg-config
642:info:configure checking pkg-config is at least version 0.9.0... yes
643:info:configure checking for --with-system-expat... yes
644:info:configure checking for --with-system-ffi... yes
645:info:configure checking for --with-system-libmpdec... no
646:info:configure checking for --with-decimal-contextvar... yes
647:info:configure checking for --enable-loadable-sqlite-extensions... yes
648:info:configure checking for --with-tcltk-includes... default
649:info:configure checking for --with-tcltk-libs... default
650:info:configure checking for --with-dbmliborder...
651:info:configure checking if PTHREAD_SCOPE_SYSTEM is supported... yes
652:info:configure checking for pthread_sigmask... yes
653:info:configure checking for pthread_getcpuclockid... no
654:info:configure checking if --enable-ipv6 is specified... yes
655:info:configure checking ipv6 stack type... kame
656:info:configure using libc
657:info:configure checking for CAN_RAW_FD_FRAMES... no
658:info:configure checking for CAN_RAW_JOIN_FILTERS... no
659:info:configure checking for --with-doc-strings... yes
660:info:configure checking for --with-pymalloc... yes
661:info:configure checking for --with-c-locale-coercion... yes
662:info:configure checking for --with-valgrind... no
663:info:configure checking for --with-dtrace... no
664:info:configure checking for dlopen... yes
665:info:configure checking DYNLOADFILE... dynload_shlib.o
666:info:configure checking MACHDEP_OBJS... none
667:info:configure checking for alarm... yes
668:info:configure checking for accept4... no
669:info:configure checking for setitimer... yes
670:info:configure checking for getitimer... yes
671:info:configure checking for bind_textdomain_codeset... yes
672:info:configure checking for chown... yes
673:info:configure checking for clock... yes
674:info:configure checking for confstr... yes
675:info:configure checking for close_range... no
676:info:configure checking for copy_file_range... no
677:info:configure checking for ctermid... yes
678:info:configure checking for dup3... no
679:info:configure checking for execv... yes
680:info:configure checking for explicit_bzero... no
681:info:configure checking for explicit_memset... no
682:info:configure checking for faccessat... yes
683:info:configure checking for fchmod... yes
684:info:configure checking for fchmodat... yes
685:info:configure checking for fchown... yes
686:info:configure checking for fchownat... yes
687:info:configure checking for fdwalk... no
688:info:configure checking for fexecve... no
689:info:configure checking for fdopendir... yes
690:info:configure checking for fork... yes
691:info:configure checking for fpathconf... yes
692:info:configure checking for fstatat... yes
693:info:configure checking for ftime... yes
694:info:configure checking for ftruncate... yes
695:info:configure checking for futimesat... no
696:info:configure checking for futimens... yes
697:info:configure checking for futimes... yes
698:info:configure checking for gai_strerror... yes
699:info:configure checking for getentropy... yes
700:info:configure checking for getgrgid_r... yes
701:info:configure checking for getgrnam_r... yes
702:info:configure checking for getgrouplist... yes
703:info:configure checking for getgroups... yes
704:info:configure checking for getlogin... yes
705:info:configure checking for getloadavg... yes
706:info:configure checking for getpeername... yes
707:info:configure checking for getpgid... yes
708:info:configure checking for getpid... yes
709:info:configure checking for getpriority... yes
710:info:configure checking for getresuid... no
711:info:configure checking for getresgid... no
712:info:configure checking for getpwent... yes
713:info:configure checking for getpwnam_r... yes
714:info:configure checking for getpwuid_r... yes
715:info:configure checking for getspnam... no
716:info:configure checking for getspent... no
717:info:configure checking for getsid... yes
718:info:configure checking for getwd... yes
719:info:configure checking for if_nameindex... yes
720:info:configure checking for initgroups... yes
721:info:configure checking for kill... yes
722:info:configure checking for killpg... yes
723:info:configure checking for lchown... yes
724:info:configure checking for lockf... yes
725:info:configure checking for linkat... yes
726:info:configure checking for lstat... yes
727:info:configure checking for lutimes... yes
728:info:configure checking for mmap... yes
729:info:configure checking for memrchr... no
730:info:configure checking for mbrtowc... yes
731:info:configure checking for mkdirat... yes
732:info:configure checking for mkfifo... yes
733:info:configure checking for madvise... yes
734:info:configure checking for mkfifoat... no
735:info:configure checking for mknod... yes
736:info:configure checking for mknodat... no
737:info:configure checking for mktime... yes
738:info:configure checking for mremap... no
739:info:configure checking for nice... yes
740:info:configure checking for openat... yes
741:info:configure checking for pathconf... yes
742:info:configure checking for pause... yes
743:info:configure checking for pipe2... no
744:info:configure checking for plock... no
745:info:configure checking for poll... yes
746:info:configure checking for posix_fallocate... no
747:info:configure checking for posix_fadvise... no
748:info:configure checking for posix_spawn... yes
749:info:configure checking for posix_spawnp... yes
750:info:configure checking for pread... yes
751:info:configure checking for preadv... no
752:info:configure checking for preadv2... no
753:info:configure checking for pthread_condattr_setclock... no
754:info:configure checking for pthread_init... no
755:info:configure checking for pthread_kill... yes
756:info:configure checking for pwrite... yes
757:info:configure checking for pwritev... no
758:info:configure checking for pwritev2... no
759:info:configure checking for readlink... yes
760:info:configure checking for readlinkat... yes
761:info:configure checking for readv... yes
762:info:configure checking for realpath... yes
763:info:configure checking for renameat... yes
764:info:configure checking for sem_open... yes
765:info:configure checking for sem_timedwait... no
766:info:configure checking for sem_clockwait... no
767:info:configure checking for sem_getvalue... yes
768:info:configure checking for sem_unlink... yes
769:info:configure checking for sendfile... yes
770:info:configure checking for setegid... yes
771:info:configure checking for seteuid... yes
772:info:configure checking for setgid... yes
773:info:configure checking for sethostname... yes
774:info:configure checking for setlocale... yes
775:info:configure checking for setregid... yes
776:info:configure checking for setreuid... yes
777:info:configure checking for setresuid... no
778:info:configure checking for setresgid... no
779:info:configure checking for setsid... yes
780:info:configure checking for setpgid... yes
781:info:configure checking for setpgrp... yes
782:info:configure checking for setpriority... yes
783:info:configure checking for setuid... yes
784:info:configure checking for setvbuf... yes
785:info:configure checking for sched_get_priority_max... yes
786:info:configure checking for sched_setaffinity... no
787:info:configure checking for sched_setscheduler... no
788:info:configure checking for sched_setparam... no
789:info:configure checking for sched_rr_get_interval... no
790:info:configure checking for sigaction... yes
791:info:configure checking for sigaltstack... yes
792:info:configure checking for sigfillset... yes
793:info:configure checking for siginterrupt... yes
794:info:configure checking for sigpending... yes
795:info:configure checking for sigrelse... yes
796:info:configure checking for sigtimedwait... no
797:info:configure checking for sigwait... yes
798:info:configure checking for sigwaitinfo... no
799:info:configure checking for snprintf... yes
800:info:configure checking for splice... no
801:info:configure checking for strftime... yes
802:info:configure checking for strlcpy... yes
803:info:configure checking for strsignal... yes
804:info:configure checking for symlinkat... yes
805:info:configure checking for sync... yes
806:info:configure checking for sysconf... yes
807:info:configure checking for tcgetpgrp... yes
808:info:configure checking for tcsetpgrp... yes
809:info:configure checking for tempnam... yes
810:info:configure checking for timegm... yes
811:info:configure checking for times... yes
812:info:configure checking for tmpfile... yes
813:info:configure checking for tmpnam... yes
814:info:configure checking for tmpnam_r... no
815:info:configure checking for truncate... yes
816:info:configure checking for uname... yes
817:info:configure checking for unlinkat... yes
818:info:configure checking for utimensat... yes
819:info:configure checking for utimes... yes
820:info:configure checking for vfork... yes
821:info:configure checking for waitid... yes
822:info:configure checking for waitpid... yes
823:info:configure checking for wait3... yes
824:info:configure checking for wait4... yes
825:info:configure checking for wcscoll... yes
826:info:configure checking for wcsftime... yes
827:info:configure checking for wcsxfrm... yes
828:info:configure checking for wmemcmp... yes
829:info:configure checking for writev... yes
830:info:configure checking for _getpty... no
831:info:configure checking for rtpSpawn... no
832:info:configure checking for lchmod... yes
833:info:configure checking whether dirfd is declared... yes
834:info:configure checking for chroot... yes
835:info:configure checking for link... yes
836:info:configure checking for symlink... yes
837:info:configure checking for fchdir... yes
838:info:configure checking for fsync... yes
839:info:configure checking for fdatasync... no
840:info:configure checking for epoll... no
841:info:configure checking for epoll_create1... no
842:info:configure checking for kqueue... yes
843:info:configure checking for prlimit... no
844:info:configure checking for _dyld_shared_cache_contains_path... no
845:info:configure checking for memfd_create... no
846:info:configure checking for eventfd... no
847:info:configure checking for ctermid_r... yes
848:info:configure checking for flock declaration... yes
849:info:configure checking for flock... yes
850:info:configure checking for getpagesize... yes
851:info:configure checking for broken unsetenv... no
852:info:configure checking for true... true
853:info:configure checking for inet_aton in -lc... yes
854:info:configure checking for chflags... yes
855:info:configure checking for lchflags... yes
856:info:configure checking for inflateCopy in -lz... yes
857:info:configure checking for hstrerror... yes
858:info:configure checking for inet_aton... yes
859:info:configure checking for inet_pton... yes
860:info:configure checking for setgroups... yes
861:info:configure checking for openpty... yes
862:info:configure checking for forkpty... yes
863:info:configure checking for fseek64... no
864:info:configure checking for fseeko... yes
865:info:configure checking for fstatvfs... yes
866:info:configure checking for ftell64... no
867:info:configure checking for ftello... yes
868:info:configure checking for statvfs... yes
869:info:configure checking for dup2... yes
870:info:configure checking for getpgrp... yes
871:info:configure checking for setpgrp... (cached) yes
872:info:configure checking for library containing crypt... none required
873:info:configure checking for library containing crypt_r... no
874:info:configure checking for crypt_r... no
875:info:configure checking for clock_gettime... yes
876:info:configure checking for clock_getres... yes
877:info:configure checking for clock_settime... yes
878:info:configure checking for major... yes
879:info:configure checking for getaddrinfo... yes
880:info:configure checking getaddrinfo bug... no
881:info:configure checking for getnameinfo... yes
882:info:configure checking whether time.h and sys/time.h may both be included... yes
883:info:configure checking whether struct tm is in sys/time.h or time.h... time.h
884:info:configure checking for struct tm.tm_zone... yes
885:info:configure checking for struct stat.st_rdev... yes
886:info:configure checking for struct stat.st_blksize... yes
887:info:configure checking for struct stat.st_flags... yes
888:info:configure checking for struct stat.st_gen... yes
889:info:configure checking for struct stat.st_birthtime... yes
890:info:configure checking for struct stat.st_blocks... yes
891:info:configure checking for struct passwd.pw_gecos... yes
892:info:configure checking for struct passwd.pw_passwd... yes
893:info:configure checking for siginfo_t.si_band... yes
894:info:configure checking for time.h that defines altzone... no
895:info:configure checking whether sys/select.h and sys/time.h may both be included... yes
896:info:configure checking for addrinfo... yes
897:info:configure checking for sockaddr_storage... yes
898:info:configure checking for sockaddr_alg... no
899:info:configure checking for an ANSI C-conforming const... yes
900:info:configure checking for working signed char... yes
901:info:configure checking for prototypes... yes
902:info:configure checking for variable length prototypes and stdarg.h... yes
903:info:configure checking for socketpair... yes
904:info:configure checking if sockaddr has sa_len member... yes
905:info:configure checking for gethostbyname_r... no
906:info:configure checking for gethostbyname... yes
907:info:configure checking for __fpu_control... no
908:info:configure checking for __fpu_control in -lieee... no
909:info:configure checking for --with-libm=STRING... default LIBM=""
910:info:configure checking for --with-libc=STRING... default LIBC=""
911:info:configure checking for x64 gcc inline assembler... no
912:info:configure checking whether float word ordering is bigendian... no
913:info:configure checking whether we can use gcc inline assembler to get and set x87 control word... yes
914:info:configure checking whether we can use gcc inline assembler to get and set mc68881 fpcr... no
915:info:configure checking for x87-style double rounding... no
916:info:configure checking for acosh... yes
917:info:configure checking for asinh... yes
918:info:configure checking for atanh... yes
919:info:configure checking for copysign... yes
920:info:configure checking for erf... yes
921:info:configure checking for erfc... yes
922:info:configure checking for expm1... yes
923:info:configure checking for finite... yes
924:info:configure checking for gamma... yes
925:info:configure checking for hypot... yes
926:info:configure checking for lgamma... yes
927:info:configure checking for log1p... yes
928:info:configure checking for log2... yes
929:info:configure checking for round... yes
930:info:configure checking for tgamma... yes
931:info:configure checking whether isinf is declared... yes
932:info:configure checking whether isnan is declared... yes
933:info:configure checking whether isfinite is declared... yes
934:info:configure checking whether POSIX semaphores are enabled... yes
935:info:configure checking for broken sem_getvalue... yes
936:info:configure checking whether RTLD_LAZY is declared... yes
937:info:configure checking whether RTLD_NOW is declared... yes
938:info:configure checking whether RTLD_GLOBAL is declared... yes
939:info:configure checking whether RTLD_LOCAL is declared... yes
940:info:configure checking whether RTLD_NODELETE is declared... yes
941:info:configure checking whether RTLD_NOLOAD is declared... yes
942:info:configure checking whether RTLD_DEEPBIND is declared... no
943:info:configure checking whether RTLD_MEMBER is declared... no
944:info:configure checking digit size for Python's longs... no value specified
945:info:configure checking wchar.h usability... yes
946:info:configure checking wchar.h presence... yes
947:info:configure checking for wchar.h... yes
948:info:configure checking size of wchar_t... 4
949:info:configure checking for UCS-4 tcl... no
950:info:configure checking whether wchar_t is signed... yes
951:info:configure checking whether wchar_t is usable... no
952:info:configure checking whether byte ordering is bigendian... universal
953:info:configure checking ABIFLAGS...
954:info:configure checking SOABI... cpython-310-darwin
955:info:configure checking LDVERSION... $(VERSION)$(ABIFLAGS)
956:info:configure checking for --with-platlibdir... no
957:info:configure checking for --with-wheel-pkg-dir... no
958:info:configure checking whether right shift extends the sign bit... yes
959:info:configure checking for getc_unlocked() and friends... yes
960:info:configure checking how to link readline libs... -ledit
961:info:configure checking whether rl_completion_append_character is declared... yes
962:info:configure checking whether rl_completion_suppress_append is declared... yes
963:info:configure checking for rl_pre_input_hook in -ledit... yes
964:info:configure checking for rl_completion_display_matches_hook in -ledit... yes
965:info:configure checking for rl_resize_terminal in -ledit... yes
966:info:configure checking for rl_completion_matches in -ledit... yes
967:info:configure checking whether rl_catch_signals is declared... yes
968:info:configure checking for append_history in -ledit... yes
969:info:configure checking for broken nice()... no
970:info:configure checking for broken poll()... no
971:info:configure checking for working tzset()... yes
972:info:configure checking for tv_nsec in struct stat... no
973:info:configure checking for tv_nsec2 in struct stat... yes
974:info:configure checking curses.h usability... yes
975:info:configure checking curses.h presence... yes
976:info:configure checking for curses.h... yes
977:info:configure checking ncurses.h usability... yes
978:info:configure checking ncurses.h presence... yes
979:info:configure checking for ncurses.h... yes
980:info:configure checking for term.h... yes
981:info:configure checking whether mvwdelch is an expression... yes
982:info:configure checking whether WINDOW has _flags... yes
983:info:configure checking for is_pad... yes
984:info:configure checking for is_term_resized... yes
985:info:configure checking for resize_term... yes
986:info:configure checking for resizeterm... yes
987:info:configure checking for immedok... yes
988:info:configure checking for syncok... yes
989:info:configure checking for wchgat... yes
990:info:configure checking for filter... yes
991:info:configure checking for has_key... yes
992:info:configure checking for typeahead... yes
993:info:configure checking for use_env... yes
994:info:configure configure: checking for device files
995:info:configure checking for /dev/ptmx... yes
996:info:configure checking for /dev/ptc... no
997:info:configure checking for %zd printf() format support... yes
998:info:configure checking for socklen_t... yes
999:info:configure checking for broken mbstowcs... no
1000:info:configure checking for --with-computed-gotos... yes
1001:info:configure checking whether /usr/bin/clang supports computed gotos... yes
1002:info:configure checking for build directories... done
1003:info:configure checking for -O2... yes
1004:info:configure checking for glibc _FORTIFY_SOURCE/memmove bug... no
1005:info:configure checking for stdatomic.h... yes
1006:info:configure checking for builtin __atomic_load_n and __atomic_store_n functions... yes
1007:info:configure checking for ensurepip... no
1008:info:configure checking if the dirent structure of a d_type field... yes
1009:info:configure checking for the Linux getrandom() syscall... no
1010:info:configure checking for the getrandom() function... no
1011:info:configure checking for library containing shm_open... none required
1012:info:configure checking for sys/mman.h... (cached) yes
1013:info:configure checking for shm_open... yes
1014:info:configure checking for shm_unlink... yes
1015:info:configure checking for pkg-config... /opt/local/bin/pkg-config
1016:info:configure checking whether compiling and linking against OpenSSL works... yes
1017:info:configure checking for --with-openssl-rpath...
1018:info:configure checking whether OpenSSL provides required APIs... yes
1019:info:configure checking for --with-ssl-default-suites... python
1020:info:configure checking for --with-builtin-hashlib-hashes... md5,sha1,sha256,sha512,sha3,blake2
1021:info:configure checking for --with-experimental-isolated-subinterpreters... no
1022:info:configure checking for --with-static-libpython... yes
1023:info:configure checking for --disable-test-modules... no
1024:info:configure configure: creating ./config.status
1025:info:configure config.status: creating Mac/Makefile
1026:info:configure config.status: creating Mac/PythonLauncher/Makefile
1027:info:configure config.status: creating Mac/Resources/framework/Info.plist
1028:info:configure config.status: creating Mac/Resources/app/Info.plist
1029:info:configure config.status: creating Makefile.pre
1030:info:configure config.status: creating Misc/python.pc
1031:info:configure config.status: creating Misc/python-embed.pc
1032:info:configure config.status: creating Misc/python-config.sh
1033:info:configure config.status: creating Modules/ld_so_aix
1034:info:configure config.status: creating pyconfig.h
1035:info:configure configure: WARNING: unrecognized options: --disable-dependency-tracking
1036:info:configure creating Modules/Setup.local
1037:info:configure creating Makefile
1038:debug:configure Executing proc-post-org.macports.configure-configure-0
1039:debug:configure Executing proc-post-org.macports.configure-configure-1
1040:debug:configure system -W /opt/local/var/macports/build/_opt_local_var_macports_sources_rsync.macports.org_macports_release_tarballs_ports_lang_python310/python310/work/Python-3.10.8: ed - pyconfig.h < /opt/local/var/macports/sources/rsync.macports.org/macports/release/tarballs/ports/lang/python310/files/pyconfig.h-universal.ed
1041:debug:configure Executing portconfigure::configure_finish
1042:debug:configure Ignoring implicit declaration of function 'le64toh' because it is whitelisted
1043:debug:configure Ignoring implicit declaration of function 'le64toh' because it is whitelisted
1044:debug:configure Ignoring implicit declaration of function 'eventfd' because it is whitelisted
1045:debug:configure Ignoring implicit declaration of function 'getrandom' because it is whitelisted
1046:debug:configure Privilege de-escalation not attempted as not running as root.
1047:debug:build build phase started at Thu Nov 24 08:41:29 PST 2022
1048:notice:build --->  Building python310
1049:debug:build Executing org.macports.build (python310)
1050:debug:build Environment:
1051:debug:build CC_PRINT_OPTIONS='YES'
1052:debug:build CC_PRINT_OPTIONS_FILE='/opt/local/var/macports/build/_opt_local_var_macports_sources_rsync.macports.org_macports_release_tarballs_ports_lang_python310/python310/work/.CC_PRINT_OPTIONS'
1053:debug:build CPATH='/opt/local/include'
1054:debug:build DEVELOPER_DIR='/Library/Developer/CommandLineTools'
1055:debug:build LIBRARY_PATH='/opt/local/lib'
1056:debug:build MACOSX_DEPLOYMENT_TARGET='10.13'
1057:debug:build SDKROOT='/Library/Developer/CommandLineTools/SDKs/MacOSX10.13.sdk'
1058:debug:build SETUPTOOLS_USE_DISTUTILS='stdlib'
1059:info:build Executing:  cd "/opt/local/var/macports/build/_opt_local_var_macports_sources_rsync.macports.org_macports_release_tarballs_ports_lang_python310/python310/work/Python-3.10.8" && /usr/bin/make -j4 -w all
1060:debug:build system:  cd "/opt/local/var/macports/build/_opt_local_var_macports_sources_rsync.macports.org_macports_release_tarballs_ports_lang_python310/python310/work/Python-3.10.8" && /usr/bin/make -j4 -w all
1061:info:build make: Entering directory `/opt/local/var/macports/build/_opt_local_var_macports_sources_rsync.macports.org_macports_release_tarballs_ports_lang_python310/python310/work/Python-3.10.8'
1062:info:build Running code to generate profile data (this can take a while):
1063:info:build # First, we need to create a clean build with profile generation
1064:info:build # enabled.
1065:info:build /Library/Developer/CommandLineTools/usr/bin/make profile-gen-stamp
1066:info:build make[1]: Entering directory `/opt/local/var/macports/build/_opt_local_var_macports_sources_rsync.macports.org_macports_release_tarballs_ports_lang_python310/python310/work/Python-3.10.8'
1067:info:build /Library/Developer/CommandLineTools/usr/bin/make clean
1068:info:build make[2]: Entering directory `/opt/local/var/macports/build/_opt_local_var_macports_sources_rsync.macports.org_macports_release_tarballs_ports_lang_python310/python310/work/Python-3.10.8'
1069:info:build find . -depth -name '__pycache__' -exec rm -rf {} ';'
1070:info:build find . -name '*.py[co]' -exec rm -f {} ';'
1071:info:build find . -name '*.[oa]' -exec rm -f {} ';'
1072:info:build find . -name '*.s[ol]' -exec rm -f {} ';'
1073:info:build find . -name '*.so.[0-9]*.[0-9]*' -exec rm -f {} ';'
1074:info:build find . -name '*.lst' -exec rm -f {} ';'
1075:info:build find build -name 'fficonfig.h' -exec rm -f {} ';' || true
1076:info:build find: build: No such file or directory
1077:info:build find build -name '*.py' -exec rm -f {} ';' || true
1078:info:build find: build: No such file or directory
1079:info:build find build -name '*.py[co]' -exec rm -f {} ';' || true
1080:info:build find: build: No such file or directory
1081:info:build rm -f pybuilddir.txt
1082:info:build rm -f Lib/lib2to3/*Grammar*.pickle
1083:info:build rm -f Programs/_testembed Programs/_freeze_importlib
1084:info:build find build -type f -a ! -name '*.gc??' -exec rm -f {} ';'
1085:info:build find: build: No such file or directory
1086:info:build make[2]: [clean-retain-profile] Error 1 (ignored)
1087:info:build rm -f Include/pydtrace_probes.h
1088:info:build rm -f profile-gen-stamp
1089:info:build make[3]: Entering directory `/opt/local/var/macports/build/_opt_local_var_macports_sources_rsync.macports.org_macports_release_tarballs_ports_lang_python310/python310/work/Python-3.10.8'
1090:info:build find . -name '*.gc??' -exec rm -f {} ';'
1091:info:build find . -name '*.profclang?' -exec rm -f {} ';'
1092:info:build find . -name '*.dyn' -exec rm -f {} ';'
1093:info:build rm -f /opt/local/var/macports/build/_opt_local_var_macports_sources_rsync.macports.org_macports_release_tarballs_ports_lang_python310/python310/work/Python-3.10.8/coverage.info
1094:info:build rm -rf /opt/local/var/macports/build/_opt_local_var_macports_sources_rsync.macports.org_macports_release_tarballs_ports_lang_python310/python310/work/Python-3.10.8/lcov-report
1095:info:build rm -f profile-run-stamp
1096:info:build make[3]: Leaving directory `/opt/local/var/macports/build/_opt_local_var_macports_sources_rsync.macports.org_macports_release_tarballs_ports_lang_python310/python310/work/Python-3.10.8'
1097:info:build make[2]: Leaving directory `/opt/local/var/macports/build/_opt_local_var_macports_sources_rsync.macports.org_macports_release_tarballs_ports_lang_python310/python310/work/Python-3.10.8'
1098:info:build touch profile-clean-stamp
1099:info:build Building with support for profile generation:
1100:info:build /Library/Developer/CommandLineTools/usr/bin/make build_all_generate_profile
1101:info:build make[2]: Entering directory `/opt/local/var/macports/build/_opt_local_var_macports_sources_rsync.macports.org_macports_release_tarballs_ports_lang_python310/python310/work/Python-3.10.8'
1102:info:build /Library/Developer/CommandLineTools/usr/bin/make build_all CFLAGS_NODIST=" -fprofile-instr-generate" LDFLAGS_NODIST=" -fprofile-instr-generate" LIBS="-lintl -ldl   -framework CoreFoundation"
1103:info:build make[3]: Entering directory `/opt/local/var/macports/build/_opt_local_var_macports_sources_rsync.macports.org_macports_release_tarballs_ports_lang_python310/python310/work/Python-3.10.8'
1104:info:build /usr/bin/clang -c -Wno-unused-result -Wsign-compare -Wunreachable-code -fno-common -dynamic -DNDEBUG -g -fwrapv -O3 -Wall -arch x86_64 -arch i386 -isysroot /Library/Developer/CommandLineTools/SDKs/MacOSX10.13.sdk -pipe -Os -isysroot/Library/Developer/CommandLineTools/SDKs/MacOSX10.13.sdk -arch x86_64 -arch i386   -flto -std=c99 -Wextra -Wno-unused-result -Wno-unused-parameter -Wno-missing-field-initializers -Wstrict-prototypes -Werror=implicit-function-declaration -fvisibility=hidden -fprofile-instr-generate -I./Include/internal  -I. -I./Include -isysroot /Library/Developer/CommandLineTools/SDKs/MacOSX10.13.sdk -I/opt/local/include -isysroot/Library/Developer/CommandLineTools/SDKs/MacOSX10.13.sdk   -DPy_BUILD_CORE -o Programs/python.o ./Programs/python.c
1105:info:build /usr/bin/clang -c -Wno-unused-result -Wsign-compare -Wunreachable-code -fno-common -dynamic -DNDEBUG -g -fwrapv -O3 -Wall -arch x86_64 -arch i386 -isysroot /Library/Developer/CommandLineTools/SDKs/MacOSX10.13.sdk -pipe -Os -isysroot/Library/Developer/CommandLineTools/SDKs/MacOSX10.13.sdk -arch x86_64 -arch i386   -flto -std=c99 -Wextra -Wno-unused-result -Wno-unused-parameter -Wno-missing-field-initializers -Wstrict-prototypes -Werror=implicit-function-declaration -fvisibility=hidden -fprofile-instr-generate -I./Include/internal  -I. -I./Include -isysroot /Library/Developer/CommandLineTools/SDKs/MacOSX10.13.sdk -I/opt/local/include -isysroot/Library/Developer/CommandLineTools/SDKs/MacOSX10.13.sdk   -DPy_BUILD_CORE -o Parser/token.o Parser/token.c
1106:info:build /usr/bin/clang -c -Wno-unused-result -Wsign-compare -Wunreachable-code -fno-common -dynamic -DNDEBUG -g -fwrapv -O3 -Wall -arch x86_64 -arch i386 -isysroot /Library/Developer/CommandLineTools/SDKs/MacOSX10.13.sdk -pipe -Os -isysroot/Library/Developer/CommandLineTools/SDKs/MacOSX10.13.sdk -arch x86_64 -arch i386   -flto -std=c99 -Wextra -Wno-unused-result -Wno-unused-parameter -Wno-missing-field-initializers -Wstrict-prototypes -Werror=implicit-function-declaration -fvisibility=hidden -fprofile-instr-generate -I./Include/internal  -I. -I./Include -isysroot /Library/Developer/CommandLineTools/SDKs/MacOSX10.13.sdk -I/opt/local/include -isysroot/Library/Developer/CommandLineTools/SDKs/MacOSX10.13.sdk   -DPy_BUILD_CORE -o Parser/pegen.o Parser/pegen.c
1107:info:build /usr/bin/clang -c -Wno-unused-result -Wsign-compare -Wunreachable-code -fno-common -dynamic -DNDEBUG -g -fwrapv -O3 -Wall -arch x86_64 -arch i386 -isysroot /Library/Developer/CommandLineTools/SDKs/MacOSX10.13.sdk -pipe -Os -isysroot/Library/Developer/CommandLineTools/SDKs/MacOSX10.13.sdk -arch x86_64 -arch i386   -flto -std=c99 -Wextra -Wno-unused-result -Wno-unused-parameter -Wno-missing-field-initializers -Wstrict-prototypes -Werror=implicit-function-declaration -fvisibility=hidden -fprofile-instr-generate -I./Include/internal  -I. -I./Include -isysroot /Library/Developer/CommandLineTools/SDKs/MacOSX10.13.sdk -I/opt/local/include -isysroot/Library/Developer/CommandLineTools/SDKs/MacOSX10.13.sdk   -DPy_BUILD_CORE -o Parser/parser.o Parser/parser.c
1108:info:build /usr/bin/clang -c -Wno-unused-result -Wsign-compare -Wunreachable-code -fno-common -dynamic -DNDEBUG -g -fwrapv -O3 -Wall -arch x86_64 -arch i386 -isysroot /Library/Developer/CommandLineTools/SDKs/MacOSX10.13.sdk -pipe -Os -isysroot/Library/Developer/CommandLineTools/SDKs/MacOSX10.13.sdk -arch x86_64 -arch i386   -flto -std=c99 -Wextra -Wno-unused-result -Wno-unused-parameter -Wno-missing-field-initializers -Wstrict-prototypes -Werror=implicit-function-declaration -fvisibility=hidden -fprofile-instr-generate -I./Include/internal  -I. -I./Include -isysroot /Library/Developer/CommandLineTools/SDKs/MacOSX10.13.sdk -I/opt/local/include -isysroot/Library/Developer/CommandLineTools/SDKs/MacOSX10.13.sdk   -DPy_BUILD_CORE -o Parser/string_parser.o Parser/string_parser.c
1109:info:build /usr/bin/clang -c -Wno-unused-result -Wsign-compare -Wunreachable-code -fno-common -dynamic -DNDEBUG -g -fwrapv -O3 -Wall -arch x86_64 -arch i386 -isysroot /Library/Developer/CommandLineTools/SDKs/MacOSX10.13.sdk -pipe -Os -isysroot/Library/Developer/CommandLineTools/SDKs/MacOSX10.13.sdk -arch x86_64 -arch i386   -flto -std=c99 -Wextra -Wno-unused-result -Wno-unused-parameter -Wno-missing-field-initializers -Wstrict-prototypes -Werror=implicit-function-declaration -fvisibility=hidden -fprofile-instr-generate -I./Include/internal  -I. -I./Include -isysroot /Library/Developer/CommandLineTools/SDKs/MacOSX10.13.sdk -I/opt/local/include -isysroot/Library/Developer/CommandLineTools/SDKs/MacOSX10.13.sdk   -DPy_BUILD_CORE -o Parser/peg_api.o Parser/peg_api.c
1110:info:build /usr/bin/clang -c -Wno-unused-result -Wsign-compare -Wunreachable-code -fno-common -dynamic -DNDEBUG -g -fwrapv -O3 -Wall -arch x86_64 -arch i386 -isysroot /Library/Developer/CommandLineTools/SDKs/MacOSX10.13.sdk -pipe -Os -isysroot/Library/Developer/CommandLineTools/SDKs/MacOSX10.13.sdk -arch x86_64 -arch i386   -flto -std=c99 -Wextra -Wno-unused-result -Wno-unused-parameter -Wno-missing-field-initializers -Wstrict-prototypes -Werror=implicit-function-declaration -fvisibility=hidden -fprofile-instr-generate -I./Include/internal  -I. -I./Include -isysroot /Library/Developer/CommandLineTools/SDKs/MacOSX10.13.sdk -I/opt/local/include -isysroot/Library/Developer/CommandLineTools/SDKs/MacOSX10.13.sdk   -DPy_BUILD_CORE -o Parser/myreadline.o Parser/myreadline.c
1111:info:build /usr/bin/clang -c -Wno-unused-result -Wsign-compare -Wunreachable-code -fno-common -dynamic -DNDEBUG -g -fwrapv -O3 -Wall -arch x86_64 -arch i386 -isysroot /Library/Developer/CommandLineTools/SDKs/MacOSX10.13.sdk -pipe -Os -isysroot/Library/Developer/CommandLineTools/SDKs/MacOSX10.13.sdk -arch x86_64 -arch i386   -flto -std=c99 -Wextra -Wno-unused-result -Wno-unused-parameter -Wno-missing-field-initializers -Wstrict-prototypes -Werror=implicit-function-declaration -fvisibility=hidden -fprofile-instr-generate -I./Include/internal  -I. -I./Include -isysroot /Library/Developer/CommandLineTools/SDKs/MacOSX10.13.sdk -I/opt/local/include -isysroot/Library/Developer/CommandLineTools/SDKs/MacOSX10.13.sdk   -DPy_BUILD_CORE -o Parser/tokenizer.o Parser/tokenizer.c
1112:info:build /usr/bin/clang -c -Wno-unused-result -Wsign-compare -Wunreachable-code -fno-common -dynamic -DNDEBUG -g -fwrapv -O3 -Wall -arch x86_64 -arch i386 -isysroot /Library/Developer/CommandLineTools/SDKs/MacOSX10.13.sdk -pipe -Os -isysroot/Library/Developer/CommandLineTools/SDKs/MacOSX10.13.sdk -arch x86_64 -arch i386   -flto -std=c99 -Wextra -Wno-unused-result -Wno-unused-parameter -Wno-missing-field-initializers -Wstrict-prototypes -Werror=implicit-function-declaration -fvisibility=hidden -fprofile-instr-generate -I./Include/internal  -I. -I./Include -isysroot /Library/Developer/CommandLineTools/SDKs/MacOSX10.13.sdk -I/opt/local/include -isysroot/Library/Developer/CommandLineTools/SDKs/MacOSX10.13.sdk   -DPy_BUILD_CORE -o Objects/abstract.o Objects/abstract.c
1113:info:build /usr/bin/clang -c -Wno-unused-result -Wsign-compare -Wunreachable-code -fno-common -dynamic -DNDEBUG -g -fwrapv -O3 -Wall -arch x86_64 -arch i386 -isysroot /Library/Developer/CommandLineTools/SDKs/MacOSX10.13.sdk -pipe -Os -isysroot/Library/Developer/CommandLineTools/SDKs/MacOSX10.13.sdk -arch x86_64 -arch i386   -flto -std=c99 -Wextra -Wno-unused-result -Wno-unused-parameter -Wno-missing-field-initializers -Wstrict-prototypes -Werror=implicit-function-declaration -fvisibility=hidden -fprofile-instr-generate -I./Include/internal  -I. -I./Include -isysroot /Library/Developer/CommandLineTools/SDKs/MacOSX10.13.sdk -I/opt/local/include -isysroot/Library/Developer/CommandLineTools/SDKs/MacOSX10.13.sdk   -DPy_BUILD_CORE -o Objects/accu.o Objects/accu.c
1114:info:build /usr/bin/clang -c -Wno-unused-result -Wsign-compare -Wunreachable-code -fno-common -dynamic -DNDEBUG -g -fwrapv -O3 -Wall -arch x86_64 -arch i386 -isysroot /Library/Developer/CommandLineTools/SDKs/MacOSX10.13.sdk -pipe -Os -isysroot/Library/Developer/CommandLineTools/SDKs/MacOSX10.13.sdk -arch x86_64 -arch i386   -flto -std=c99 -Wextra -Wno-unused-result -Wno-unused-parameter -Wno-missing-field-initializers -Wstrict-prototypes -Werror=implicit-function-declaration -fvisibility=hidden -fprofile-instr-generate -I./Include/internal  -I. -I./Include -isysroot /Library/Developer/CommandLineTools/SDKs/MacOSX10.13.sdk -I/opt/local/include -isysroot/Library/Developer/CommandLineTools/SDKs/MacOSX10.13.sdk   -DPy_BUILD_CORE -o Objects/boolobject.o Objects/boolobject.c
1115:info:build /usr/bin/clang -c -Wno-unused-result -Wsign-compare -Wunreachable-code -fno-common -dynamic -DNDEBUG -g -fwrapv -O3 -Wall -arch x86_64 -arch i386 -isysroot /Library/Developer/CommandLineTools/SDKs/MacOSX10.13.sdk -pipe -Os -isysroot/Library/Developer/CommandLineTools/SDKs/MacOSX10.13.sdk -arch x86_64 -arch i386   -flto -std=c99 -Wextra -Wno-unused-result -Wno-unused-parameter -Wno-missing-field-initializers -Wstrict-prototypes -Werror=implicit-function-declaration -fvisibility=hidden -fprofile-instr-generate -I./Include/internal  -I. -I./Include -isysroot /Library/Developer/CommandLineTools/SDKs/MacOSX10.13.sdk -I/opt/local/include -isysroot/Library/Developer/CommandLineTools/SDKs/MacOSX10.13.sdk   -DPy_BUILD_CORE -o Objects/bytes_methods.o Objects/bytes_methods.c
1116:info:build /usr/bin/clang -c -Wno-unused-result -Wsign-compare -Wunreachable-code -fno-common -dynamic -DNDEBUG -g -fwrapv -O3 -Wall -arch x86_64 -arch i386 -isysroot /Library/Developer/CommandLineTools/SDKs/MacOSX10.13.sdk -pipe -Os -isysroot/Library/Developer/CommandLineTools/SDKs/MacOSX10.13.sdk -arch x86_64 -arch i386   -flto -std=c99 -Wextra -Wno-unused-result -Wno-unused-parameter -Wno-missing-field-initializers -Wstrict-prototypes -Werror=implicit-function-declaration -fvisibility=hidden -fprofile-instr-generate -I./Include/internal  -I. -I./Include -isysroot /Library/Developer/CommandLineTools/SDKs/MacOSX10.13.sdk -I/opt/local/include -isysroot/Library/Developer/CommandLineTools/SDKs/MacOSX10.13.sdk   -DPy_BUILD_CORE -o Objects/bytearrayobject.o Objects/bytearrayobject.c
1117:info:build /usr/bin/clang -c -Wno-unused-result -Wsign-compare -Wunreachable-code -fno-common -dynamic -DNDEBUG -g -fwrapv -O3 -Wall -arch x86_64 -arch i386 -isysroot /Library/Developer/CommandLineTools/SDKs/MacOSX10.13.sdk -pipe -Os -isysroot/Library/Developer/CommandLineTools/SDKs/MacOSX10.13.sdk -arch x86_64 -arch i386   -flto -std=c99 -Wextra -Wno-unused-result -Wno-unused-parameter -Wno-missing-field-initializers -Wstrict-prototypes -Werror=implicit-function-declaration -fvisibility=hidden -fprofile-instr-generate -I./Include/internal  -I. -I./Include -isysroot /Library/Developer/CommandLineTools/SDKs/MacOSX10.13.sdk -I/opt/local/include -isysroot/Library/Developer/CommandLineTools/SDKs/MacOSX10.13.sdk   -DPy_BUILD_CORE -o Objects/bytesobject.o Objects/bytesobject.c
1118:info:build In file included from Objects/bytes_methods.c:435:
1119:info:build Objects/stringlib/fastsearch.h:333:19: warning: comparison of integers of different signs: 'Py_ssize_t' (aka 'long') and 'unsigned int' [-Wsign-compare]
1120:info:build         if (shift > SHIFT_OVERFLOW) {
1121:info:build             ~~~~~ ^ ~~~~~~~~~~~~~~
1122:info:build 1 warning generated.
1123:info:build /usr/bin/clang -c -Wno-unused-result -Wsign-compare -Wunreachable-code -fno-common -dynamic -DNDEBUG -g -fwrapv -O3 -Wall -arch x86_64 -arch i386 -isysroot /Library/Developer/CommandLineTools/SDKs/MacOSX10.13.sdk -pipe -Os -isysroot/Library/Developer/CommandLineTools/SDKs/MacOSX10.13.sdk -arch x86_64 -arch i386   -flto -std=c99 -Wextra -Wno-unused-result -Wno-unused-parameter -Wno-missing-field-initializers -Wstrict-prototypes -Werror=implicit-function-declaration -fvisibility=hidden -fprofile-instr-generate -I./Include/internal  -I. -I./Include -isysroot /Library/Developer/CommandLineTools/SDKs/MacOSX10.13.sdk -I/opt/local/include -isysroot/Library/Developer/CommandLineTools/SDKs/MacOSX10.13.sdk   -DPy_BUILD_CORE -o Objects/call.o Objects/call.c
1124:info:build /usr/bin/clang -c -Wno-unused-result -Wsign-compare -Wunreachable-code -fno-common -dynamic -DNDEBUG -g -fwrapv -O3 -Wall -arch x86_64 -arch i386 -isysroot /Library/Developer/CommandLineTools/SDKs/MacOSX10.13.sdk -pipe -Os -isysroot/Library/Developer/CommandLineTools/SDKs/MacOSX10.13.sdk -arch x86_64 -arch i386   -flto -std=c99 -Wextra -Wno-unused-result -Wno-unused-parameter -Wno-missing-field-initializers -Wstrict-prototypes -Werror=implicit-function-declaration -fvisibility=hidden -fprofile-instr-generate -I./Include/internal  -I. -I./Include -isysroot /Library/Developer/CommandLineTools/SDKs/MacOSX10.13.sdk -I/opt/local/include -isysroot/Library/Developer/CommandLineTools/SDKs/MacOSX10.13.sdk   -DPy_BUILD_CORE -o Objects/capsule.o Objects/capsule.c
1125:info:build /usr/bin/clang -c -Wno-unused-result -Wsign-compare -Wunreachable-code -fno-common -dynamic -DNDEBUG -g -fwrapv -O3 -Wall -arch x86_64 -arch i386 -isysroot /Library/Developer/CommandLineTools/SDKs/MacOSX10.13.sdk -pipe -Os -isysroot/Library/Developer/CommandLineTools/SDKs/MacOSX10.13.sdk -arch x86_64 -arch i386   -flto -std=c99 -Wextra -Wno-unused-result -Wno-unused-parameter -Wno-missing-field-initializers -Wstrict-prototypes -Werror=implicit-function-declaration -fvisibility=hidden -fprofile-instr-generate -I./Include/internal  -I. -I./Include -isysroot /Library/Developer/CommandLineTools/SDKs/MacOSX10.13.sdk -I/opt/local/include -isysroot/Library/Developer/CommandLineTools/SDKs/MacOSX10.13.sdk   -DPy_BUILD_CORE -o Objects/cellobject.o Objects/cellobject.c
1126:info:build In file included from Objects/bytearrayobject.c:1103:
1127:info:build Objects/stringlib/fastsearch.h:333:19: warning: comparison of integers of different signs: 'Py_ssize_t' (aka 'long') and 'unsigned int' [-Wsign-compare]
1128:info:build         if (shift > SHIFT_OVERFLOW) {
1129:info:build             ~~~~~ ^ ~~~~~~~~~~~~~~
1130:info:build /usr/bin/clang -c -Wno-unused-result -Wsign-compare -Wunreachable-code -fno-common -dynamic -DNDEBUG -g -fwrapv -O3 -Wall -arch x86_64 -arch i386 -isysroot /Library/Developer/CommandLineTools/SDKs/MacOSX10.13.sdk -pipe -Os -isysroot/Library/Developer/CommandLineTools/SDKs/MacOSX10.13.sdk -arch x86_64 -arch i386   -flto -std=c99 -Wextra -Wno-unused-result -Wno-unused-parameter -Wno-missing-field-initializers -Wstrict-prototypes -Werror=implicit-function-declaration -fvisibility=hidden -fprofile-instr-generate -I./Include/internal  -I. -I./Include -isysroot /Library/Developer/CommandLineTools/SDKs/MacOSX10.13.sdk -I/opt/local/include -isysroot/Library/Developer/CommandLineTools/SDKs/MacOSX10.13.sdk   -DPy_BUILD_CORE -o Objects/classobject.o Objects/classobject.c
1131:info:build /usr/bin/clang -c -Wno-unused-result -Wsign-compare -Wunreachable-code -fno-common -dynamic -DNDEBUG -g -fwrapv -O3 -Wall -arch x86_64 -arch i386 -isysroot /Library/Developer/CommandLineTools/SDKs/MacOSX10.13.sdk -pipe -Os -isysroot/Library/Developer/CommandLineTools/SDKs/MacOSX10.13.sdk -arch x86_64 -arch i386   -flto -std=c99 -Wextra -Wno-unused-result -Wno-unused-parameter -Wno-missing-field-initializers -Wstrict-prototypes -Werror=implicit-function-declaration -fvisibility=hidden -fprofile-instr-generate -I./Include/internal  -I. -I./Include -isysroot /Library/Developer/CommandLineTools/SDKs/MacOSX10.13.sdk -I/opt/local/include -isysroot/Library/Developer/CommandLineTools/SDKs/MacOSX10.13.sdk   -DPy_BUILD_CORE -o Objects/codeobject.o Objects/codeobject.c
1132:info:build In file included from Objects/bytesobject.c:1279:
1133:info:build Objects/stringlib/fastsearch.h:333:19: warning: comparison of integers of different signs: 'Py_ssize_t' (aka 'long') and 'unsigned int' [-Wsign-compare]
1134:info:build         if (shift > SHIFT_OVERFLOW) {
1135:info:build             ~~~~~ ^ ~~~~~~~~~~~~~~
1136:info:build 1 warning generated.
1137:info:build /usr/bin/clang -c -Wno-unused-result -Wsign-compare -Wunreachable-code -fno-common -dynamic -DNDEBUG -g -fwrapv -O3 -Wall -arch x86_64 -arch i386 -isysroot /Library/Developer/CommandLineTools/SDKs/MacOSX10.13.sdk -pipe -Os -isysroot/Library/Developer/CommandLineTools/SDKs/MacOSX10.13.sdk -arch x86_64 -arch i386   -flto -std=c99 -Wextra -Wno-unused-result -Wno-unused-parameter -Wno-missing-field-initializers -Wstrict-prototypes -Werror=implicit-function-declaration -fvisibility=hidden -fprofile-instr-generate -I./Include/internal  -I. -I./Include -isysroot /Library/Developer/CommandLineTools/SDKs/MacOSX10.13.sdk -I/opt/local/include -isysroot/Library/Developer/CommandLineTools/SDKs/MacOSX10.13.sdk   -DPy_BUILD_CORE -o Objects/complexobject.o Objects/complexobject.c
1138:info:build /usr/bin/clang -c -Wno-unused-result -Wsign-compare -Wunreachable-code -fno-common -dynamic -DNDEBUG -g -fwrapv -O3 -Wall -arch x86_64 -arch i386 -isysroot /Library/Developer/CommandLineTools/SDKs/MacOSX10.13.sdk -pipe -Os -isysroot/Library/Developer/CommandLineTools/SDKs/MacOSX10.13.sdk -arch x86_64 -arch i386   -flto -std=c99 -Wextra -Wno-unused-result -Wno-unused-parameter -Wno-missing-field-initializers -Wstrict-prototypes -Werror=implicit-function-declaration -fvisibility=hidden -fprofile-instr-generate -I./Include/internal  -I. -I./Include -isysroot /Library/Developer/CommandLineTools/SDKs/MacOSX10.13.sdk -I/opt/local/include -isysroot/Library/Developer/CommandLineTools/SDKs/MacOSX10.13.sdk   -DPy_BUILD_CORE -o Objects/descrobject.o Objects/descrobject.c
1139:info:build /usr/bin/clang -c -Wno-unused-result -Wsign-compare -Wunreachable-code -fno-common -dynamic -DNDEBUG -g -fwrapv -O3 -Wall -arch x86_64 -arch i386 -isysroot /Library/Developer/CommandLineTools/SDKs/MacOSX10.13.sdk -pipe -Os -isysroot/Library/Developer/CommandLineTools/SDKs/MacOSX10.13.sdk -arch x86_64 -arch i386   -flto -std=c99 -Wextra -Wno-unused-result -Wno-unused-parameter -Wno-missing-field-initializers -Wstrict-prototypes -Werror=implicit-function-declaration -fvisibility=hidden -fprofile-instr-generate -I./Include/internal  -I. -I./Include -isysroot /Library/Developer/CommandLineTools/SDKs/MacOSX10.13.sdk -I/opt/local/include -isysroot/Library/Developer/CommandLineTools/SDKs/MacOSX10.13.sdk   -DPy_BUILD_CORE -o Objects/enumobject.o Objects/enumobject.c
1140:info:build /usr/bin/clang -c -Wno-unused-result -Wsign-compare -Wunreachable-code -fno-common -dynamic -DNDEBUG -g -fwrapv -O3 -Wall -arch x86_64 -arch i386 -isysroot /Library/Developer/CommandLineTools/SDKs/MacOSX10.13.sdk -pipe -Os -isysroot/Library/Developer/CommandLineTools/SDKs/MacOSX10.13.sdk -arch x86_64 -arch i386   -flto -std=c99 -Wextra -Wno-unused-result -Wno-unused-parameter -Wno-missing-field-initializers -Wstrict-prototypes -Werror=implicit-function-declaration -fvisibility=hidden -fprofile-instr-generate -I./Include/internal  -I. -I./Include -isysroot /Library/Developer/CommandLineTools/SDKs/MacOSX10.13.sdk -I/opt/local/include -isysroot/Library/Developer/CommandLineTools/SDKs/MacOSX10.13.sdk   -DPy_BUILD_CORE -o Objects/exceptions.o Objects/exceptions.c
1141:info:build /usr/bin/clang -c -Wno-unused-result -Wsign-compare -Wunreachable-code -fno-common -dynamic -DNDEBUG -g -fwrapv -O3 -Wall -arch x86_64 -arch i386 -isysroot /Library/Developer/CommandLineTools/SDKs/MacOSX10.13.sdk -pipe -Os -isysroot/Library/Developer/CommandLineTools/SDKs/MacOSX10.13.sdk -arch x86_64 -arch i386   -flto -std=c99 -Wextra -Wno-unused-result -Wno-unused-parameter -Wno-missing-field-initializers -Wstrict-prototypes -Werror=implicit-function-declaration -fvisibility=hidden -fprofile-instr-generate -I./Include/internal  -I. -I./Include -isysroot /Library/Developer/CommandLineTools/SDKs/MacOSX10.13.sdk -I/opt/local/include -isysroot/Library/Developer/CommandLineTools/SDKs/MacOSX10.13.sdk   -DPy_BUILD_CORE -o Objects/genericaliasobject.o Objects/genericaliasobject.c
1142:info:build 1 warning generated.
1143:info:build /usr/bin/clang -c -Wno-unused-result -Wsign-compare -Wunreachable-code -fno-common -dynamic -DNDEBUG -g -fwrapv -O3 -Wall -arch x86_64 -arch i386 -isysroot /Library/Developer/CommandLineTools/SDKs/MacOSX10.13.sdk -pipe -Os -isysroot/Library/Developer/CommandLineTools/SDKs/MacOSX10.13.sdk -arch x86_64 -arch i386   -flto -std=c99 -Wextra -Wno-unused-result -Wno-unused-parameter -Wno-missing-field-initializers -Wstrict-prototypes -Werror=implicit-function-declaration -fvisibility=hidden -fprofile-instr-generate -I./Include/internal  -I. -I./Include -isysroot /Library/Developer/CommandLineTools/SDKs/MacOSX10.13.sdk -I/opt/local/include -isysroot/Library/Developer/CommandLineTools/SDKs/MacOSX10.13.sdk   -DPy_BUILD_CORE -o Objects/genobject.o Objects/genobject.c
1144:info:build /usr/bin/clang -c -Wno-unused-result -Wsign-compare -Wunreachable-code -fno-common -dynamic -DNDEBUG -g -fwrapv -O3 -Wall -arch x86_64 -arch i386 -isysroot /Library/Developer/CommandLineTools/SDKs/MacOSX10.13.sdk -pipe -Os -isysroot/Library/Developer/CommandLineTools/SDKs/MacOSX10.13.sdk -arch x86_64 -arch i386   -flto -std=c99 -Wextra -Wno-unused-result -Wno-unused-parameter -Wno-missing-field-initializers -Wstrict-prototypes -Werror=implicit-function-declaration -fvisibility=hidden -fprofile-instr-generate -I./Include/internal  -I. -I./Include -isysroot /Library/Developer/CommandLineTools/SDKs/MacOSX10.13.sdk -I/opt/local/include -isysroot/Library/Developer/CommandLineTools/SDKs/MacOSX10.13.sdk   -DPy_BUILD_CORE -o Objects/fileobject.o Objects/fileobject.c
1145:info:build /usr/bin/clang -c -Wno-unused-result -Wsign-compare -Wunreachable-code -fno-common -dynamic -DNDEBUG -g -fwrapv -O3 -Wall -arch x86_64 -arch i386 -isysroot /Library/Developer/CommandLineTools/SDKs/MacOSX10.13.sdk -pipe -Os -isysroot/Library/Developer/CommandLineTools/SDKs/MacOSX10.13.sdk -arch x86_64 -arch i386   -flto -std=c99 -Wextra -Wno-unused-result -Wno-unused-parameter -Wno-missing-field-initializers -Wstrict-prototypes -Werror=implicit-function-declaration -fvisibility=hidden -fprofile-instr-generate -I./Include/internal  -I. -I./Include -isysroot /Library/Developer/CommandLineTools/SDKs/MacOSX10.13.sdk -I/opt/local/include -isysroot/Library/Developer/CommandLineTools/SDKs/MacOSX10.13.sdk   -DPy_BUILD_CORE -o Objects/floatobject.o Objects/floatobject.c
1146:info:build /usr/bin/clang -c -Wno-unused-result -Wsign-compare -Wunreachable-code -fno-common -dynamic -DNDEBUG -g -fwrapv -O3 -Wall -arch x86_64 -arch i386 -isysroot /Library/Developer/CommandLineTools/SDKs/MacOSX10.13.sdk -pipe -Os -isysroot/Library/Developer/CommandLineTools/SDKs/MacOSX10.13.sdk -arch x86_64 -arch i386   -flto -std=c99 -Wextra -Wno-unused-result -Wno-unused-parameter -Wno-missing-field-initializers -Wstrict-prototypes -Werror=implicit-function-declaration -fvisibility=hidden -fprofile-instr-generate -I./Include/internal  -I. -I./Include -isysroot /Library/Developer/CommandLineTools/SDKs/MacOSX10.13.sdk -I/opt/local/include -isysroot/Library/Developer/CommandLineTools/SDKs/MacOSX10.13.sdk   -DPy_BUILD_CORE -o Objects/frameobject.o Objects/frameobject.c
1147:info:build /usr/bin/clang -c -Wno-unused-result -Wsign-compare -Wunreachable-code -fno-common -dynamic -DNDEBUG -g -fwrapv -O3 -Wall -arch x86_64 -arch i386 -isysroot /Library/Developer/CommandLineTools/SDKs/MacOSX10.13.sdk -pipe -Os -isysroot/Library/Developer/CommandLineTools/SDKs/MacOSX10.13.sdk -arch x86_64 -arch i386   -flto -std=c99 -Wextra -Wno-unused-result -Wno-unused-parameter -Wno-missing-field-initializers -Wstrict-prototypes -Werror=implicit-function-declaration -fvisibility=hidden -fprofile-instr-generate -I./Include/internal  -I. -I./Include -isysroot /Library/Developer/CommandLineTools/SDKs/MacOSX10.13.sdk -I/opt/local/include -isysroot/Library/Developer/CommandLineTools/SDKs/MacOSX10.13.sdk   -DPy_BUILD_CORE -o Objects/funcobject.o Objects/funcobject.c
1148:info:build /usr/bin/clang -c -Wno-unused-result -Wsign-compare -Wunreachable-code -fno-common -dynamic -DNDEBUG -g -fwrapv -O3 -Wall -arch x86_64 -arch i386 -isysroot /Library/Developer/CommandLineTools/SDKs/MacOSX10.13.sdk -pipe -Os -isysroot/Library/Developer/CommandLineTools/SDKs/MacOSX10.13.sdk -arch x86_64 -arch i386   -flto -std=c99 -Wextra -Wno-unused-result -Wno-unused-parameter -Wno-missing-field-initializers -Wstrict-prototypes -Werror=implicit-function-declaration -fvisibility=hidden -fprofile-instr-generate -I./Include/internal  -I. -I./Include -isysroot /Library/Developer/CommandLineTools/SDKs/MacOSX10.13.sdk -I/opt/local/include -isysroot/Library/Developer/CommandLineTools/SDKs/MacOSX10.13.sdk   -DPy_BUILD_CORE -o Objects/interpreteridobject.o Objects/interpreteridobject.c
1149:info:build /usr/bin/clang -c -Wno-unused-result -Wsign-compare -Wunreachable-code -fno-common -dynamic -DNDEBUG -g -fwrapv -O3 -Wall -arch x86_64 -arch i386 -isysroot /Library/Developer/CommandLineTools/SDKs/MacOSX10.13.sdk -pipe -Os -isysroot/Library/Developer/CommandLineTools/SDKs/MacOSX10.13.sdk -arch x86_64 -arch i386   -flto -std=c99 -Wextra -Wno-unused-result -Wno-unused-parameter -Wno-missing-field-initializers -Wstrict-prototypes -Werror=implicit-function-declaration -fvisibility=hidden -fprofile-instr-generate -I./Include/internal  -I. -I./Include -isysroot /Library/Developer/CommandLineTools/SDKs/MacOSX10.13.sdk -I/opt/local/include -isysroot/Library/Developer/CommandLineTools/SDKs/MacOSX10.13.sdk   -DPy_BUILD_CORE -o Objects/iterobject.o Objects/iterobject.c
1150:info:build /usr/bin/clang -c -Wno-unused-result -Wsign-compare -Wunreachable-code -fno-common -dynamic -DNDEBUG -g -fwrapv -O3 -Wall -arch x86_64 -arch i386 -isysroot /Library/Developer/CommandLineTools/SDKs/MacOSX10.13.sdk -pipe -Os -isysroot/Library/Developer/CommandLineTools/SDKs/MacOSX10.13.sdk -arch x86_64 -arch i386   -flto -std=c99 -Wextra -Wno-unused-result -Wno-unused-parameter -Wno-missing-field-initializers -Wstrict-prototypes -Werror=implicit-function-declaration -fvisibility=hidden -fprofile-instr-generate -I./Include/internal  -I. -I./Include -isysroot /Library/Developer/CommandLineTools/SDKs/MacOSX10.13.sdk -I/opt/local/include -isysroot/Library/Developer/CommandLineTools/SDKs/MacOSX10.13.sdk   -DPy_BUILD_CORE -o Objects/listobject.o Objects/listobject.c
1151:info:build /usr/bin/clang -c -Wno-unused-result -Wsign-compare -Wunreachable-code -fno-common -dynamic -DNDEBUG -g -fwrapv -O3 -Wall -arch x86_64 -arch i386 -isysroot /Library/Developer/CommandLineTools/SDKs/MacOSX10.13.sdk -pipe -Os -isysroot/Library/Developer/CommandLineTools/SDKs/MacOSX10.13.sdk -arch x86_64 -arch i386   -flto -std=c99 -Wextra -Wno-unused-result -Wno-unused-parameter -Wno-missing-field-initializers -Wstrict-prototypes -Werror=implicit-function-declaration -fvisibility=hidden -fprofile-instr-generate -I./Include/internal  -I. -I./Include -isysroot /Library/Developer/CommandLineTools/SDKs/MacOSX10.13.sdk -I/opt/local/include -isysroot/Library/Developer/CommandLineTools/SDKs/MacOSX10.13.sdk   -DPy_BUILD_CORE -o Objects/longobject.o Objects/longobject.c
1152:info:build /usr/bin/clang -c -Wno-unused-result -Wsign-compare -Wunreachable-code -fno-common -dynamic -DNDEBUG -g -fwrapv -O3 -Wall -arch x86_64 -arch i386 -isysroot /Library/Developer/CommandLineTools/SDKs/MacOSX10.13.sdk -pipe -Os -isysroot/Library/Developer/CommandLineTools/SDKs/MacOSX10.13.sdk -arch x86_64 -arch i386   -flto -std=c99 -Wextra -Wno-unused-result -Wno-unused-parameter -Wno-missing-field-initializers -Wstrict-prototypes -Werror=implicit-function-declaration -fvisibility=hidden -fprofile-instr-generate -I./Include/internal  -I. -I./Include -isysroot /Library/Developer/CommandLineTools/SDKs/MacOSX10.13.sdk -I/opt/local/include -isysroot/Library/Developer/CommandLineTools/SDKs/MacOSX10.13.sdk   -DPy_BUILD_CORE -o Objects/dictobject.o Objects/dictobject.c
1153:info:build /usr/bin/clang -c -Wno-unused-result -Wsign-compare -Wunreachable-code -fno-common -dynamic -DNDEBUG -g -fwrapv -O3 -Wall -arch x86_64 -arch i386 -isysroot /Library/Developer/CommandLineTools/SDKs/MacOSX10.13.sdk -pipe -Os -isysroot/Library/Developer/CommandLineTools/SDKs/MacOSX10.13.sdk -arch x86_64 -arch i386   -flto -std=c99 -Wextra -Wno-unused-result -Wno-unused-parameter -Wno-missing-field-initializers -Wstrict-prototypes -Werror=implicit-function-declaration -fvisibility=hidden -fprofile-instr-generate -I./Include/internal  -I. -I./Include -isysroot /Library/Developer/CommandLineTools/SDKs/MacOSX10.13.sdk -I/opt/local/include -isysroot/Library/Developer/CommandLineTools/SDKs/MacOSX10.13.sdk   -DPy_BUILD_CORE -o Objects/odictobject.o Objects/odictobject.c
1154:info:build /usr/bin/clang -c -Wno-unused-result -Wsign-compare -Wunreachable-code -fno-common -dynamic -DNDEBUG -g -fwrapv -O3 -Wall -arch x86_64 -arch i386 -isysroot /Library/Developer/CommandLineTools/SDKs/MacOSX10.13.sdk -pipe -Os -isysroot/Library/Developer/CommandLineTools/SDKs/MacOSX10.13.sdk -arch x86_64 -arch i386   -flto -std=c99 -Wextra -Wno-unused-result -Wno-unused-parameter -Wno-missing-field-initializers -Wstrict-prototypes -Werror=implicit-function-declaration -fvisibility=hidden -fprofile-instr-generate -I./Include/internal  -I. -I./Include -isysroot /Library/Developer/CommandLineTools/SDKs/MacOSX10.13.sdk -I/opt/local/include -isysroot/Library/Developer/CommandLineTools/SDKs/MacOSX10.13.sdk   -DPy_BUILD_CORE -o Objects/memoryobject.o Objects/memoryobject.c
1155:info:build /usr/bin/clang -c -Wno-unused-result -Wsign-compare -Wunreachable-code -fno-common -dynamic -DNDEBUG -g -fwrapv -O3 -Wall -arch x86_64 -arch i386 -isysroot /Library/Developer/CommandLineTools/SDKs/MacOSX10.13.sdk -pipe -Os -isysroot/Library/Developer/CommandLineTools/SDKs/MacOSX10.13.sdk -arch x86_64 -arch i386   -flto -std=c99 -Wextra -Wno-unused-result -Wno-unused-parameter -Wno-missing-field-initializers -Wstrict-prototypes -Werror=implicit-function-declaration -fvisibility=hidden -fprofile-instr-generate -I./Include/internal  -I. -I./Include -isysroot /Library/Developer/CommandLineTools/SDKs/MacOSX10.13.sdk -I/opt/local/include -isysroot/Library/Developer/CommandLineTools/SDKs/MacOSX10.13.sdk   -DPy_BUILD_CORE -o Objects/methodobject.o Objects/methodobject.c
1156:info:build /usr/bin/clang -c -Wno-unused-result -Wsign-compare -Wunreachable-code -fno-common -dynamic -DNDEBUG -g -fwrapv -O3 -Wall -arch x86_64 -arch i386 -isysroot /Library/Developer/CommandLineTools/SDKs/MacOSX10.13.sdk -pipe -Os -isysroot/Library/Developer/CommandLineTools/SDKs/MacOSX10.13.sdk -arch x86_64 -arch i386   -flto -std=c99 -Wextra -Wno-unused-result -Wno-unused-parameter -Wno-missing-field-initializers -Wstrict-prototypes -Werror=implicit-function-declaration -fvisibility=hidden -fprofile-instr-generate -I./Include/internal  -I. -I./Include -isysroot /Library/Developer/CommandLineTools/SDKs/MacOSX10.13.sdk -I/opt/local/include -isysroot/Library/Developer/CommandLineTools/SDKs/MacOSX10.13.sdk   -DPy_BUILD_CORE -o Objects/moduleobject.o Objects/moduleobject.c
1157:info:build /usr/bin/clang -c -Wno-unused-result -Wsign-compare -Wunreachable-code -fno-common -dynamic -DNDEBUG -g -fwrapv -O3 -Wall -arch x86_64 -arch i386 -isysroot /Library/Developer/CommandLineTools/SDKs/MacOSX10.13.sdk -pipe -Os -isysroot/Library/Developer/CommandLineTools/SDKs/MacOSX10.13.sdk -arch x86_64 -arch i386   -flto -std=c99 -Wextra -Wno-unused-result -Wno-unused-parameter -Wno-missing-field-initializers -Wstrict-prototypes -Werror=implicit-function-declaration -fvisibility=hidden -fprofile-instr-generate -I./Include/internal  -I. -I./Include -isysroot /Library/Developer/CommandLineTools/SDKs/MacOSX10.13.sdk -I/opt/local/include -isysroot/Library/Developer/CommandLineTools/SDKs/MacOSX10.13.sdk   -DPy_BUILD_CORE -o Objects/namespaceobject.o Objects/namespaceobject.c
1158:info:build /usr/bin/clang -c -Wno-unused-result -Wsign-compare -Wunreachable-code -fno-common -dynamic -DNDEBUG -g -fwrapv -O3 -Wall -arch x86_64 -arch i386 -isysroot /Library/Developer/CommandLineTools/SDKs/MacOSX10.13.sdk -pipe -Os -isysroot/Library/Developer/CommandLineTools/SDKs/MacOSX10.13.sdk -arch x86_64 -arch i386   -flto -std=c99 -Wextra -Wno-unused-result -Wno-unused-parameter -Wno-missing-field-initializers -Wstrict-prototypes -Werror=implicit-function-declaration -fvisibility=hidden -fprofile-instr-generate -I./Include/internal  -I. -I./Include -isysroot /Library/Developer/CommandLineTools/SDKs/MacOSX10.13.sdk -I/opt/local/include -isysroot/Library/Developer/CommandLineTools/SDKs/MacOSX10.13.sdk   -DPy_BUILD_CORE -o Objects/object.o Objects/object.c
1159:info:build /usr/bin/clang -c -Wno-unused-result -Wsign-compare -Wunreachable-code -fno-common -dynamic -DNDEBUG -g -fwrapv -O3 -Wall -arch x86_64 -arch i386 -isysroot /Library/Developer/CommandLineTools/SDKs/MacOSX10.13.sdk -pipe -Os -isysroot/Library/Developer/CommandLineTools/SDKs/MacOSX10.13.sdk -arch x86_64 -arch i386   -flto -std=c99 -Wextra -Wno-unused-result -Wno-unused-parameter -Wno-missing-field-initializers -Wstrict-prototypes -Werror=implicit-function-declaration -fvisibility=hidden -fprofile-instr-generate -I./Include/internal  -I. -I./Include -isysroot /Library/Developer/CommandLineTools/SDKs/MacOSX10.13.sdk -I/opt/local/include -isysroot/Library/Developer/CommandLineTools/SDKs/MacOSX10.13.sdk   -DPy_BUILD_CORE -o Objects/obmalloc.o Objects/obmalloc.c
1160:info:build /usr/bin/clang -c -Wno-unused-result -Wsign-compare -Wunreachable-code -fno-common -dynamic -DNDEBUG -g -fwrapv -O3 -Wall -arch x86_64 -arch i386 -isysroot /Library/Developer/CommandLineTools/SDKs/MacOSX10.13.sdk -pipe -Os -isysroot/Library/Developer/CommandLineTools/SDKs/MacOSX10.13.sdk -arch x86_64 -arch i386   -flto -std=c99 -Wextra -Wno-unused-result -Wno-unused-parameter -Wno-missing-field-initializers -Wstrict-prototypes -Werror=implicit-function-declaration -fvisibility=hidden -fprofile-instr-generate -I./Include/internal  -I. -I./Include -isysroot /Library/Developer/CommandLineTools/SDKs/MacOSX10.13.sdk -I/opt/local/include -isysroot/Library/Developer/CommandLineTools/SDKs/MacOSX10.13.sdk   -DPy_BUILD_CORE -o Objects/picklebufobject.o Objects/picklebufobject.c
1161:info:build /usr/bin/clang -c -Wno-unused-result -Wsign-compare -Wunreachable-code -fno-common -dynamic -DNDEBUG -g -fwrapv -O3 -Wall -arch x86_64 -arch i386 -isysroot /Library/Developer/CommandLineTools/SDKs/MacOSX10.13.sdk -pipe -Os -isysroot/Library/Developer/CommandLineTools/SDKs/MacOSX10.13.sdk -arch x86_64 -arch i386   -flto -std=c99 -Wextra -Wno-unused-result -Wno-unused-parameter -Wno-missing-field-initializers -Wstrict-prototypes -Werror=implicit-function-declaration -fvisibility=hidden -fprofile-instr-generate -I./Include/internal  -I. -I./Include -isysroot /Library/Developer/CommandLineTools/SDKs/MacOSX10.13.sdk -I/opt/local/include -isysroot/Library/Developer/CommandLineTools/SDKs/MacOSX10.13.sdk   -DPy_BUILD_CORE -o Objects/rangeobject.o Objects/rangeobject.c
1162:info:build /usr/bin/clang -c -Wno-unused-result -Wsign-compare -Wunreachable-code -fno-common -dynamic -DNDEBUG -g -fwrapv -O3 -Wall -arch x86_64 -arch i386 -isysroot /Library/Developer/CommandLineTools/SDKs/MacOSX10.13.sdk -pipe -Os -isysroot/Library/Developer/CommandLineTools/SDKs/MacOSX10.13.sdk -arch x86_64 -arch i386   -flto -std=c99 -Wextra -Wno-unused-result -Wno-unused-parameter -Wno-missing-field-initializers -Wstrict-prototypes -Werror=implicit-function-declaration -fvisibility=hidden -fprofile-instr-generate -I./Include/internal  -I. -I./Include -isysroot /Library/Developer/CommandLineTools/SDKs/MacOSX10.13.sdk -I/opt/local/include -isysroot/Library/Developer/CommandLineTools/SDKs/MacOSX10.13.sdk   -DPy_BUILD_CORE -o Objects/setobject.o Objects/setobject.c
1163:info:build /usr/bin/clang -c -Wno-unused-result -Wsign-compare -Wunreachable-code -fno-common -dynamic -DNDEBUG -g -fwrapv -O3 -Wall -arch x86_64 -arch i386 -isysroot /Library/Developer/CommandLineTools/SDKs/MacOSX10.13.sdk -pipe -Os -isysroot/Library/Developer/CommandLineTools/SDKs/MacOSX10.13.sdk -arch x86_64 -arch i386   -flto -std=c99 -Wextra -Wno-unused-result -Wno-unused-parameter -Wno-missing-field-initializers -Wstrict-prototypes -Werror=implicit-function-declaration -fvisibility=hidden -fprofile-instr-generate -I./Include/internal  -I. -I./Include -isysroot /Library/Developer/CommandLineTools/SDKs/MacOSX10.13.sdk -I/opt/local/include -isysroot/Library/Developer/CommandLineTools/SDKs/MacOSX10.13.sdk   -DPy_BUILD_CORE -o Objects/sliceobject.o Objects/sliceobject.c
1164:info:build /usr/bin/clang -c -Wno-unused-result -Wsign-compare -Wunreachable-code -fno-common -dynamic -DNDEBUG -g -fwrapv -O3 -Wall -arch x86_64 -arch i386 -isysroot /Library/Developer/CommandLineTools/SDKs/MacOSX10.13.sdk -pipe -Os -isysroot/Library/Developer/CommandLineTools/SDKs/MacOSX10.13.sdk -arch x86_64 -arch i386   -flto -std=c99 -Wextra -Wno-unused-result -Wno-unused-parameter -Wno-missing-field-initializers -Wstrict-prototypes -Werror=implicit-function-declaration -fvisibility=hidden -fprofile-instr-generate -I./Include/internal  -I. -I./Include -isysroot /Library/Developer/CommandLineTools/SDKs/MacOSX10.13.sdk -I/opt/local/include -isysroot/Library/Developer/CommandLineTools/SDKs/MacOSX10.13.sdk   -DPy_BUILD_CORE -o Objects/structseq.o Objects/structseq.c
1165:info:build /usr/bin/clang -c -Wno-unused-result -Wsign-compare -Wunreachable-code -fno-common -dynamic -DNDEBUG -g -fwrapv -O3 -Wall -arch x86_64 -arch i386 -isysroot /Library/Developer/CommandLineTools/SDKs/MacOSX10.13.sdk -pipe -Os -isysroot/Library/Developer/CommandLineTools/SDKs/MacOSX10.13.sdk -arch x86_64 -arch i386   -flto -std=c99 -Wextra -Wno-unused-result -Wno-unused-parameter -Wno-missing-field-initializers -Wstrict-prototypes -Werror=implicit-function-declaration -fvisibility=hidden -fprofile-instr-generate -I./Include/internal  -I. -I./Include -isysroot /Library/Developer/CommandLineTools/SDKs/MacOSX10.13.sdk -I/opt/local/include -isysroot/Library/Developer/CommandLineTools/SDKs/MacOSX10.13.sdk   -DPy_BUILD_CORE -o Objects/tupleobject.o Objects/tupleobject.c
1166:info:build /usr/bin/clang -c -Wno-unused-result -Wsign-compare -Wunreachable-code -fno-common -dynamic -DNDEBUG -g -fwrapv -O3 -Wall -arch x86_64 -arch i386 -isysroot /Library/Developer/CommandLineTools/SDKs/MacOSX10.13.sdk -pipe -Os -isysroot/Library/Developer/CommandLineTools/SDKs/MacOSX10.13.sdk -arch x86_64 -arch i386   -flto -std=c99 -Wextra -Wno-unused-result -Wno-unused-parameter -Wno-missing-field-initializers -Wstrict-prototypes -Werror=implicit-function-declaration -fvisibility=hidden -fprofile-instr-generate -I./Include/internal  -I. -I./Include -isysroot /Library/Developer/CommandLineTools/SDKs/MacOSX10.13.sdk -I/opt/local/include -isysroot/Library/Developer/CommandLineTools/SDKs/MacOSX10.13.sdk   -DPy_BUILD_CORE -o Objects/typeobject.o Objects/typeobject.c
1167:info:build /usr/bin/clang -c -Wno-unused-result -Wsign-compare -Wunreachable-code -fno-common -dynamic -DNDEBUG -g -fwrapv -O3 -Wall -arch x86_64 -arch i386 -isysroot /Library/Developer/CommandLineTools/SDKs/MacOSX10.13.sdk -pipe -Os -isysroot/Library/Developer/CommandLineTools/SDKs/MacOSX10.13.sdk -arch x86_64 -arch i386   -flto -std=c99 -Wextra -Wno-unused-result -Wno-unused-parameter -Wno-missing-field-initializers -Wstrict-prototypes -Werror=implicit-function-declaration -fvisibility=hidden -fprofile-instr-generate -I./Include/internal  -I. -I./Include -isysroot /Library/Developer/CommandLineTools/SDKs/MacOSX10.13.sdk -I/opt/local/include -isysroot/Library/Developer/CommandLineTools/SDKs/MacOSX10.13.sdk   -DPy_BUILD_CORE -o Objects/unicodeobject.o Objects/unicodeobject.c
1168:info:build /usr/bin/clang -c -Wno-unused-result -Wsign-compare -Wunreachable-code -fno-common -dynamic -DNDEBUG -g -fwrapv -O3 -Wall -arch x86_64 -arch i386 -isysroot /Library/Developer/CommandLineTools/SDKs/MacOSX10.13.sdk -pipe -Os -isysroot/Library/Developer/CommandLineTools/SDKs/MacOSX10.13.sdk -arch x86_64 -arch i386   -flto -std=c99 -Wextra -Wno-unused-result -Wno-unused-parameter -Wno-missing-field-initializers -Wstrict-prototypes -Werror=implicit-function-declaration -fvisibility=hidden -fprofile-instr-generate -I./Include/internal  -I. -I./Include -isysroot /Library/Developer/CommandLineTools/SDKs/MacOSX10.13.sdk -I/opt/local/include -isysroot/Library/Developer/CommandLineTools/SDKs/MacOSX10.13.sdk   -DPy_BUILD_CORE -o Objects/unicodectype.o Objects/unicodectype.c
1169:info:build /usr/bin/clang -c -Wno-unused-result -Wsign-compare -Wunreachable-code -fno-common -dynamic -DNDEBUG -g -fwrapv -O3 -Wall -arch x86_64 -arch i386 -isysroot /Library/Developer/CommandLineTools/SDKs/MacOSX10.13.sdk -pipe -Os -isysroot/Library/Developer/CommandLineTools/SDKs/MacOSX10.13.sdk -arch x86_64 -arch i386   -flto -std=c99 -Wextra -Wno-unused-result -Wno-unused-parameter -Wno-missing-field-initializers -Wstrict-prototypes -Werror=implicit-function-declaration -fvisibility=hidden -fprofile-instr-generate -I./Include/internal  -I. -I./Include -isysroot /Library/Developer/CommandLineTools/SDKs/MacOSX10.13.sdk -I/opt/local/include -isysroot/Library/Developer/CommandLineTools/SDKs/MacOSX10.13.sdk   -DPy_BUILD_CORE -o Objects/unionobject.o Objects/unionobject.c
1170:info:build /usr/bin/clang -c -Wno-unused-result -Wsign-compare -Wunreachable-code -fno-common -dynamic -DNDEBUG -g -fwrapv -O3 -Wall -arch x86_64 -arch i386 -isysroot /Library/Developer/CommandLineTools/SDKs/MacOSX10.13.sdk -pipe -Os -isysroot/Library/Developer/CommandLineTools/SDKs/MacOSX10.13.sdk -arch x86_64 -arch i386   -flto -std=c99 -Wextra -Wno-unused-result -Wno-unused-parameter -Wno-missing-field-initializers -Wstrict-prototypes -Werror=implicit-function-declaration -fvisibility=hidden -fprofile-instr-generate -I./Include/internal  -I. -I./Include -isysroot /Library/Developer/CommandLineTools/SDKs/MacOSX10.13.sdk -I/opt/local/include -isysroot/Library/Developer/CommandLineTools/SDKs/MacOSX10.13.sdk   -DPy_BUILD_CORE -o Objects/weakrefobject.o Objects/weakrefobject.c
1171:info:build /usr/bin/clang -c -Wno-unused-result -Wsign-compare -Wunreachable-code -fno-common -dynamic -DNDEBUG -g -fwrapv -O3 -Wall -arch x86_64 -arch i386 -isysroot /Library/Developer/CommandLineTools/SDKs/MacOSX10.13.sdk -pipe -Os -isysroot/Library/Developer/CommandLineTools/SDKs/MacOSX10.13.sdk -arch x86_64 -arch i386   -flto -std=c99 -Wextra -Wno-unused-result -Wno-unused-parameter -Wno-missing-field-initializers -Wstrict-prototypes -Werror=implicit-function-declaration -fvisibility=hidden -fprofile-instr-generate -I./Include/internal  -I. -I./Include -isysroot /Library/Developer/CommandLineTools/SDKs/MacOSX10.13.sdk -I/opt/local/include -isysroot/Library/Developer/CommandLineTools/SDKs/MacOSX10.13.sdk   -DPy_BUILD_CORE -o Python/_warnings.o Python/_warnings.c
1172:info:build /usr/bin/clang -c -Wno-unused-result -Wsign-compare -Wunreachable-code -fno-common -dynamic -DNDEBUG -g -fwrapv -O3 -Wall -arch x86_64 -arch i386 -isysroot /Library/Developer/CommandLineTools/SDKs/MacOSX10.13.sdk -pipe -Os -isysroot/Library/Developer/CommandLineTools/SDKs/MacOSX10.13.sdk -arch x86_64 -arch i386   -flto -std=c99 -Wextra -Wno-unused-result -Wno-unused-parameter -Wno-missing-field-initializers -Wstrict-prototypes -Werror=implicit-function-declaration -fvisibility=hidden -fprofile-instr-generate -I./Include/internal  -I. -I./Include -isysroot /Library/Developer/CommandLineTools/SDKs/MacOSX10.13.sdk -I/opt/local/include -isysroot/Library/Developer/CommandLineTools/SDKs/MacOSX10.13.sdk   -DPy_BUILD_CORE -o Python/Python-ast.o Python/Python-ast.c
1173:info:build /usr/bin/clang -c -Wno-unused-result -Wsign-compare -Wunreachable-code -fno-common -dynamic -DNDEBUG -g -fwrapv -O3 -Wall -arch x86_64 -arch i386 -isysroot /Library/Developer/CommandLineTools/SDKs/MacOSX10.13.sdk -pipe -Os -isysroot/Library/Developer/CommandLineTools/SDKs/MacOSX10.13.sdk -arch x86_64 -arch i386   -flto -std=c99 -Wextra -Wno-unused-result -Wno-unused-parameter -Wno-missing-field-initializers -Wstrict-prototypes -Werror=implicit-function-declaration -fvisibility=hidden -fprofile-instr-generate -I./Include/internal  -I. -I./Include -isysroot /Library/Developer/CommandLineTools/SDKs/MacOSX10.13.sdk -I/opt/local/include -isysroot/Library/Developer/CommandLineTools/SDKs/MacOSX10.13.sdk   -DPy_BUILD_CORE -o Python/asdl.o Python/asdl.c
1174:info:build /usr/bin/clang -c -Wno-unused-result -Wsign-compare -Wunreachable-code -fno-common -dynamic -DNDEBUG -g -fwrapv -O3 -Wall -arch x86_64 -arch i386 -isysroot /Library/Developer/CommandLineTools/SDKs/MacOSX10.13.sdk -pipe -Os -isysroot/Library/Developer/CommandLineTools/SDKs/MacOSX10.13.sdk -arch x86_64 -arch i386   -flto -std=c99 -Wextra -Wno-unused-result -Wno-unused-parameter -Wno-missing-field-initializers -Wstrict-prototypes -Werror=implicit-function-declaration -fvisibility=hidden -fprofile-instr-generate -I./Include/internal  -I. -I./Include -isysroot /Library/Developer/CommandLineTools/SDKs/MacOSX10.13.sdk -I/opt/local/include -isysroot/Library/Developer/CommandLineTools/SDKs/MacOSX10.13.sdk   -DPy_BUILD_CORE -o Python/ast.o Python/ast.c
1175:info:build /usr/bin/clang -c -Wno-unused-result -Wsign-compare -Wunreachable-code -fno-common -dynamic -DNDEBUG -g -fwrapv -O3 -Wall -arch x86_64 -arch i386 -isysroot /Library/Developer/CommandLineTools/SDKs/MacOSX10.13.sdk -pipe -Os -isysroot/Library/Developer/CommandLineTools/SDKs/MacOSX10.13.sdk -arch x86_64 -arch i386   -flto -std=c99 -Wextra -Wno-unused-result -Wno-unused-parameter -Wno-missing-field-initializers -Wstrict-prototypes -Werror=implicit-function-declaration -fvisibility=hidden -fprofile-instr-generate -I./Include/internal  -I. -I./Include -isysroot /Library/Developer/CommandLineTools/SDKs/MacOSX10.13.sdk -I/opt/local/include -isysroot/Library/Developer/CommandLineTools/SDKs/MacOSX10.13.sdk   -DPy_BUILD_CORE -o Python/ast_opt.o Python/ast_opt.c
1176:info:build /usr/bin/clang -c -Wno-unused-result -Wsign-compare -Wunreachable-code -fno-common -dynamic -DNDEBUG -g -fwrapv -O3 -Wall -arch x86_64 -arch i386 -isysroot /Library/Developer/CommandLineTools/SDKs/MacOSX10.13.sdk -pipe -Os -isysroot/Library/Developer/CommandLineTools/SDKs/MacOSX10.13.sdk -arch x86_64 -arch i386   -flto -std=c99 -Wextra -Wno-unused-result -Wno-unused-parameter -Wno-missing-field-initializers -Wstrict-prototypes -Werror=implicit-function-declaration -fvisibility=hidden -fprofile-instr-generate -I./Include/internal  -I. -I./Include -isysroot /Library/Developer/CommandLineTools/SDKs/MacOSX10.13.sdk -I/opt/local/include -isysroot/Library/Developer/CommandLineTools/SDKs/MacOSX10.13.sdk   -DPy_BUILD_CORE -o Python/ast_unparse.o Python/ast_unparse.c
1177:info:build /usr/bin/clang -c -Wno-unused-result -Wsign-compare -Wunreachable-code -fno-common -dynamic -DNDEBUG -g -fwrapv -O3 -Wall -arch x86_64 -arch i386 -isysroot /Library/Developer/CommandLineTools/SDKs/MacOSX10.13.sdk -pipe -Os -isysroot/Library/Developer/CommandLineTools/SDKs/MacOSX10.13.sdk -arch x86_64 -arch i386   -flto -std=c99 -Wextra -Wno-unused-result -Wno-unused-parameter -Wno-missing-field-initializers -Wstrict-prototypes -Werror=implicit-function-declaration -fvisibility=hidden -fprofile-instr-generate -I./Include/internal  -I. -I./Include -isysroot /Library/Developer/CommandLineTools/SDKs/MacOSX10.13.sdk -I/opt/local/include -isysroot/Library/Developer/CommandLineTools/SDKs/MacOSX10.13.sdk   -DPy_BUILD_CORE -o Python/bltinmodule.o Python/bltinmodule.c
1178:info:build /usr/bin/clang -c -Wno-unused-result -Wsign-compare -Wunreachable-code -fno-common -dynamic -DNDEBUG -g -fwrapv -O3 -Wall -arch x86_64 -arch i386 -isysroot /Library/Developer/CommandLineTools/SDKs/MacOSX10.13.sdk -pipe -Os -isysroot/Library/Developer/CommandLineTools/SDKs/MacOSX10.13.sdk -arch x86_64 -arch i386   -flto -std=c99 -Wextra -Wno-unused-result -Wno-unused-parameter -Wno-missing-field-initializers -Wstrict-prototypes -Werror=implicit-function-declaration -fvisibility=hidden -fprofile-instr-generate -I./Include/internal  -I. -I./Include -isysroot /Library/Developer/CommandLineTools/SDKs/MacOSX10.13.sdk -I/opt/local/include -isysroot/Library/Developer/CommandLineTools/SDKs/MacOSX10.13.sdk   -DPy_BUILD_CORE -o Python/ceval.o Python/ceval.c
1179:info:build In file included from Objects/unicodeobject.c:938:
1180:info:build Objects/stringlib/fastsearch.h:333:19: warning: comparison of integers of different signs: 'Py_ssize_t' (aka 'long') and 'unsigned int' [-Wsign-compare]
1181:info:build         if (shift > SHIFT_OVERFLOW) {
1182:info:build             ~~~~~ ^ ~~~~~~~~~~~~~~
1183:info:build In file included from Objects/unicodeobject.c:947:
1184:info:build Objects/stringlib/fastsearch.h:333:19: warning: comparison of integers of different signs: 'Py_ssize_t' (aka 'long') and 'unsigned int' [-Wsign-compare]
1185:info:build         if (shift > SHIFT_OVERFLOW) {
1186:info:build             ~~~~~ ^ ~~~~~~~~~~~~~~
1187:info:build In file included from Objects/unicodeobject.c:957:
1188:info:build Objects/stringlib/fastsearch.h:333:19: warning: comparison of integers of different signs: 'Py_ssize_t' (aka 'long') and 'unsigned int' [-Wsign-compare]
1189:info:build         if (shift > SHIFT_OVERFLOW) {
1190:info:build             ~~~~~ ^ ~~~~~~~~~~~~~~
1191:info:build In file included from Objects/unicodeobject.c:967:
1192:info:build Objects/stringlib/fastsearch.h:333:19: warning: comparison of integers of different signs: 'Py_ssize_t' (aka 'long') and 'unsigned int' [-Wsign-compare]
1193:info:build         if (shift > SHIFT_OVERFLOW) {
1194:info:build             ~~~~~ ^ ~~~~~~~~~~~~~~
1195:info:build In file included from Objects/unicodeobject.c:979:
1196:info:build Objects/stringlib/fastsearch.h:333:19: warning: comparison of integers of different signs: 'Py_ssize_t' (aka 'long') and 'unsigned int' [-Wsign-compare]
1197:info:build         if (shift > SHIFT_OVERFLOW) {
1198:info:build             ~~~~~ ^ ~~~~~~~~~~~~~~
1199:info:build /usr/bin/clang -c -Wno-unused-result -Wsign-compare -Wunreachable-code -fno-common -dynamic -DNDEBUG -g -fwrapv -O3 -Wall -arch x86_64 -arch i386 -isysroot /Library/Developer/CommandLineTools/SDKs/MacOSX10.13.sdk -pipe -Os -isysroot/Library/Developer/CommandLineTools/SDKs/MacOSX10.13.sdk -arch x86_64 -arch i386   -flto -std=c99 -Wextra -Wno-unused-result -Wno-unused-parameter -Wno-missing-field-initializers -Wstrict-prototypes -Werror=implicit-function-declaration -fvisibility=hidden -fprofile-instr-generate -I./Include/internal  -I. -I./Include -isysroot /Library/Developer/CommandLineTools/SDKs/MacOSX10.13.sdk -I/opt/local/include -isysroot/Library/Developer/CommandLineTools/SDKs/MacOSX10.13.sdk   -DPy_BUILD_CORE -o Python/codecs.o Python/codecs.c
1200:info:build /usr/bin/clang -c -Wno-unused-result -Wsign-compare -Wunreachable-code -fno-common -dynamic -DNDEBUG -g -fwrapv -O3 -Wall -arch x86_64 -arch i386 -isysroot /Library/Developer/CommandLineTools/SDKs/MacOSX10.13.sdk -pipe -Os -isysroot/Library/Developer/CommandLineTools/SDKs/MacOSX10.13.sdk -arch x86_64 -arch i386   -flto -std=c99 -Wextra -Wno-unused-result -Wno-unused-parameter -Wno-missing-field-initializers -Wstrict-prototypes -Werror=implicit-function-declaration -fvisibility=hidden -fprofile-instr-generate -I./Include/internal  -I. -I./Include -isysroot /Library/Developer/CommandLineTools/SDKs/MacOSX10.13.sdk -I/opt/local/include -isysroot/Library/Developer/CommandLineTools/SDKs/MacOSX10.13.sdk   -DPy_BUILD_CORE -o Python/compile.o Python/compile.c
1201:info:build /usr/bin/clang -c -Wno-unused-result -Wsign-compare -Wunreachable-code -fno-common -dynamic -DNDEBUG -g -fwrapv -O3 -Wall -arch x86_64 -arch i386 -isysroot /Library/Developer/CommandLineTools/SDKs/MacOSX10.13.sdk -pipe -Os -isysroot/Library/Developer/CommandLineTools/SDKs/MacOSX10.13.sdk -arch x86_64 -arch i386   -flto -std=c99 -Wextra -Wno-unused-result -Wno-unused-parameter -Wno-missing-field-initializers -Wstrict-prototypes -Werror=implicit-function-declaration -fvisibility=hidden -fprofile-instr-generate -I./Include/internal  -I. -I./Include -isysroot /Library/Developer/CommandLineTools/SDKs/MacOSX10.13.sdk -I/opt/local/include -isysroot/Library/Developer/CommandLineTools/SDKs/MacOSX10.13.sdk   -DPy_BUILD_CORE -o Python/context.o Python/context.c
1202:info:build /usr/bin/clang -c -Wno-unused-result -Wsign-compare -Wunreachable-code -fno-common -dynamic -DNDEBUG -g -fwrapv -O3 -Wall -arch x86_64 -arch i386 -isysroot /Library/Developer/CommandLineTools/SDKs/MacOSX10.13.sdk -pipe -Os -isysroot/Library/Developer/CommandLineTools/SDKs/MacOSX10.13.sdk -arch x86_64 -arch i386   -flto -std=c99 -Wextra -Wno-unused-result -Wno-unused-parameter -Wno-missing-field-initializers -Wstrict-prototypes -Werror=implicit-function-declaration -fvisibility=hidden -fprofile-instr-generate -I./Include/internal  -I. -I./Include -isysroot /Library/Developer/CommandLineTools/SDKs/MacOSX10.13.sdk -I/opt/local/include -isysroot/Library/Developer/CommandLineTools/SDKs/MacOSX10.13.sdk   -DPy_BUILD_CORE -o Python/dynamic_annotations.o Python/dynamic_annotations.c
1203:info:build /usr/bin/clang -c -Wno-unused-result -Wsign-compare -Wunreachable-code -fno-common -dynamic -DNDEBUG -g -fwrapv -O3 -Wall -arch x86_64 -arch i386 -isysroot /Library/Developer/CommandLineTools/SDKs/MacOSX10.13.sdk -pipe -Os -isysroot/Library/Developer/CommandLineTools/SDKs/MacOSX10.13.sdk -arch x86_64 -arch i386   -flto -std=c99 -Wextra -Wno-unused-result -Wno-unused-parameter -Wno-missing-field-initializers -Wstrict-prototypes -Werror=implicit-function-declaration -fvisibility=hidden -fprofile-instr-generate -I./Include/internal  -I. -I./Include -isysroot /Library/Developer/CommandLineTools/SDKs/MacOSX10.13.sdk -I/opt/local/include -isysroot/Library/Developer/CommandLineTools/SDKs/MacOSX10.13.sdk   -DPy_BUILD_CORE -o Python/errors.o Python/errors.c
1204:info:build /usr/bin/clang -c -Wno-unused-result -Wsign-compare -Wunreachable-code -fno-common -dynamic -DNDEBUG -g -fwrapv -O3 -Wall -arch x86_64 -arch i386 -isysroot /Library/Developer/CommandLineTools/SDKs/MacOSX10.13.sdk -pipe -Os -isysroot/Library/Developer/CommandLineTools/SDKs/MacOSX10.13.sdk -arch x86_64 -arch i386   -flto -std=c99 -Wextra -Wno-unused-result -Wno-unused-parameter -Wno-missing-field-initializers -Wstrict-prototypes -Werror=implicit-function-declaration -fvisibility=hidden -fprofile-instr-generate -I./Include/internal  -I. -I./Include -isysroot /Library/Developer/CommandLineTools/SDKs/MacOSX10.13.sdk -I/opt/local/include -isysroot/Library/Developer/CommandLineTools/SDKs/MacOSX10.13.sdk   -DPy_BUILD_CORE -o Python/frozenmain.o Python/frozenmain.c
1205:info:build /usr/bin/clang -c -Wno-unused-result -Wsign-compare -Wunreachable-code -fno-common -dynamic -DNDEBUG -g -fwrapv -O3 -Wall -arch x86_64 -arch i386 -isysroot /Library/Developer/CommandLineTools/SDKs/MacOSX10.13.sdk -pipe -Os -isysroot/Library/Developer/CommandLineTools/SDKs/MacOSX10.13.sdk -arch x86_64 -arch i386   -flto -std=c99 -Wextra -Wno-unused-result -Wno-unused-parameter -Wno-missing-field-initializers -Wstrict-prototypes -Werror=implicit-function-declaration -fvisibility=hidden -fprofile-instr-generate -I./Include/internal  -I. -I./Include -isysroot /Library/Developer/CommandLineTools/SDKs/MacOSX10.13.sdk -I/opt/local/include -isysroot/Library/Developer/CommandLineTools/SDKs/MacOSX10.13.sdk   -DPy_BUILD_CORE -o Python/future.o Python/future.c
1206:info:build /usr/bin/clang -c -Wno-unused-result -Wsign-compare -Wunreachable-code -fno-common -dynamic -DNDEBUG -g -fwrapv -O3 -Wall -arch x86_64 -arch i386 -isysroot /Library/Developer/CommandLineTools/SDKs/MacOSX10.13.sdk -pipe -Os -isysroot/Library/Developer/CommandLineTools/SDKs/MacOSX10.13.sdk -arch x86_64 -arch i386   -flto -std=c99 -Wextra -Wno-unused-result -Wno-unused-parameter -Wno-missing-field-initializers -Wstrict-prototypes -Werror=implicit-function-declaration -fvisibility=hidden -fprofile-instr-generate -I./Include/internal  -I. -I./Include -isysroot /Library/Developer/CommandLineTools/SDKs/MacOSX10.13.sdk -I/opt/local/include -isysroot/Library/Developer/CommandLineTools/SDKs/MacOSX10.13.sdk   -DPy_BUILD_CORE -o Python/getargs.o Python/getargs.c
1207:info:build /usr/bin/clang -c -Wno-unused-result -Wsign-compare -Wunreachable-code -fno-common -dynamic -DNDEBUG -g -fwrapv -O3 -Wall -arch x86_64 -arch i386 -isysroot /Library/Developer/CommandLineTools/SDKs/MacOSX10.13.sdk -pipe -Os -isysroot/Library/Developer/CommandLineTools/SDKs/MacOSX10.13.sdk -arch x86_64 -arch i386   -flto -std=c99 -Wextra -Wno-unused-result -Wno-unused-parameter -Wno-missing-field-initializers -Wstrict-prototypes -Werror=implicit-function-declaration -fvisibility=hidden -fprofile-instr-generate -I./Include/internal  -I. -I./Include -isysroot /Library/Developer/CommandLineTools/SDKs/MacOSX10.13.sdk -I/opt/local/include -isysroot/Library/Developer/CommandLineTools/SDKs/MacOSX10.13.sdk   -DPy_BUILD_CORE -o Python/getcompiler.o Python/getcompiler.c
1208:info:build /usr/bin/clang -c -Wno-unused-result -Wsign-compare -Wunreachable-code -fno-common -dynamic -DNDEBUG -g -fwrapv -O3 -Wall -arch x86_64 -arch i386 -isysroot /Library/Developer/CommandLineTools/SDKs/MacOSX10.13.sdk -pipe -Os -isysroot/Library/Developer/CommandLineTools/SDKs/MacOSX10.13.sdk -arch x86_64 -arch i386   -flto -std=c99 -Wextra -Wno-unused-result -Wno-unused-parameter -Wno-missing-field-initializers -Wstrict-prototypes -Werror=implicit-function-declaration -fvisibility=hidden -fprofile-instr-generate -I./Include/internal  -I. -I./Include -isysroot /Library/Developer/CommandLineTools/SDKs/MacOSX10.13.sdk -I/opt/local/include -isysroot/Library/Developer/CommandLineTools/SDKs/MacOSX10.13.sdk   -DPy_BUILD_CORE -o Python/getcopyright.o Python/getcopyright.c
1209:info:build /usr/bin/clang -c -Wno-unused-result -Wsign-compare -Wunreachable-code -fno-common -dynamic -DNDEBUG -g -fwrapv -O3 -Wall -arch x86_64 -arch i386 -isysroot /Library/Developer/CommandLineTools/SDKs/MacOSX10.13.sdk -pipe -Os -isysroot/Library/Developer/CommandLineTools/SDKs/MacOSX10.13.sdk -arch x86_64 -arch i386   -flto -std=c99 -Wextra -Wno-unused-result -Wno-unused-parameter -Wno-missing-field-initializers -Wstrict-prototypes -Werror=implicit-function-declaration -fvisibility=hidden -fprofile-instr-generate -I./Include/internal  -I. -I./Include -isysroot /Library/Developer/CommandLineTools/SDKs/MacOSX10.13.sdk -I/opt/local/include -isysroot/Library/Developer/CommandLineTools/SDKs/MacOSX10.13.sdk   -DPy_BUILD_CORE -DPLATFORM='"darwin"' -o Python/getplatform.o ./Python/getplatform.c
1210:info:build /usr/bin/clang -c -Wno-unused-result -Wsign-compare -Wunreachable-code -fno-common -dynamic -DNDEBUG -g -fwrapv -O3 -Wall -arch x86_64 -arch i386 -isysroot /Library/Developer/CommandLineTools/SDKs/MacOSX10.13.sdk -pipe -Os -isysroot/Library/Developer/CommandLineTools/SDKs/MacOSX10.13.sdk -arch x86_64 -arch i386   -flto -std=c99 -Wextra -Wno-unused-result -Wno-unused-parameter -Wno-missing-field-initializers -Wstrict-prototypes -Werror=implicit-function-declaration -fvisibility=hidden -fprofile-instr-generate -I./Include/internal  -I. -I./Include -isysroot /Library/Developer/CommandLineTools/SDKs/MacOSX10.13.sdk -I/opt/local/include -isysroot/Library/Developer/CommandLineTools/SDKs/MacOSX10.13.sdk   -DPy_BUILD_CORE -o Python/getversion.o Python/getversion.c
1211:info:build /usr/bin/clang -c -Wno-unused-result -Wsign-compare -Wunreachable-code -fno-common -dynamic -DNDEBUG -g -fwrapv -O3 -Wall -arch x86_64 -arch i386 -isysroot /Library/Developer/CommandLineTools/SDKs/MacOSX10.13.sdk -pipe -Os -isysroot/Library/Developer/CommandLineTools/SDKs/MacOSX10.13.sdk -arch x86_64 -arch i386   -flto -std=c99 -Wextra -Wno-unused-result -Wno-unused-parameter -Wno-missing-field-initializers -Wstrict-prototypes -Werror=implicit-function-declaration -fvisibility=hidden -fprofile-instr-generate -I./Include/internal  -I. -I./Include -isysroot /Library/Developer/CommandLineTools/SDKs/MacOSX10.13.sdk -I/opt/local/include -isysroot/Library/Developer/CommandLineTools/SDKs/MacOSX10.13.sdk   -DPy_BUILD_CORE -o Python/hamt.o Python/hamt.c
1212:info:build /usr/bin/clang -c -Wno-unused-result -Wsign-compare -Wunreachable-code -fno-common -dynamic -DNDEBUG -g -fwrapv -O3 -Wall -arch x86_64 -arch i386 -isysroot /Library/Developer/CommandLineTools/SDKs/MacOSX10.13.sdk -pipe -Os -isysroot/Library/Developer/CommandLineTools/SDKs/MacOSX10.13.sdk -arch x86_64 -arch i386   -flto -std=c99 -Wextra -Wno-unused-result -Wno-unused-parameter -Wno-missing-field-initializers -Wstrict-prototypes -Werror=implicit-function-declaration -fvisibility=hidden -fprofile-instr-generate -I./Include/internal  -I. -I./Include -isysroot /Library/Developer/CommandLineTools/SDKs/MacOSX10.13.sdk -I/opt/local/include -isysroot/Library/Developer/CommandLineTools/SDKs/MacOSX10.13.sdk   -DPy_BUILD_CORE -o Python/hashtable.o Python/hashtable.c
1213:info:build /usr/bin/clang -c -Wno-unused-result -Wsign-compare -Wunreachable-code -fno-common -dynamic -DNDEBUG -g -fwrapv -O3 -Wall -arch x86_64 -arch i386 -isysroot /Library/Developer/CommandLineTools/SDKs/MacOSX10.13.sdk -pipe -Os -isysroot/Library/Developer/CommandLineTools/SDKs/MacOSX10.13.sdk -arch x86_64 -arch i386   -flto -std=c99 -Wextra -Wno-unused-result -Wno-unused-parameter -Wno-missing-field-initializers -Wstrict-prototypes -Werror=implicit-function-declaration -fvisibility=hidden -fprofile-instr-generate -I./Include/internal  -I. -I./Include -isysroot /Library/Developer/CommandLineTools/SDKs/MacOSX10.13.sdk -I/opt/local/include -isysroot/Library/Developer/CommandLineTools/SDKs/MacOSX10.13.sdk   -DPy_BUILD_CORE -o Python/import.o Python/import.c
1214:info:build /usr/bin/clang -c -Wno-unused-result -Wsign-compare -Wunreachable-code -fno-common -dynamic -DNDEBUG -g -fwrapv -O3 -Wall -arch x86_64 -arch i386 -isysroot /Library/Developer/CommandLineTools/SDKs/MacOSX10.13.sdk -pipe -Os -isysroot/Library/Developer/CommandLineTools/SDKs/MacOSX10.13.sdk -arch x86_64 -arch i386   -flto -std=c99 -Wextra -Wno-unused-result -Wno-unused-parameter -Wno-missing-field-initializers -Wstrict-prototypes -Werror=implicit-function-declaration -fvisibility=hidden -fprofile-instr-generate -I./Include/internal  -I. -I./Include -isysroot /Library/Developer/CommandLineTools/SDKs/MacOSX10.13.sdk -I/opt/local/include -isysroot/Library/Developer/CommandLineTools/SDKs/MacOSX10.13.sdk   -DPy_BUILD_CORE -I. -o Python/importdl.o ./Python/importdl.c
1215:info:build /usr/bin/clang -c -Wno-unused-result -Wsign-compare -Wunreachable-code -fno-common -dynamic -DNDEBUG -g -fwrapv -O3 -Wall -arch x86_64 -arch i386 -isysroot /Library/Developer/CommandLineTools/SDKs/MacOSX10.13.sdk -pipe -Os -isysroot/Library/Developer/CommandLineTools/SDKs/MacOSX10.13.sdk -arch x86_64 -arch i386   -flto -std=c99 -Wextra -Wno-unused-result -Wno-unused-parameter -Wno-missing-field-initializers -Wstrict-prototypes -Werror=implicit-function-declaration -fvisibility=hidden -fprofile-instr-generate -I./Include/internal  -I. -I./Include -isysroot /Library/Developer/CommandLineTools/SDKs/MacOSX10.13.sdk -I/opt/local/include -isysroot/Library/Developer/CommandLineTools/SDKs/MacOSX10.13.sdk   -DPy_BUILD_CORE \
1216:info:build             -DPLATLIBDIR='"lib"' \
1217:info:build             -o Python/initconfig.o ./Python/initconfig.c
1218:info:build /usr/bin/clang -c -Wno-unused-result -Wsign-compare -Wunreachable-code -fno-common -dynamic -DNDEBUG -g -fwrapv -O3 -Wall -arch x86_64 -arch i386 -isysroot /Library/Developer/CommandLineTools/SDKs/MacOSX10.13.sdk -pipe -Os -isysroot/Library/Developer/CommandLineTools/SDKs/MacOSX10.13.sdk -arch x86_64 -arch i386   -flto -std=c99 -Wextra -Wno-unused-result -Wno-unused-parameter -Wno-missing-field-initializers -Wstrict-prototypes -Werror=implicit-function-declaration -fvisibility=hidden -fprofile-instr-generate -I./Include/internal  -I. -I./Include -isysroot /Library/Developer/CommandLineTools/SDKs/MacOSX10.13.sdk -I/opt/local/include -isysroot/Library/Developer/CommandLineTools/SDKs/MacOSX10.13.sdk   -DPy_BUILD_CORE -o Python/marshal.o Python/marshal.c
1219:info:build /usr/bin/clang -c -Wno-unused-result -Wsign-compare -Wunreachable-code -fno-common -dynamic -DNDEBUG -g -fwrapv -O3 -Wall -arch x86_64 -arch i386 -isysroot /Library/Developer/CommandLineTools/SDKs/MacOSX10.13.sdk -pipe -Os -isysroot/Library/Developer/CommandLineTools/SDKs/MacOSX10.13.sdk -arch x86_64 -arch i386   -flto -std=c99 -Wextra -Wno-unused-result -Wno-unused-parameter -Wno-missing-field-initializers -Wstrict-prototypes -Werror=implicit-function-declaration -fvisibility=hidden -fprofile-instr-generate -I./Include/internal  -I. -I./Include -isysroot /Library/Developer/CommandLineTools/SDKs/MacOSX10.13.sdk -I/opt/local/include -isysroot/Library/Developer/CommandLineTools/SDKs/MacOSX10.13.sdk   -DPy_BUILD_CORE -o Python/modsupport.o Python/modsupport.c
1220:info:build /usr/bin/clang -c -Wno-unused-result -Wsign-compare -Wunreachable-code -fno-common -dynamic -DNDEBUG -g -fwrapv -O3 -Wall -arch x86_64 -arch i386 -isysroot /Library/Developer/CommandLineTools/SDKs/MacOSX10.13.sdk -pipe -Os -isysroot/Library/Developer/CommandLineTools/SDKs/MacOSX10.13.sdk -arch x86_64 -arch i386   -flto -std=c99 -Wextra -Wno-unused-result -Wno-unused-parameter -Wno-missing-field-initializers -Wstrict-prototypes -Werror=implicit-function-declaration -fvisibility=hidden -fprofile-instr-generate -I./Include/internal  -I. -I./Include -isysroot /Library/Developer/CommandLineTools/SDKs/MacOSX10.13.sdk -I/opt/local/include -isysroot/Library/Developer/CommandLineTools/SDKs/MacOSX10.13.sdk   -DPy_BUILD_CORE -o Python/mysnprintf.o Python/mysnprintf.c
1221:info:build 5 warnings generated.
1222:info:build /usr/bin/clang -c -Wno-unused-result -Wsign-compare -Wunreachable-code -fno-common -dynamic -DNDEBUG -g -fwrapv -O3 -Wall -arch x86_64 -arch i386 -isysroot /Library/Developer/CommandLineTools/SDKs/MacOSX10.13.sdk -pipe -Os -isysroot/Library/Developer/CommandLineTools/SDKs/MacOSX10.13.sdk -arch x86_64 -arch i386   -flto -std=c99 -Wextra -Wno-unused-result -Wno-unused-parameter -Wno-missing-field-initializers -Wstrict-prototypes -Werror=implicit-function-declaration -fvisibility=hidden -fprofile-instr-generate -I./Include/internal  -I. -I./Include -isysroot /Library/Developer/CommandLineTools/SDKs/MacOSX10.13.sdk -I/opt/local/include -isysroot/Library/Developer/CommandLineTools/SDKs/MacOSX10.13.sdk   -DPy_BUILD_CORE -o Python/mystrtoul.o Python/mystrtoul.c
1223:info:build /usr/bin/clang -c -Wno-unused-result -Wsign-compare -Wunreachable-code -fno-common -dynamic -DNDEBUG -g -fwrapv -O3 -Wall -arch x86_64 -arch i386 -isysroot /Library/Developer/CommandLineTools/SDKs/MacOSX10.13.sdk -pipe -Os -isysroot/Library/Developer/CommandLineTools/SDKs/MacOSX10.13.sdk -arch x86_64 -arch i386   -flto -std=c99 -Wextra -Wno-unused-result -Wno-unused-parameter -Wno-missing-field-initializers -Wstrict-prototypes -Werror=implicit-function-declaration -fvisibility=hidden -fprofile-instr-generate -I./Include/internal  -I. -I./Include -isysroot /Library/Developer/CommandLineTools/SDKs/MacOSX10.13.sdk -I/opt/local/include -isysroot/Library/Developer/CommandLineTools/SDKs/MacOSX10.13.sdk   -DPy_BUILD_CORE -o Python/pathconfig.o Python/pathconfig.c
1224:info:build /usr/bin/clang -c -Wno-unused-result -Wsign-compare -Wunreachable-code -fno-common -dynamic -DNDEBUG -g -fwrapv -O3 -Wall -arch x86_64 -arch i386 -isysroot /Library/Developer/CommandLineTools/SDKs/MacOSX10.13.sdk -pipe -Os -isysroot/Library/Developer/CommandLineTools/SDKs/MacOSX10.13.sdk -arch x86_64 -arch i386   -flto -std=c99 -Wextra -Wno-unused-result -Wno-unused-parameter -Wno-missing-field-initializers -Wstrict-prototypes -Werror=implicit-function-declaration -fvisibility=hidden -fprofile-instr-generate -I./Include/internal  -I. -I./Include -isysroot /Library/Developer/CommandLineTools/SDKs/MacOSX10.13.sdk -I/opt/local/include -isysroot/Library/Developer/CommandLineTools/SDKs/MacOSX10.13.sdk   -DPy_BUILD_CORE -o Python/preconfig.o Python/preconfig.c
1225:info:build /usr/bin/clang -c -Wno-unused-result -Wsign-compare -Wunreachable-code -fno-common -dynamic -DNDEBUG -g -fwrapv -O3 -Wall -arch x86_64 -arch i386 -isysroot /Library/Developer/CommandLineTools/SDKs/MacOSX10.13.sdk -pipe -Os -isysroot/Library/Developer/CommandLineTools/SDKs/MacOSX10.13.sdk -arch x86_64 -arch i386   -flto -std=c99 -Wextra -Wno-unused-result -Wno-unused-parameter -Wno-missing-field-initializers -Wstrict-prototypes -Werror=implicit-function-declaration -fvisibility=hidden -fprofile-instr-generate -I./Include/internal  -I. -I./Include -isysroot /Library/Developer/CommandLineTools/SDKs/MacOSX10.13.sdk -I/opt/local/include -isysroot/Library/Developer/CommandLineTools/SDKs/MacOSX10.13.sdk   -DPy_BUILD_CORE -o Python/pyarena.o Python/pyarena.c
1226:info:build /usr/bin/clang -c -Wno-unused-result -Wsign-compare -Wunreachable-code -fno-common -dynamic -DNDEBUG -g -fwrapv -O3 -Wall -arch x86_64 -arch i386 -isysroot /Library/Developer/CommandLineTools/SDKs/MacOSX10.13.sdk -pipe -Os -isysroot/Library/Developer/CommandLineTools/SDKs/MacOSX10.13.sdk -arch x86_64 -arch i386   -flto -std=c99 -Wextra -Wno-unused-result -Wno-unused-parameter -Wno-missing-field-initializers -Wstrict-prototypes -Werror=implicit-function-declaration -fvisibility=hidden -fprofile-instr-generate -I./Include/internal  -I. -I./Include -isysroot /Library/Developer/CommandLineTools/SDKs/MacOSX10.13.sdk -I/opt/local/include -isysroot/Library/Developer/CommandLineTools/SDKs/MacOSX10.13.sdk   -DPy_BUILD_CORE -o Python/pyctype.o Python/pyctype.c
1227:info:build /usr/bin/clang -c -Wno-unused-result -Wsign-compare -Wunreachable-code -fno-common -dynamic -DNDEBUG -g -fwrapv -O3 -Wall -arch x86_64 -arch i386 -isysroot /Library/Developer/CommandLineTools/SDKs/MacOSX10.13.sdk -pipe -Os -isysroot/Library/Developer/CommandLineTools/SDKs/MacOSX10.13.sdk -arch x86_64 -arch i386   -flto -std=c99 -Wextra -Wno-unused-result -Wno-unused-parameter -Wno-missing-field-initializers -Wstrict-prototypes -Werror=implicit-function-declaration -fvisibility=hidden -fprofile-instr-generate -I./Include/internal  -I. -I./Include -isysroot /Library/Developer/CommandLineTools/SDKs/MacOSX10.13.sdk -I/opt/local/include -isysroot/Library/Developer/CommandLineTools/SDKs/MacOSX10.13.sdk   -DPy_BUILD_CORE -o Python/pyfpe.o Python/pyfpe.c
1228:info:build /usr/bin/clang -c -Wno-unused-result -Wsign-compare -Wunreachable-code -fno-common -dynamic -DNDEBUG -g -fwrapv -O3 -Wall -arch x86_64 -arch i386 -isysroot /Library/Developer/CommandLineTools/SDKs/MacOSX10.13.sdk -pipe -Os -isysroot/Library/Developer/CommandLineTools/SDKs/MacOSX10.13.sdk -arch x86_64 -arch i386   -flto -std=c99 -Wextra -Wno-unused-result -Wno-unused-parameter -Wno-missing-field-initializers -Wstrict-prototypes -Werror=implicit-function-declaration -fvisibility=hidden -fprofile-instr-generate -I./Include/internal  -I. -I./Include -isysroot /Library/Developer/CommandLineTools/SDKs/MacOSX10.13.sdk -I/opt/local/include -isysroot/Library/Developer/CommandLineTools/SDKs/MacOSX10.13.sdk   -DPy_BUILD_CORE -o Python/pyhash.o Python/pyhash.c
1229:info:build /usr/bin/clang -c -Wno-unused-result -Wsign-compare -Wunreachable-code -fno-common -dynamic -DNDEBUG -g -fwrapv -O3 -Wall -arch x86_64 -arch i386 -isysroot /Library/Developer/CommandLineTools/SDKs/MacOSX10.13.sdk -pipe -Os -isysroot/Library/Developer/CommandLineTools/SDKs/MacOSX10.13.sdk -arch x86_64 -arch i386   -flto -std=c99 -Wextra -Wno-unused-result -Wno-unused-parameter -Wno-missing-field-initializers -Wstrict-prototypes -Werror=implicit-function-declaration -fvisibility=hidden -fprofile-instr-generate -I./Include/internal  -I. -I./Include -isysroot /Library/Developer/CommandLineTools/SDKs/MacOSX10.13.sdk -I/opt/local/include -isysroot/Library/Developer/CommandLineTools/SDKs/MacOSX10.13.sdk   -DPy_BUILD_CORE -o Python/pylifecycle.o Python/pylifecycle.c
1230:info:build /usr/bin/clang -c -Wno-unused-result -Wsign-compare -Wunreachable-code -fno-common -dynamic -DNDEBUG -g -fwrapv -O3 -Wall -arch x86_64 -arch i386 -isysroot /Library/Developer/CommandLineTools/SDKs/MacOSX10.13.sdk -pipe -Os -isysroot/Library/Developer/CommandLineTools/SDKs/MacOSX10.13.sdk -arch x86_64 -arch i386   -flto -std=c99 -Wextra -Wno-unused-result -Wno-unused-parameter -Wno-missing-field-initializers -Wstrict-prototypes -Werror=implicit-function-declaration -fvisibility=hidden -fprofile-instr-generate -I./Include/internal  -I. -I./Include -isysroot /Library/Developer/CommandLineTools/SDKs/MacOSX10.13.sdk -I/opt/local/include -isysroot/Library/Developer/CommandLineTools/SDKs/MacOSX10.13.sdk   -DPy_BUILD_CORE -o Python/pymath.o Python/pymath.c
1231:info:build /usr/bin/clang -c -Wno-unused-result -Wsign-compare -Wunreachable-code -fno-common -dynamic -DNDEBUG -g -fwrapv -O3 -Wall -arch x86_64 -arch i386 -isysroot /Library/Developer/CommandLineTools/SDKs/MacOSX10.13.sdk -pipe -Os -isysroot/Library/Developer/CommandLineTools/SDKs/MacOSX10.13.sdk -arch x86_64 -arch i386   -flto -std=c99 -Wextra -Wno-unused-result -Wno-unused-parameter -Wno-missing-field-initializers -Wstrict-prototypes -Werror=implicit-function-declaration -fvisibility=hidden -fprofile-instr-generate -I./Include/internal  -I. -I./Include -isysroot /Library/Developer/CommandLineTools/SDKs/MacOSX10.13.sdk -I/opt/local/include -isysroot/Library/Developer/CommandLineTools/SDKs/MacOSX10.13.sdk   -DPy_BUILD_CORE -o Python/pystate.o Python/pystate.c
1232:info:build /usr/bin/clang -c -Wno-unused-result -Wsign-compare -Wunreachable-code -fno-common -dynamic -DNDEBUG -g -fwrapv -O3 -Wall -arch x86_64 -arch i386 -isysroot /Library/Developer/CommandLineTools/SDKs/MacOSX10.13.sdk -pipe -Os -isysroot/Library/Developer/CommandLineTools/SDKs/MacOSX10.13.sdk -arch x86_64 -arch i386   -flto -std=c99 -Wextra -Wno-unused-result -Wno-unused-parameter -Wno-missing-field-initializers -Wstrict-prototypes -Werror=implicit-function-declaration -fvisibility=hidden -fprofile-instr-generate -I./Include/internal  -I. -I./Include -isysroot /Library/Developer/CommandLineTools/SDKs/MacOSX10.13.sdk -I/opt/local/include -isysroot/Library/Developer/CommandLineTools/SDKs/MacOSX10.13.sdk   -DPy_BUILD_CORE -o Python/pythonrun.o Python/pythonrun.c
1233:info:build /usr/bin/clang -c -Wno-unused-result -Wsign-compare -Wunreachable-code -fno-common -dynamic -DNDEBUG -g -fwrapv -O3 -Wall -arch x86_64 -arch i386 -isysroot /Library/Developer/CommandLineTools/SDKs/MacOSX10.13.sdk -pipe -Os -isysroot/Library/Developer/CommandLineTools/SDKs/MacOSX10.13.sdk -arch x86_64 -arch i386   -flto -std=c99 -Wextra -Wno-unused-result -Wno-unused-parameter -Wno-missing-field-initializers -Wstrict-prototypes -Werror=implicit-function-declaration -fvisibility=hidden -fprofile-instr-generate -I./Include/internal  -I. -I./Include -isysroot /Library/Developer/CommandLineTools/SDKs/MacOSX10.13.sdk -I/opt/local/include -isysroot/Library/Developer/CommandLineTools/SDKs/MacOSX10.13.sdk   -DPy_BUILD_CORE -o Python/pytime.o Python/pytime.c
1234:info:build /usr/bin/clang -c -Wno-unused-result -Wsign-compare -Wunreachable-code -fno-common -dynamic -DNDEBUG -g -fwrapv -O3 -Wall -arch x86_64 -arch i386 -isysroot /Library/Developer/CommandLineTools/SDKs/MacOSX10.13.sdk -pipe -Os -isysroot/Library/Developer/CommandLineTools/SDKs/MacOSX10.13.sdk -arch x86_64 -arch i386   -flto -std=c99 -Wextra -Wno-unused-result -Wno-unused-parameter -Wno-missing-field-initializers -Wstrict-prototypes -Werror=implicit-function-declaration -fvisibility=hidden -fprofile-instr-generate -I./Include/internal  -I. -I./Include -isysroot /Library/Developer/CommandLineTools/SDKs/MacOSX10.13.sdk -I/opt/local/include -isysroot/Library/Developer/CommandLineTools/SDKs/MacOSX10.13.sdk   -DPy_BUILD_CORE -o Python/bootstrap_hash.o Python/bootstrap_hash.c
1235:info:build /usr/bin/clang -c -Wno-unused-result -Wsign-compare -Wunreachable-code -fno-common -dynamic -DNDEBUG -g -fwrapv -O3 -Wall -arch x86_64 -arch i386 -isysroot /Library/Developer/CommandLineTools/SDKs/MacOSX10.13.sdk -pipe -Os -isysroot/Library/Developer/CommandLineTools/SDKs/MacOSX10.13.sdk -arch x86_64 -arch i386   -flto -std=c99 -Wextra -Wno-unused-result -Wno-unused-parameter -Wno-missing-field-initializers -Wstrict-prototypes -Werror=implicit-function-declaration -fvisibility=hidden -fprofile-instr-generate -I./Include/internal  -I. -I./Include -isysroot /Library/Developer/CommandLineTools/SDKs/MacOSX10.13.sdk -I/opt/local/include -isysroot/Library/Developer/CommandLineTools/SDKs/MacOSX10.13.sdk   -DPy_BUILD_CORE -o Python/structmember.o Python/structmember.c
1236:info:build /usr/bin/clang -c -Wno-unused-result -Wsign-compare -Wunreachable-code -fno-common -dynamic -DNDEBUG -g -fwrapv -O3 -Wall -arch x86_64 -arch i386 -isysroot /Library/Developer/CommandLineTools/SDKs/MacOSX10.13.sdk -pipe -Os -isysroot/Library/Developer/CommandLineTools/SDKs/MacOSX10.13.sdk -arch x86_64 -arch i386   -flto -std=c99 -Wextra -Wno-unused-result -Wno-unused-parameter -Wno-missing-field-initializers -Wstrict-prototypes -Werror=implicit-function-declaration -fvisibility=hidden -fprofile-instr-generate -I./Include/internal  -I. -I./Include -isysroot /Library/Developer/CommandLineTools/SDKs/MacOSX10.13.sdk -I/opt/local/include -isysroot/Library/Developer/CommandLineTools/SDKs/MacOSX10.13.sdk   -DPy_BUILD_CORE -o Python/symtable.o Python/symtable.c
1237:info:build /usr/bin/clang -c -Wno-unused-result -Wsign-compare -Wunreachable-code -fno-common -dynamic -DNDEBUG -g -fwrapv -O3 -Wall -arch x86_64 -arch i386 -isysroot /Library/Developer/CommandLineTools/SDKs/MacOSX10.13.sdk -pipe -Os -isysroot/Library/Developer/CommandLineTools/SDKs/MacOSX10.13.sdk -arch x86_64 -arch i386   -flto -std=c99 -Wextra -Wno-unused-result -Wno-unused-parameter -Wno-missing-field-initializers -Wstrict-prototypes -Werror=implicit-function-declaration -fvisibility=hidden -fprofile-instr-generate -I./Include/internal  -I. -I./Include -isysroot /Library/Developer/CommandLineTools/SDKs/MacOSX10.13.sdk -I/opt/local/include -isysroot/Library/Developer/CommandLineTools/SDKs/MacOSX10.13.sdk   -DPy_BUILD_CORE \
1238:info:build             -DABIFLAGS='""' \
1239:info:build             -DMULTIARCH=\"darwin\" \
1240:info:build             -o Python/sysmodule.o ./Python/sysmodule.c
1241:info:build /usr/bin/clang -c -Wno-unused-result -Wsign-compare -Wunreachable-code -fno-common -dynamic -DNDEBUG -g -fwrapv -O3 -Wall -arch x86_64 -arch i386 -isysroot /Library/Developer/CommandLineTools/SDKs/MacOSX10.13.sdk -pipe -Os -isysroot/Library/Developer/CommandLineTools/SDKs/MacOSX10.13.sdk -arch x86_64 -arch i386   -flto -std=c99 -Wextra -Wno-unused-result -Wno-unused-parameter -Wno-missing-field-initializers -Wstrict-prototypes -Werror=implicit-function-declaration -fvisibility=hidden -fprofile-instr-generate -I./Include/internal  -I. -I./Include -isysroot /Library/Developer/CommandLineTools/SDKs/MacOSX10.13.sdk -I/opt/local/include -isysroot/Library/Developer/CommandLineTools/SDKs/MacOSX10.13.sdk   -DPy_BUILD_CORE -o Python/thread.o Python/thread.c
1242:info:build /usr/bin/clang -c -Wno-unused-result -Wsign-compare -Wunreachable-code -fno-common -dynamic -DNDEBUG -g -fwrapv -O3 -Wall -arch x86_64 -arch i386 -isysroot /Library/Developer/CommandLineTools/SDKs/MacOSX10.13.sdk -pipe -Os -isysroot/Library/Developer/CommandLineTools/SDKs/MacOSX10.13.sdk -arch x86_64 -arch i386   -flto -std=c99 -Wextra -Wno-unused-result -Wno-unused-parameter -Wno-missing-field-initializers -Wstrict-prototypes -Werror=implicit-function-declaration -fvisibility=hidden -fprofile-instr-generate -I./Include/internal  -I. -I./Include -isysroot /Library/Developer/CommandLineTools/SDKs/MacOSX10.13.sdk -I/opt/local/include -isysroot/Library/Developer/CommandLineTools/SDKs/MacOSX10.13.sdk   -DPy_BUILD_CORE -o Python/traceback.o Python/traceback.c
1243:info:build /usr/bin/clang -c -Wno-unused-result -Wsign-compare -Wunreachable-code -fno-common -dynamic -DNDEBUG -g -fwrapv -O3 -Wall -arch x86_64 -arch i386 -isysroot /Library/Developer/CommandLineTools/SDKs/MacOSX10.13.sdk -pipe -Os -isysroot/Library/Developer/CommandLineTools/SDKs/MacOSX10.13.sdk -arch x86_64 -arch i386   -flto -std=c99 -Wextra -Wno-unused-result -Wno-unused-parameter -Wno-missing-field-initializers -Wstrict-prototypes -Werror=implicit-function-declaration -fvisibility=hidden -fprofile-instr-generate -I./Include/internal  -I. -I./Include -isysroot /Library/Developer/CommandLineTools/SDKs/MacOSX10.13.sdk -I/opt/local/include -isysroot/Library/Developer/CommandLineTools/SDKs/MacOSX10.13.sdk   -DPy_BUILD_CORE -o Python/getopt.o Python/getopt.c
1244:info:build /usr/bin/clang -c -Wno-unused-result -Wsign-compare -Wunreachable-code -fno-common -dynamic -DNDEBUG -g -fwrapv -O3 -Wall -arch x86_64 -arch i386 -isysroot /Library/Developer/CommandLineTools/SDKs/MacOSX10.13.sdk -pipe -Os -isysroot/Library/Developer/CommandLineTools/SDKs/MacOSX10.13.sdk -arch x86_64 -arch i386   -flto -std=c99 -Wextra -Wno-unused-result -Wno-unused-parameter -Wno-missing-field-initializers -Wstrict-prototypes -Werror=implicit-function-declaration -fvisibility=hidden -fprofile-instr-generate -I./Include/internal  -I. -I./Include -isysroot /Library/Developer/CommandLineTools/SDKs/MacOSX10.13.sdk -I/opt/local/include -isysroot/Library/Developer/CommandLineTools/SDKs/MacOSX10.13.sdk   -DPy_BUILD_CORE -o Python/pystrcmp.o Python/pystrcmp.c
1245:info:build /usr/bin/clang -c -Wno-unused-result -Wsign-compare -Wunreachable-code -fno-common -dynamic -DNDEBUG -g -fwrapv -O3 -Wall -arch x86_64 -arch i386 -isysroot /Library/Developer/CommandLineTools/SDKs/MacOSX10.13.sdk -pipe -Os -isysroot/Library/Developer/CommandLineTools/SDKs/MacOSX10.13.sdk -arch x86_64 -arch i386   -flto -std=c99 -Wextra -Wno-unused-result -Wno-unused-parameter -Wno-missing-field-initializers -Wstrict-prototypes -Werror=implicit-function-declaration -fvisibility=hidden -fprofile-instr-generate -I./Include/internal  -I. -I./Include -isysroot /Library/Developer/CommandLineTools/SDKs/MacOSX10.13.sdk -I/opt/local/include -isysroot/Library/Developer/CommandLineTools/SDKs/MacOSX10.13.sdk   -DPy_BUILD_CORE -o Python/pystrtod.o Python/pystrtod.c
1246:info:build /usr/bin/clang -c -Wno-unused-result -Wsign-compare -Wunreachable-code -fno-common -dynamic -DNDEBUG -g -fwrapv -O3 -Wall -arch x86_64 -arch i386 -isysroot /Library/Developer/CommandLineTools/SDKs/MacOSX10.13.sdk -pipe -Os -isysroot/Library/Developer/CommandLineTools/SDKs/MacOSX10.13.sdk -arch x86_64 -arch i386   -flto -std=c99 -Wextra -Wno-unused-result -Wno-unused-parameter -Wno-missing-field-initializers -Wstrict-prototypes -Werror=implicit-function-declaration -fvisibility=hidden -fprofile-instr-generate -I./Include/internal  -I. -I./Include -isysroot /Library/Developer/CommandLineTools/SDKs/MacOSX10.13.sdk -I/opt/local/include -isysroot/Library/Developer/CommandLineTools/SDKs/MacOSX10.13.sdk   -DPy_BUILD_CORE -o Python/pystrhex.o Python/pystrhex.c
1247:info:build /usr/bin/clang -c -Wno-unused-result -Wsign-compare -Wunreachable-code -fno-common -dynamic -DNDEBUG -g -fwrapv -O3 -Wall -arch x86_64 -arch i386 -isysroot /Library/Developer/CommandLineTools/SDKs/MacOSX10.13.sdk -pipe -Os -isysroot/Library/Developer/CommandLineTools/SDKs/MacOSX10.13.sdk -arch x86_64 -arch i386   -flto -std=c99 -Wextra -Wno-unused-result -Wno-unused-parameter -Wno-missing-field-initializers -Wstrict-prototypes -Werror=implicit-function-declaration -fvisibility=hidden -fprofile-instr-generate -I./Include/internal  -I. -I./Include -isysroot /Library/Developer/CommandLineTools/SDKs/MacOSX10.13.sdk -I/opt/local/include -isysroot/Library/Developer/CommandLineTools/SDKs/MacOSX10.13.sdk   -DPy_BUILD_CORE -fno-strict-aliasing -o Python/dtoa.o Python/dtoa.c
1248:info:build /usr/bin/clang -c -Wno-unused-result -Wsign-compare -Wunreachable-code -fno-common -dynamic -DNDEBUG -g -fwrapv -O3 -Wall -arch x86_64 -arch i386 -isysroot /Library/Developer/CommandLineTools/SDKs/MacOSX10.13.sdk -pipe -Os -isysroot/Library/Developer/CommandLineTools/SDKs/MacOSX10.13.sdk -arch x86_64 -arch i386   -flto -std=c99 -Wextra -Wno-unused-result -Wno-unused-parameter -Wno-missing-field-initializers -Wstrict-prototypes -Werror=implicit-function-declaration -fvisibility=hidden -fprofile-instr-generate -I./Include/internal  -I. -I./Include -isysroot /Library/Developer/CommandLineTools/SDKs/MacOSX10.13.sdk -I/opt/local/include -isysroot/Library/Developer/CommandLineTools/SDKs/MacOSX10.13.sdk   -DPy_BUILD_CORE -o Python/formatter_unicode.o Python/formatter_unicode.c
1249:info:build /usr/bin/clang -c -Wno-unused-result -Wsign-compare -Wunreachable-code -fno-common -dynamic -DNDEBUG -g -fwrapv -O3 -Wall -arch x86_64 -arch i386 -isysroot /Library/Developer/CommandLineTools/SDKs/MacOSX10.13.sdk -pipe -Os -isysroot/Library/Developer/CommandLineTools/SDKs/MacOSX10.13.sdk -arch x86_64 -arch i386   -flto -std=c99 -Wextra -Wno-unused-result -Wno-unused-parameter -Wno-missing-field-initializers -Wstrict-prototypes -Werror=implicit-function-declaration -fvisibility=hidden -fprofile-instr-generate -I./Include/internal  -I. -I./Include -isysroot /Library/Developer/CommandLineTools/SDKs/MacOSX10.13.sdk -I/opt/local/include -isysroot/Library/Developer/CommandLineTools/SDKs/MacOSX10.13.sdk   -DPy_BUILD_CORE -o Python/fileutils.o Python/fileutils.c
1250:info:build /usr/bin/clang -c -Wno-unused-result -Wsign-compare -Wunreachable-code -fno-common -dynamic -DNDEBUG -g -fwrapv -O3 -Wall -arch x86_64 -arch i386 -isysroot /Library/Developer/CommandLineTools/SDKs/MacOSX10.13.sdk -pipe -Os -isysroot/Library/Developer/CommandLineTools/SDKs/MacOSX10.13.sdk -arch x86_64 -arch i386   -flto -std=c99 -Wextra -Wno-unused-result -Wno-unused-parameter -Wno-missing-field-initializers -Wstrict-prototypes -Werror=implicit-function-declaration -fvisibility=hidden -fprofile-instr-generate -I./Include/internal  -I. -I./Include -isysroot /Library/Developer/CommandLineTools/SDKs/MacOSX10.13.sdk -I/opt/local/include -isysroot/Library/Developer/CommandLineTools/SDKs/MacOSX10.13.sdk   -DPy_BUILD_CORE -o Python/suggestions.o Python/suggestions.c
1251:info:build /usr/bin/clang -c -Wno-unused-result -Wsign-compare -Wunreachable-code -fno-common -dynamic -DNDEBUG -g -fwrapv -O3 -Wall -arch x86_64 -arch i386 -isysroot /Library/Developer/CommandLineTools/SDKs/MacOSX10.13.sdk -pipe -Os -isysroot/Library/Developer/CommandLineTools/SDKs/MacOSX10.13.sdk -arch x86_64 -arch i386   -flto -std=c99 -Wextra -Wno-unused-result -Wno-unused-parameter -Wno-missing-field-initializers -Wstrict-prototypes -Werror=implicit-function-declaration -fvisibility=hidden -fprofile-instr-generate -I./Include/internal  -I. -I./Include -isysroot /Library/Developer/CommandLineTools/SDKs/MacOSX10.13.sdk -I/opt/local/include -isysroot/Library/Developer/CommandLineTools/SDKs/MacOSX10.13.sdk   -DPy_BUILD_CORE \
1252:info:build             -DSOABI='"cpython-310-darwin"' \
1253:info:build             -o Python/dynload_shlib.o ./Python/dynload_shlib.c
1254:info:build /usr/bin/clang -c -Wno-unused-result -Wsign-compare -Wunreachable-code -fno-common -dynamic -DNDEBUG -g -fwrapv -O3 -Wall -arch x86_64 -arch i386 -isysroot /Library/Developer/CommandLineTools/SDKs/MacOSX10.13.sdk -pipe -Os -isysroot/Library/Developer/CommandLineTools/SDKs/MacOSX10.13.sdk -arch x86_64 -arch i386   -flto -std=c99 -Wextra -Wno-unused-result -Wno-unused-parameter -Wno-missing-field-initializers -Wstrict-prototypes -Werror=implicit-function-declaration -fvisibility=hidden -fprofile-instr-generate -I./Include/internal  -I. -I./Include -isysroot /Library/Developer/CommandLineTools/SDKs/MacOSX10.13.sdk -I/opt/local/include -isysroot/Library/Developer/CommandLineTools/SDKs/MacOSX10.13.sdk   -DPy_BUILD_CORE -o Modules/config.o Modules/config.c
1255:info:build /usr/bin/clang -c -Wno-unused-result -Wsign-compare -Wunreachable-code -fno-common -dynamic -DNDEBUG -g -fwrapv -O3 -Wall -arch x86_64 -arch i386 -isysroot /Library/Developer/CommandLineTools/SDKs/MacOSX10.13.sdk -pipe -Os -isysroot/Library/Developer/CommandLineTools/SDKs/MacOSX10.13.sdk -arch x86_64 -arch i386   -flto -std=c99 -Wextra -Wno-unused-result -Wno-unused-parameter -Wno-missing-field-initializers -Wstrict-prototypes -Werror=implicit-function-declaration -fvisibility=hidden -fprofile-instr-generate -I./Include/internal  -I. -I./Include -isysroot /Library/Developer/CommandLineTools/SDKs/MacOSX10.13.sdk -I/opt/local/include -isysroot/Library/Developer/CommandLineTools/SDKs/MacOSX10.13.sdk   -DPy_BUILD_CORE -DPYTHONPATH='""' \
1256:info:build             -DPREFIX='"/opt/local/Library/Frameworks/Python.framework/Versions/3.10"' \
1257:info:build             -DEXEC_PREFIX='"/opt/local/Library/Frameworks/Python.framework/Versions/3.10"' \
1258:info:build             -DVERSION='"3.10"' \
1259:info:build             -DVPATH='""' \
1260:info:build             -o Modules/getpath.o ./Modules/getpath.c
1261:info:build ./Modules/getpath.c:1104:20: warning: 'NSModuleForSymbol' is deprecated: first deprecated in macOS 10.5 - dladdr() [-Wdeprecated-declarations]
1262:info:build     pythonModule = NSModuleForSymbol(NSLookupAndBindSymbol("_Py_Initialize"));
1263:info:build                    ^
1264:info:build /Library/Developer/CommandLineTools/SDKs/MacOSX10.13.sdk/usr/include/mach-o/dyld.h:203:21: note: 'NSModuleForSymbol' has been explicitly marked deprecated here
1265:info:build extern NSModule     NSModuleForSymbol(NSSymbol symbol) __IOS_UNAVAILABLE __BRIDGEOS_UNAVAILABLE __OSX_DEPRECATED(10.1, 10.5, "dladdr()");
1266:info:build                     ^
1267:info:build ./Modules/getpath.c:1104:38: warning: 'NSLookupAndBindSymbol' is deprecated: first deprecated in macOS 10.4 - dlsym() [-Wdeprecated-declarations]
1268:info:build     pythonModule = NSModuleForSymbol(NSLookupAndBindSymbol("_Py_Initialize"));
1269:info:build                                      ^
1270:info:build /Library/Developer/CommandLineTools/SDKs/MacOSX10.13.sdk/usr/include/mach-o/dyld.h:193:17: note: 'NSLookupAndBindSymbol' has been explicitly marked deprecated here
1271:info:build extern NSSymbol NSLookupAndBindSymbol(const char* symbolName)                                                    __IOS_UNAVAILABLE __BRIDGEOS_UNAVAILABLE __OSX_DEPRECATED(10.1, 10.4, "dlsym()");
1272:info:build                 ^
1273:info:build ./Modules/getpath.c:1107:27: warning: 'NSLibraryNameForModule' is deprecated: first deprecated in macOS 10.5 [-Wdeprecated-declarations]
1274:info:build     const char* modPath = NSLibraryNameForModule(pythonModule);
1275:info:build                           ^
1276:info:build /Library/Developer/CommandLineTools/SDKs/MacOSX10.13.sdk/usr/include/mach-o/dyld.h:173:21: note: 'NSLibraryNameForModule' has been explicitly marked deprecated here
1277:info:build extern const char*  NSLibraryNameForModule(NSModule m) __IOS_UNAVAILABLE __BRIDGEOS_UNAVAILABLE __OSX_DEPRECATED(10.1, 10.5, "");
1278:info:build                     ^
1279:info:build /usr/bin/clang -c -Wno-unused-result -Wsign-compare -Wunreachable-code -fno-common -dynamic -DNDEBUG -g -fwrapv -O3 -Wall -arch x86_64 -arch i386 -isysroot /Library/Developer/CommandLineTools/SDKs/MacOSX10.13.sdk -pipe -Os -isysroot/Library/Developer/CommandLineTools/SDKs/MacOSX10.13.sdk -arch x86_64 -arch i386   -flto -std=c99 -Wextra -Wno-unused-result -Wno-unused-parameter -Wno-missing-field-initializers -Wstrict-prototypes -Werror=implicit-function-declaration -fvisibility=hidden -fprofile-instr-generate -I./Include/internal  -I. -I./Include -isysroot /Library/Developer/CommandLineTools/SDKs/MacOSX10.13.sdk -I/opt/local/include -isysroot/Library/Developer/CommandLineTools/SDKs/MacOSX10.13.sdk   -DPy_BUILD_CORE -o Modules/main.o Modules/main.c
1280:info:build /usr/bin/clang -c -Wno-unused-result -Wsign-compare -Wunreachable-code -fno-common -dynamic -DNDEBUG -g -fwrapv -O3 -Wall -arch x86_64 -arch i386 -isysroot /Library/Developer/CommandLineTools/SDKs/MacOSX10.13.sdk -pipe -Os -isysroot/Library/Developer/CommandLineTools/SDKs/MacOSX10.13.sdk -arch x86_64 -arch i386   -flto -std=c99 -Wextra -Wno-unused-result -Wno-unused-parameter -Wno-missing-field-initializers -Wstrict-prototypes -Werror=implicit-function-declaration -fvisibility=hidden -fprofile-instr-generate -I./Include/internal  -I. -I./Include -isysroot /Library/Developer/CommandLineTools/SDKs/MacOSX10.13.sdk -I/opt/local/include -isysroot/Library/Developer/CommandLineTools/SDKs/MacOSX10.13.sdk   -DPy_BUILD_CORE -o Modules/gcmodule.o Modules/gcmodule.c
1281:info:build /usr/bin/clang -Wno-unused-result -Wsign-compare -Wunreachable-code -fno-common -dynamic -DNDEBUG -g -fwrapv -O3 -Wall -arch x86_64 -arch i386 -isysroot /Library/Developer/CommandLineTools/SDKs/MacOSX10.13.sdk -pipe -Os -isysroot/Library/Developer/CommandLineTools/SDKs/MacOSX10.13.sdk -arch x86_64 -arch i386   -flto -std=c99 -Wextra -Wno-unused-result -Wno-unused-parameter -Wno-missing-field-initializers -Wstrict-prototypes -Werror=implicit-function-declaration -fvisibility=hidden -fprofile-instr-generate -I./Include/internal  -I. -I./Include -isysroot /Library/Developer/CommandLineTools/SDKs/MacOSX10.13.sdk -I/opt/local/include -isysroot/Library/Developer/CommandLineTools/SDKs/MacOSX10.13.sdk   -DPy_BUILD_CORE_BUILTIN  -DPy_BUILD_CORE_BUILTIN -I./Include/internal -c ./Modules/posixmodule.c -o Modules/posixmodule.o
1282:info:build 3 warnings generated.
1283:info:build /usr/bin/clang -Wno-unused-result -Wsign-compare -Wunreachable-code -fno-common -dynamic -DNDEBUG -g -fwrapv -O3 -Wall -arch x86_64 -arch i386 -isysroot /Library/Developer/CommandLineTools/SDKs/MacOSX10.13.sdk -pipe -Os -isysroot/Library/Developer/CommandLineTools/SDKs/MacOSX10.13.sdk -arch x86_64 -arch i386   -flto -std=c99 -Wextra -Wno-unused-result -Wno-unused-parameter -Wno-missing-field-initializers -Wstrict-prototypes -Werror=implicit-function-declaration -fvisibility=hidden -fprofile-instr-generate -I./Include/internal  -I. -I./Include -isysroot /Library/Developer/CommandLineTools/SDKs/MacOSX10.13.sdk -I/opt/local/include -isysroot/Library/Developer/CommandLineTools/SDKs/MacOSX10.13.sdk   -DPy_BUILD_CORE_BUILTIN  -c ./Modules/errnomodule.c -o Modules/errnomodule.o
1284:info:build ./Modules/getpath.c:1104:20: warning: 'NSModuleForSymbol' is deprecated: first deprecated in macOS 10.5 - dladdr() [-Wdeprecated-declarations]
1285:info:build     pythonModule = NSModuleForSymbol(NSLookupAndBindSymbol("_Py_Initialize"));
1286:info:build                    ^
1287:info:build /Library/Developer/CommandLineTools/SDKs/MacOSX10.13.sdk/usr/include/mach-o/dyld.h:203:21: note: 'NSModuleForSymbol' has been explicitly marked deprecated here
1288:info:build extern NSModule     NSModuleForSymbol(NSSymbol symbol) __IOS_UNAVAILABLE __BRIDGEOS_UNAVAILABLE __OSX_DEPRECATED(10.1, 10.5, "dladdr()");
1289:info:build                     ^
1290:info:build ./Modules/getpath.c:1104:38: warning: 'NSLookupAndBindSymbol' is deprecated: first deprecated in macOS 10.4 - dlsym() [-Wdeprecated-declarations]
1291:info:build     pythonModule = NSModuleForSymbol(NSLookupAndBindSymbol("_Py_Initialize"));
1292:info:build                                      ^
1293:info:build /Library/Developer/CommandLineTools/SDKs/MacOSX10.13.sdk/usr/include/mach-o/dyld.h:193:17: note: 'NSLookupAndBindSymbol' has been explicitly marked deprecated here
1294:info:build extern NSSymbol NSLookupAndBindSymbol(const char* symbolName)                                                    __IOS_UNAVAILABLE __BRIDGEOS_UNAVAILABLE __OSX_DEPRECATED(10.1, 10.4, "dlsym()");
1295:info:build                 ^
1296:info:build ./Modules/getpath.c:1107:27: warning: 'NSLibraryNameForModule' is deprecated: first deprecated in macOS 10.5 [-Wdeprecated-declarations]
1297:info:build     const char* modPath = NSLibraryNameForModule(pythonModule);
1298:info:build                           ^
1299:info:build /Library/Developer/CommandLineTools/SDKs/MacOSX10.13.sdk/usr/include/mach-o/dyld.h:173:21: note: 'NSLibraryNameForModule' has been explicitly marked deprecated here
1300:info:build extern const char*  NSLibraryNameForModule(NSModule m) __IOS_UNAVAILABLE __BRIDGEOS_UNAVAILABLE __OSX_DEPRECATED(10.1, 10.5, "");
1301:info:build                     ^
1302:info:build /usr/bin/clang -Wno-unused-result -Wsign-compare -Wunreachable-code -fno-common -dynamic -DNDEBUG -g -fwrapv -O3 -Wall -arch x86_64 -arch i386 -isysroot /Library/Developer/CommandLineTools/SDKs/MacOSX10.13.sdk -pipe -Os -isysroot/Library/Developer/CommandLineTools/SDKs/MacOSX10.13.sdk -arch x86_64 -arch i386   -flto -std=c99 -Wextra -Wno-unused-result -Wno-unused-parameter -Wno-missing-field-initializers -Wstrict-prototypes -Werror=implicit-function-declaration -fvisibility=hidden -fprofile-instr-generate -I./Include/internal  -I. -I./Include -isysroot /Library/Developer/CommandLineTools/SDKs/MacOSX10.13.sdk -I/opt/local/include -isysroot/Library/Developer/CommandLineTools/SDKs/MacOSX10.13.sdk   -DPy_BUILD_CORE_BUILTIN  -c ./Modules/pwdmodule.c -o Modules/pwdmodule.o
1303:info:build 3 warnings generated.
1304:info:build /usr/bin/clang -Wno-unused-result -Wsign-compare -Wunreachable-code -fno-common -dynamic -DNDEBUG -g -fwrapv -O3 -Wall -arch x86_64 -arch i386 -isysroot /Library/Developer/CommandLineTools/SDKs/MacOSX10.13.sdk -pipe -Os -isysroot/Library/Developer/CommandLineTools/SDKs/MacOSX10.13.sdk -arch x86_64 -arch i386   -flto -std=c99 -Wextra -Wno-unused-result -Wno-unused-parameter -Wno-missing-field-initializers -Wstrict-prototypes -Werror=implicit-function-declaration -fvisibility=hidden -fprofile-instr-generate -I./Include/internal  -I. -I./Include -isysroot /Library/Developer/CommandLineTools/SDKs/MacOSX10.13.sdk -I/opt/local/include -isysroot/Library/Developer/CommandLineTools/SDKs/MacOSX10.13.sdk   -DPy_BUILD_CORE_BUILTIN  -DPy_BUILD_CORE_BUILTIN -c ./Modules/_sre.c -o Modules/_sre.o
1305:info:build /usr/bin/clang -Wno-unused-result -Wsign-compare -Wunreachable-code -fno-common -dynamic -DNDEBUG -g -fwrapv -O3 -Wall -arch x86_64 -arch i386 -isysroot /Library/Developer/CommandLineTools/SDKs/MacOSX10.13.sdk -pipe -Os -isysroot/Library/Developer/CommandLineTools/SDKs/MacOSX10.13.sdk -arch x86_64 -arch i386   -flto -std=c99 -Wextra -Wno-unused-result -Wno-unused-parameter -Wno-missing-field-initializers -Wstrict-prototypes -Werror=implicit-function-declaration -fvisibility=hidden -fprofile-instr-generate -I./Include/internal  -I. -I./Include -isysroot /Library/Developer/CommandLineTools/SDKs/MacOSX10.13.sdk -I/opt/local/include -isysroot/Library/Developer/CommandLineTools/SDKs/MacOSX10.13.sdk   -DPy_BUILD_CORE_BUILTIN  -c ./Modules/_codecsmodule.c -o Modules/_codecsmodule.o
1306:info:build /usr/bin/clang -Wno-unused-result -Wsign-compare -Wunreachable-code -fno-common -dynamic -DNDEBUG -g -fwrapv -O3 -Wall -arch x86_64 -arch i386 -isysroot /Library/Developer/CommandLineTools/SDKs/MacOSX10.13.sdk -pipe -Os -isysroot/Library/Developer/CommandLineTools/SDKs/MacOSX10.13.sdk -arch x86_64 -arch i386   -flto -std=c99 -Wextra -Wno-unused-result -Wno-unused-parameter -Wno-missing-field-initializers -Wstrict-prototypes -Werror=implicit-function-declaration -fvisibility=hidden -fprofile-instr-generate -I./Include/internal  -I. -I./Include -isysroot /Library/Developer/CommandLineTools/SDKs/MacOSX10.13.sdk -I/opt/local/include -isysroot/Library/Developer/CommandLineTools/SDKs/MacOSX10.13.sdk   -DPy_BUILD_CORE_BUILTIN  -c ./Modules/_weakref.c -o Modules/_weakref.o
1307:info:build /usr/bin/clang -Wno-unused-result -Wsign-compare -Wunreachable-code -fno-common -dynamic -DNDEBUG -g -fwrapv -O3 -Wall -arch x86_64 -arch i386 -isysroot /Library/Developer/CommandLineTools/SDKs/MacOSX10.13.sdk -pipe -Os -isysroot/Library/Developer/CommandLineTools/SDKs/MacOSX10.13.sdk -arch x86_64 -arch i386   -flto -std=c99 -Wextra -Wno-unused-result -Wno-unused-parameter -Wno-missing-field-initializers -Wstrict-prototypes -Werror=implicit-function-declaration -fvisibility=hidden -fprofile-instr-generate -I./Include/internal  -I. -I./Include -isysroot /Library/Developer/CommandLineTools/SDKs/MacOSX10.13.sdk -I/opt/local/include -isysroot/Library/Developer/CommandLineTools/SDKs/MacOSX10.13.sdk   -DPy_BUILD_CORE_BUILTIN  -DPy_BUILD_CORE_BUILTIN -I./Include/internal -c ./Modules/_functoolsmodule.c -o Modules/_functoolsmodule.o
1308:info:build /usr/bin/clang -Wno-unused-result -Wsign-compare -Wunreachable-code -fno-common -dynamic -DNDEBUG -g -fwrapv -O3 -Wall -arch x86_64 -arch i386 -isysroot /Library/Developer/CommandLineTools/SDKs/MacOSX10.13.sdk -pipe -Os -isysroot/Library/Developer/CommandLineTools/SDKs/MacOSX10.13.sdk -arch x86_64 -arch i386   -flto -std=c99 -Wextra -Wno-unused-result -Wno-unused-parameter -Wno-missing-field-initializers -Wstrict-prototypes -Werror=implicit-function-declaration -fvisibility=hidden -fprofile-instr-generate -I./Include/internal  -I. -I./Include -isysroot /Library/Developer/CommandLineTools/SDKs/MacOSX10.13.sdk -I/opt/local/include -isysroot/Library/Developer/CommandLineTools/SDKs/MacOSX10.13.sdk   -DPy_BUILD_CORE_BUILTIN  -DPy_BUILD_CORE_BUILTIN -c ./Modules/_operator.c -o Modules/_operator.o
1309:info:build /usr/bin/clang -Wno-unused-result -Wsign-compare -Wunreachable-code -fno-common -dynamic -DNDEBUG -g -fwrapv -O3 -Wall -arch x86_64 -arch i386 -isysroot /Library/Developer/CommandLineTools/SDKs/MacOSX10.13.sdk -pipe -Os -isysroot/Library/Developer/CommandLineTools/SDKs/MacOSX10.13.sdk -arch x86_64 -arch i386   -flto -std=c99 -Wextra -Wno-unused-result -Wno-unused-parameter -Wno-missing-field-initializers -Wstrict-prototypes -Werror=implicit-function-declaration -fvisibility=hidden -fprofile-instr-generate -I./Include/internal  -I. -I./Include -isysroot /Library/Developer/CommandLineTools/SDKs/MacOSX10.13.sdk -I/opt/local/include -isysroot/Library/Developer/CommandLineTools/SDKs/MacOSX10.13.sdk   -DPy_BUILD_CORE_BUILTIN  -c ./Modules/_collectionsmodule.c -o Modules/_collectionsmodule.o
1310:info:build /usr/bin/clang -Wno-unused-result -Wsign-compare -Wunreachable-code -fno-common -dynamic -DNDEBUG -g -fwrapv -O3 -Wall -arch x86_64 -arch i386 -isysroot /Library/Developer/CommandLineTools/SDKs/MacOSX10.13.sdk -pipe -Os -isysroot/Library/Developer/CommandLineTools/SDKs/MacOSX10.13.sdk -arch x86_64 -arch i386   -flto -std=c99 -Wextra -Wno-unused-result -Wno-unused-parameter -Wno-missing-field-initializers -Wstrict-prototypes -Werror=implicit-function-declaration -fvisibility=hidden -fprofile-instr-generate -I./Include/internal  -I. -I./Include -isysroot /Library/Developer/CommandLineTools/SDKs/MacOSX10.13.sdk -I/opt/local/include -isysroot/Library/Developer/CommandLineTools/SDKs/MacOSX10.13.sdk   -DPy_BUILD_CORE_BUILTIN  -DPy_BUILD_CORE_BUILTIN -c ./Modules/_abc.c -o Modules/_abc.o
1311:info:build /usr/bin/clang -Wno-unused-result -Wsign-compare -Wunreachable-code -fno-common -dynamic -DNDEBUG -g -fwrapv -O3 -Wall -arch x86_64 -arch i386 -isysroot /Library/Developer/CommandLineTools/SDKs/MacOSX10.13.sdk -pipe -Os -isysroot/Library/Developer/CommandLineTools/SDKs/MacOSX10.13.sdk -arch x86_64 -arch i386   -flto -std=c99 -Wextra -Wno-unused-result -Wno-unused-parameter -Wno-missing-field-initializers -Wstrict-prototypes -Werror=implicit-function-declaration -fvisibility=hidden -fprofile-instr-generate -I./Include/internal  -I. -I./Include -isysroot /Library/Developer/CommandLineTools/SDKs/MacOSX10.13.sdk -I/opt/local/include -isysroot/Library/Developer/CommandLineTools/SDKs/MacOSX10.13.sdk   -DPy_BUILD_CORE_BUILTIN  -c ./Modules/itertoolsmodule.c -o Modules/itertoolsmodule.o
1312:info:build /usr/bin/clang -Wno-unused-result -Wsign-compare -Wunreachable-code -fno-common -dynamic -DNDEBUG -g -fwrapv -O3 -Wall -arch x86_64 -arch i386 -isysroot /Library/Developer/CommandLineTools/SDKs/MacOSX10.13.sdk -pipe -Os -isysroot/Library/Developer/CommandLineTools/SDKs/MacOSX10.13.sdk -arch x86_64 -arch i386   -flto -std=c99 -Wextra -Wno-unused-result -Wno-unused-parameter -Wno-missing-field-initializers -Wstrict-prototypes -Werror=implicit-function-declaration -fvisibility=hidden -fprofile-instr-generate -I./Include/internal  -I. -I./Include -isysroot /Library/Developer/CommandLineTools/SDKs/MacOSX10.13.sdk -I/opt/local/include -isysroot/Library/Developer/CommandLineTools/SDKs/MacOSX10.13.sdk   -DPy_BUILD_CORE_BUILTIN  -c ./Modules/atexitmodule.c -o Modules/atexitmodule.o
1313:info:build /usr/bin/clang -Wno-unused-result -Wsign-compare -Wunreachable-code -fno-common -dynamic -DNDEBUG -g -fwrapv -O3 -Wall -arch x86_64 -arch i386 -isysroot /Library/Developer/CommandLineTools/SDKs/MacOSX10.13.sdk -pipe -Os -isysroot/Library/Developer/CommandLineTools/SDKs/MacOSX10.13.sdk -arch x86_64 -arch i386   -flto -std=c99 -Wextra -Wno-unused-result -Wno-unused-parameter -Wno-missing-field-initializers -Wstrict-prototypes -Werror=implicit-function-declaration -fvisibility=hidden -fprofile-instr-generate -I./Include/internal  -I. -I./Include -isysroot /Library/Developer/CommandLineTools/SDKs/MacOSX10.13.sdk -I/opt/local/include -isysroot/Library/Developer/CommandLineTools/SDKs/MacOSX10.13.sdk   -DPy_BUILD_CORE_BUILTIN  -DPy_BUILD_CORE_BUILTIN -I./Include/internal -c ./Modules/signalmodule.c -o Modules/signalmodule.o
1314:info:build /usr/bin/clang -Wno-unused-result -Wsign-compare -Wunreachable-code -fno-common -dynamic -DNDEBUG -g -fwrapv -O3 -Wall -arch x86_64 -arch i386 -isysroot /Library/Developer/CommandLineTools/SDKs/MacOSX10.13.sdk -pipe -Os -isysroot/Library/Developer/CommandLineTools/SDKs/MacOSX10.13.sdk -arch x86_64 -arch i386   -flto -std=c99 -Wextra -Wno-unused-result -Wno-unused-parameter -Wno-missing-field-initializers -Wstrict-prototypes -Werror=implicit-function-declaration -fvisibility=hidden -fprofile-instr-generate -I./Include/internal  -I. -I./Include -isysroot /Library/Developer/CommandLineTools/SDKs/MacOSX10.13.sdk -I/opt/local/include -isysroot/Library/Developer/CommandLineTools/SDKs/MacOSX10.13.sdk   -DPy_BUILD_CORE_BUILTIN  -c ./Modules/_stat.c -o Modules/_stat.o
1315:info:build /usr/bin/clang -Wno-unused-result -Wsign-compare -Wunreachable-code -fno-common -dynamic -DNDEBUG -g -fwrapv -O3 -Wall -arch x86_64 -arch i386 -isysroot /Library/Developer/CommandLineTools/SDKs/MacOSX10.13.sdk -pipe -Os -isysroot/Library/Developer/CommandLineTools/SDKs/MacOSX10.13.sdk -arch x86_64 -arch i386   -flto -std=c99 -Wextra -Wno-unused-result -Wno-unused-parameter -Wno-missing-field-initializers -Wstrict-prototypes -Werror=implicit-function-declaration -fvisibility=hidden -fprofile-instr-generate -I./Include/internal  -I. -I./Include -isysroot /Library/Developer/CommandLineTools/SDKs/MacOSX10.13.sdk -I/opt/local/include -isysroot/Library/Developer/CommandLineTools/SDKs/MacOSX10.13.sdk   -DPy_BUILD_CORE_BUILTIN  -DPy_BUILD_CORE_BUILTIN -I./Include/internal -c ./Modules/timemodule.c -o Modules/timemodule.o
1316:info:build /usr/bin/clang -Wno-unused-result -Wsign-compare -Wunreachable-code -fno-common -dynamic -DNDEBUG -g -fwrapv -O3 -Wall -arch x86_64 -arch i386 -isysroot /Library/Developer/CommandLineTools/SDKs/MacOSX10.13.sdk -pipe -Os -isysroot/Library/Developer/CommandLineTools/SDKs/MacOSX10.13.sdk -arch x86_64 -arch i386   -flto -std=c99 -Wextra -Wno-unused-result -Wno-unused-parameter -Wno-missing-field-initializers -Wstrict-prototypes -Werror=implicit-function-declaration -fvisibility=hidden -fprofile-instr-generate -I./Include/internal  -I. -I./Include -isysroot /Library/Developer/CommandLineTools/SDKs/MacOSX10.13.sdk -I/opt/local/include -isysroot/Library/Developer/CommandLineTools/SDKs/MacOSX10.13.sdk   -DPy_BUILD_CORE_BUILTIN  -DPy_BUILD_CORE_BUILTIN -I./Include/internal -c ./Modules/_threadmodule.c -o Modules/_threadmodule.o
1317:info:build /usr/bin/clang -Wno-unused-result -Wsign-compare -Wunreachable-code -fno-common -dynamic -DNDEBUG -g -fwrapv -O3 -Wall -arch x86_64 -arch i386 -isysroot /Library/Developer/CommandLineTools/SDKs/MacOSX10.13.sdk -pipe -Os -isysroot/Library/Developer/CommandLineTools/SDKs/MacOSX10.13.sdk -arch x86_64 -arch i386   -flto -std=c99 -Wextra -Wno-unused-result -Wno-unused-parameter -Wno-missing-field-initializers -Wstrict-prototypes -Werror=implicit-function-declaration -fvisibility=hidden -fprofile-instr-generate -I./Include/internal  -I. -I./Include -isysroot /Library/Developer/CommandLineTools/SDKs/MacOSX10.13.sdk -I/opt/local/include -isysroot/Library/Developer/CommandLineTools/SDKs/MacOSX10.13.sdk   -DPy_BUILD_CORE_BUILTIN  -DPy_BUILD_CORE_BUILTIN -c ./Modules/_localemodule.c -o Modules/_localemodule.o
1318:info:build /usr/bin/clang -Wno-unused-result -Wsign-compare -Wunreachable-code -fno-common -dynamic -DNDEBUG -g -fwrapv -O3 -Wall -arch x86_64 -arch i386 -isysroot /Library/Developer/CommandLineTools/SDKs/MacOSX10.13.sdk -pipe -Os -isysroot/Library/Developer/CommandLineTools/SDKs/MacOSX10.13.sdk -arch x86_64 -arch i386   -flto -std=c99 -Wextra -Wno-unused-result -Wno-unused-parameter -Wno-missing-field-initializers -Wstrict-prototypes -Werror=implicit-function-declaration -fvisibility=hidden -fprofile-instr-generate -I./Include/internal  -I. -I./Include -isysroot /Library/Developer/CommandLineTools/SDKs/MacOSX10.13.sdk -I/opt/local/include -isysroot/Library/Developer/CommandLineTools/SDKs/MacOSX10.13.sdk   -DPy_BUILD_CORE_BUILTIN  -DPy_BUILD_CORE_BUILTIN -I./Include/internal -I./Modules/_io -c ./Modules/_io/_iomodule.c -o Modules/_iomodule.o
1319:info:build /usr/bin/clang -Wno-unused-result -Wsign-compare -Wunreachable-code -fno-common -dynamic -DNDEBUG -g -fwrapv -O3 -Wall -arch x86_64 -arch i386 -isysroot /Library/Developer/CommandLineTools/SDKs/MacOSX10.13.sdk -pipe -Os -isysroot/Library/Developer/CommandLineTools/SDKs/MacOSX10.13.sdk -arch x86_64 -arch i386   -flto -std=c99 -Wextra -Wno-unused-result -Wno-unused-parameter -Wno-missing-field-initializers -Wstrict-prototypes -Werror=implicit-function-declaration -fvisibility=hidden -fprofile-instr-generate -I./Include/internal  -I. -I./Include -isysroot /Library/Developer/CommandLineTools/SDKs/MacOSX10.13.sdk -I/opt/local/include -isysroot/Library/Developer/CommandLineTools/SDKs/MacOSX10.13.sdk   -DPy_BUILD_CORE_BUILTIN  -DPy_BUILD_CORE_BUILTIN -I./Include/internal -I./Modules/_io -c ./Modules/_io/iobase.c -o Modules/iobase.o
1320:info:build /usr/bin/clang -Wno-unused-result -Wsign-compare -Wunreachable-code -fno-common -dynamic -DNDEBUG -g -fwrapv -O3 -Wall -arch x86_64 -arch i386 -isysroot /Library/Developer/CommandLineTools/SDKs/MacOSX10.13.sdk -pipe -Os -isysroot/Library/Developer/CommandLineTools/SDKs/MacOSX10.13.sdk -arch x86_64 -arch i386   -flto -std=c99 -Wextra -Wno-unused-result -Wno-unused-parameter -Wno-missing-field-initializers -Wstrict-prototypes -Werror=implicit-function-declaration -fvisibility=hidden -fprofile-instr-generate -I./Include/internal  -I. -I./Include -isysroot /Library/Developer/CommandLineTools/SDKs/MacOSX10.13.sdk -I/opt/local/include -isysroot/Library/Developer/CommandLineTools/SDKs/MacOSX10.13.sdk   -DPy_BUILD_CORE_BUILTIN  -DPy_BUILD_CORE_BUILTIN -I./Include/internal -I./Modules/_io -c ./Modules/_io/fileio.c -o Modules/fileio.o
1321:info:build /usr/bin/clang -Wno-unused-result -Wsign-compare -Wunreachable-code -fno-common -dynamic -DNDEBUG -g -fwrapv -O3 -Wall -arch x86_64 -arch i386 -isysroot /Library/Developer/CommandLineTools/SDKs/MacOSX10.13.sdk -pipe -Os -isysroot/Library/Developer/CommandLineTools/SDKs/MacOSX10.13.sdk -arch x86_64 -arch i386   -flto -std=c99 -Wextra -Wno-unused-result -Wno-unused-parameter -Wno-missing-field-initializers -Wstrict-prototypes -Werror=implicit-function-declaration -fvisibility=hidden -fprofile-instr-generate -I./Include/internal  -I. -I./Include -isysroot /Library/Developer/CommandLineTools/SDKs/MacOSX10.13.sdk -I/opt/local/include -isysroot/Library/Developer/CommandLineTools/SDKs/MacOSX10.13.sdk   -DPy_BUILD_CORE_BUILTIN  -DPy_BUILD_CORE_BUILTIN -I./Include/internal -I./Modules/_io -c ./Modules/_io/bytesio.c -o Modules/bytesio.o
1322:info:build /usr/bin/clang -Wno-unused-result -Wsign-compare -Wunreachable-code -fno-common -dynamic -DNDEBUG -g -fwrapv -O3 -Wall -arch x86_64 -arch i386 -isysroot /Library/Developer/CommandLineTools/SDKs/MacOSX10.13.sdk -pipe -Os -isysroot/Library/Developer/CommandLineTools/SDKs/MacOSX10.13.sdk -arch x86_64 -arch i386   -flto -std=c99 -Wextra -Wno-unused-result -Wno-unused-parameter -Wno-missing-field-initializers -Wstrict-prototypes -Werror=implicit-function-declaration -fvisibility=hidden -fprofile-instr-generate -I./Include/internal  -I. -I./Include -isysroot /Library/Developer/CommandLineTools/SDKs/MacOSX10.13.sdk -I/opt/local/include -isysroot/Library/Developer/CommandLineTools/SDKs/MacOSX10.13.sdk   -DPy_BUILD_CORE_BUILTIN  -DPy_BUILD_CORE_BUILTIN -I./Include/internal -I./Modules/_io -c ./Modules/_io/bufferedio.c -o Modules/bufferedio.o
1323:info:build /usr/bin/clang -Wno-unused-result -Wsign-compare -Wunreachable-code -fno-common -dynamic -DNDEBUG -g -fwrapv -O3 -Wall -arch x86_64 -arch i386 -isysroot /Library/Developer/CommandLineTools/SDKs/MacOSX10.13.sdk -pipe -Os -isysroot/Library/Developer/CommandLineTools/SDKs/MacOSX10.13.sdk -arch x86_64 -arch i386   -flto -std=c99 -Wextra -Wno-unused-result -Wno-unused-parameter -Wno-missing-field-initializers -Wstrict-prototypes -Werror=implicit-function-declaration -fvisibility=hidden -fprofile-instr-generate -I./Include/internal  -I. -I./Include -isysroot /Library/Developer/CommandLineTools/SDKs/MacOSX10.13.sdk -I/opt/local/include -isysroot/Library/Developer/CommandLineTools/SDKs/MacOSX10.13.sdk   -DPy_BUILD_CORE_BUILTIN  -DPy_BUILD_CORE_BUILTIN -I./Include/internal -I./Modules/_io -c ./Modules/_io/textio.c -o Modules/textio.o
1324:info:build /usr/bin/clang -Wno-unused-result -Wsign-compare -Wunreachable-code -fno-common -dynamic -DNDEBUG -g -fwrapv -O3 -Wall -arch x86_64 -arch i386 -isysroot /Library/Developer/CommandLineTools/SDKs/MacOSX10.13.sdk -pipe -Os -isysroot/Library/Developer/CommandLineTools/SDKs/MacOSX10.13.sdk -arch x86_64 -arch i386   -flto -std=c99 -Wextra -Wno-unused-result -Wno-unused-parameter -Wno-missing-field-initializers -Wstrict-prototypes -Werror=implicit-function-declaration -fvisibility=hidden -fprofile-instr-generate -I./Include/internal  -I. -I./Include -isysroot /Library/Developer/CommandLineTools/SDKs/MacOSX10.13.sdk -I/opt/local/include -isysroot/Library/Developer/CommandLineTools/SDKs/MacOSX10.13.sdk   -DPy_BUILD_CORE_BUILTIN  -DPy_BUILD_CORE_BUILTIN -I./Include/internal -I./Modules/_io -c ./Modules/_io/stringio.c -o Modules/stringio.o
1325:info:build /usr/bin/clang -Wno-unused-result -Wsign-compare -Wunreachable-code -fno-common -dynamic -DNDEBUG -g -fwrapv -O3 -Wall -arch x86_64 -arch i386 -isysroot /Library/Developer/CommandLineTools/SDKs/MacOSX10.13.sdk -pipe -Os -isysroot/Library/Developer/CommandLineTools/SDKs/MacOSX10.13.sdk -arch x86_64 -arch i386   -flto -std=c99 -Wextra -Wno-unused-result -Wno-unused-parameter -Wno-missing-field-initializers -Wstrict-prototypes -Werror=implicit-function-declaration -fvisibility=hidden -fprofile-instr-generate -I./Include/internal  -I. -I./Include -isysroot /Library/Developer/CommandLineTools/SDKs/MacOSX10.13.sdk -I/opt/local/include -isysroot/Library/Developer/CommandLineTools/SDKs/MacOSX10.13.sdk   -DPy_BUILD_CORE_BUILTIN  -c ./Modules/faulthandler.c -o Modules/faulthandler.o
1326:info:build /usr/bin/clang -Wno-unused-result -Wsign-compare -Wunreachable-code -fno-common -dynamic -DNDEBUG -g -fwrapv -O3 -Wall -arch x86_64 -arch i386 -isysroot /Library/Developer/CommandLineTools/SDKs/MacOSX10.13.sdk -pipe -Os -isysroot/Library/Developer/CommandLineTools/SDKs/MacOSX10.13.sdk -arch x86_64 -arch i386   -flto -std=c99 -Wextra -Wno-unused-result -Wno-unused-parameter -Wno-missing-field-initializers -Wstrict-prototypes -Werror=implicit-function-declaration -fvisibility=hidden -fprofile-instr-generate -I./Include/internal  -I. -I./Include -isysroot /Library/Developer/CommandLineTools/SDKs/MacOSX10.13.sdk -I/opt/local/include -isysroot/Library/Developer/CommandLineTools/SDKs/MacOSX10.13.sdk   -DPy_BUILD_CORE_BUILTIN  -c ./Modules/_tracemalloc.c -o Modules/_tracemalloc.o
1327:info:build /usr/bin/clang -Wno-unused-result -Wsign-compare -Wunreachable-code -fno-common -dynamic -DNDEBUG -g -fwrapv -O3 -Wall -arch x86_64 -arch i386 -isysroot /Library/Developer/CommandLineTools/SDKs/MacOSX10.13.sdk -pipe -Os -isysroot/Library/Developer/CommandLineTools/SDKs/MacOSX10.13.sdk -arch x86_64 -arch i386   -flto -std=c99 -Wextra -Wno-unused-result -Wno-unused-parameter -Wno-missing-field-initializers -Wstrict-prototypes -Werror=implicit-function-declaration -fvisibility=hidden -fprofile-instr-generate -I./Include/internal  -I. -I./Include -isysroot /Library/Developer/CommandLineTools/SDKs/MacOSX10.13.sdk -I/opt/local/include -isysroot/Library/Developer/CommandLineTools/SDKs/MacOSX10.13.sdk   -DPy_BUILD_CORE_BUILTIN  -c ./Modules/symtablemodule.c -o Modules/symtablemodule.o
1328:info:build /usr/bin/clang -Wno-unused-result -Wsign-compare -Wunreachable-code -fno-common -dynamic -DNDEBUG -g -fwrapv -O3 -Wall -arch x86_64 -arch i386 -isysroot /Library/Developer/CommandLineTools/SDKs/MacOSX10.13.sdk -pipe -Os -isysroot/Library/Developer/CommandLineTools/SDKs/MacOSX10.13.sdk -arch x86_64 -arch i386   -flto -std=c99 -Wextra -Wno-unused-result -Wno-unused-parameter -Wno-missing-field-initializers -Wstrict-prototypes -Werror=implicit-function-declaration -fvisibility=hidden -fprofile-instr-generate -I./Include/internal  -I. -I./Include -isysroot /Library/Developer/CommandLineTools/SDKs/MacOSX10.13.sdk -I/opt/local/include -isysroot/Library/Developer/CommandLineTools/SDKs/MacOSX10.13.sdk   -DPy_BUILD_CORE_BUILTIN  -c ./Modules/xxsubtype.c -o Modules/xxsubtype.o
1329:info:build /usr/bin/clang -c -Wno-unused-result -Wsign-compare -Wunreachable-code -fno-common -dynamic -DNDEBUG -g -fwrapv -O3 -Wall -arch x86_64 -arch i386 -isysroot /Library/Developer/CommandLineTools/SDKs/MacOSX10.13.sdk -pipe -Os -isysroot/Library/Developer/CommandLineTools/SDKs/MacOSX10.13.sdk -arch x86_64 -arch i386   -flto -std=c99 -Wextra -Wno-unused-result -Wno-unused-parameter -Wno-missing-field-initializers -Wstrict-prototypes -Werror=implicit-function-declaration -fvisibility=hidden -fprofile-instr-generate -I./Include/internal  -I. -I./Include -isysroot /Library/Developer/CommandLineTools/SDKs/MacOSX10.13.sdk -I/opt/local/include -isysroot/Library/Developer/CommandLineTools/SDKs/MacOSX10.13.sdk   -DPy_BUILD_CORE -o Python/frozen.o Python/frozen.c
1330:info:build /usr/bin/clang -c  -Wno-unused-result -Wsign-compare -Wunreachable-code -fno-common -dynamic -DNDEBUG -g -fwrapv -O3 -Wall -arch x86_64 -arch i386 -isysroot /Library/Developer/CommandLineTools/SDKs/MacOSX10.13.sdk -pipe -Os -isysroot/Library/Developer/CommandLineTools/SDKs/MacOSX10.13.sdk -arch x86_64 -arch i386   -flto -std=c99 -Wextra -Wno-unused-result -Wno-unused-parameter -Wno-missing-field-initializers -Wstrict-prototypes -Werror=implicit-function-declaration -fvisibility=hidden -fprofile-instr-generate -I./Include/internal  -I. -I./Include -isysroot /Library/Developer/CommandLineTools/SDKs/MacOSX10.13.sdk -I/opt/local/include -isysroot/Library/Developer/CommandLineTools/SDKs/MacOSX10.13.sdk   -DPy_BUILD_CORE -o Modules/_math.o Modules/_math.c
1331:info:build /usr/bin/install -c -m 644 ./Tools/gdb/libpython.py python.exe-gdb.py
1332:info:build /usr/bin/clang -c -Wno-unused-result -Wsign-compare -Wunreachable-code -fno-common -dynamic -DNDEBUG -g -fwrapv -O3 -Wall -arch x86_64 -arch i386 -isysroot /Library/Developer/CommandLineTools/SDKs/MacOSX10.13.sdk -pipe -Os -isysroot/Library/Developer/CommandLineTools/SDKs/MacOSX10.13.sdk -arch x86_64 -arch i386   -flto -std=c99 -Wextra -Wno-unused-result -Wno-unused-parameter -Wno-missing-field-initializers -Wstrict-prototypes -Werror=implicit-function-declaration -fvisibility=hidden -fprofile-instr-generate -I./Include/internal  -I. -I./Include -isysroot /Library/Developer/CommandLineTools/SDKs/MacOSX10.13.sdk -I/opt/local/include -isysroot/Library/Developer/CommandLineTools/SDKs/MacOSX10.13.sdk   -DPy_BUILD_CORE -o Programs/_testembed.o ./Programs/_testembed.c
1333:info:build sed -e "s,@EXENAME@,/opt/local/Library/Frameworks/Python.framework/Versions/3.10/bin/python3.10," < ./Misc/python-config.in >python-config.py
1334:info:build LC_ALL=C sed -e 's,\$(\([A-Za-z0-9_]*\)),\$\{\1\},g' < Misc/python-config.sh >python-config
1335:info:build /usr/bin/clang -c -Wno-unused-result -Wsign-compare -Wunreachable-code -fno-common -dynamic -DNDEBUG -g -fwrapv -O3 -Wall -arch x86_64 -arch i386 -isysroot /Library/Developer/CommandLineTools/SDKs/MacOSX10.13.sdk -pipe -Os -isysroot/Library/Developer/CommandLineTools/SDKs/MacOSX10.13.sdk -arch x86_64 -arch i386   -flto -std=c99 -Wextra -Wno-unused-result -Wno-unused-parameter -Wno-missing-field-initializers -Wstrict-prototypes -Werror=implicit-function-declaration -fvisibility=hidden -fprofile-instr-generate -I./Include/internal  -I. -I./Include -isysroot /Library/Developer/CommandLineTools/SDKs/MacOSX10.13.sdk -I/opt/local/include -isysroot/Library/Developer/CommandLineTools/SDKs/MacOSX10.13.sdk   -DPy_BUILD_CORE \
1336:info:build           -DGITVERSION="\"`LC_ALL=C `\"" \
1337:info:build           -DGITTAG="\"`LC_ALL=C `\"" \
1338:info:build           -DGITBRANCH="\"`LC_ALL=C `\"" \
1339:info:build           -o Modules/getbuildinfo.o ./Modules/getbuildinfo.c
1340:info:build rm -f libpython3.10.a
1341:info:build /usr/bin/xcrun ar rcs libpython3.10.a Modules/getbuildinfo.o Parser/token.o  Parser/pegen.o Parser/parser.o Parser/string_parser.o Parser/peg_api.o Parser/myreadline.o Parser/tokenizer.o Objects/abstract.o Objects/accu.o Objects/boolobject.o Objects/bytes_methods.o Objects/bytearrayobject.o Objects/bytesobject.o Objects/call.o Objects/capsule.o Objects/cellobject.o Objects/classobject.o Objects/codeobject.o Objects/complexobject.o Objects/descrobject.o Objects/enumobject.o Objects/exceptions.o Objects/genericaliasobject.o Objects/genobject.o Objects/fileobject.o Objects/floatobject.o Objects/frameobject.o Objects/funcobject.o Objects/interpreteridobject.o Objects/iterobject.o Objects/listobject.o Objects/longobject.o Objects/dictobject.o Objects/odictobject.o Objects/memoryobject.o Objects/methodobject.o Objects/moduleobject.o Objects/namespaceobject.o Objects/object.o Objects/obmalloc.o Objects/picklebufobject.o Objects/rangeobject.o Objects/setobject.o Objects/sliceobject.o Objects/structseq.o Objects/tupleobject.o Objects/typeobject.o Objects/unicodeobject.o Objects/unicodectype.o Objects/unionobject.o Objects/weakrefobject.o Python/_warnings.o Python/Python-ast.o Python/asdl.o Python/ast.o Python/ast_opt.o Python/ast_unparse.o Python/bltinmodule.o Python/ceval.o Python/codecs.o Python/compile.o Python/context.o Python/dynamic_annotations.o Python/errors.o Python/frozenmain.o Python/future.o Python/getargs.o Python/getcompiler.o Python/getcopyright.o Python/getplatform.o Python/getversion.o Python/hamt.o Python/hashtable.o Python/import.o Python/importdl.o Python/initconfig.o Python/marshal.o Python/modsupport.o Python/mysnprintf.o Python/mystrtoul.o Python/pathconfig.o Python/preconfig.o Python/pyarena.o Python/pyctype.o Python/pyfpe.o Python/pyhash.o Python/pylifecycle.o Python/pymath.o Python/pystate.o Python/pythonrun.o Python/pytime.o Python/bootstrap_hash.o Python/structmember.o Python/symtable.o Python/sysmodule.o Python/thread.o Python/traceback.o Python/getopt.o Python/pystrcmp.o Python/pystrtod.o Python/pystrhex.o Python/dtoa.o Python/formatter_unicode.o Python/fileutils.o Python/suggestions.o Python/dynload_shlib.o    Modules/config.o Modules/getpath.o Modules/main.o Modules/gcmodule.o Modules/posixmodule.o  Modules/errnomodule.o  Modules/pwdmodule.o  Modules/_sre.o  Modules/_codecsmodule.o  Modules/_weakref.o  Modules/_functoolsmodule.o  Modules/_operator.o  Modules/_collectionsmodule.o  Modules/_abc.o  Modules/itertoolsmodule.o  Modules/atexitmodule.o  Modules/signalmodule.o  Modules/_stat.o  Modules/timemodule.o  Modules/_threadmodule.o  Modules/_localemodule.o  Modules/_iomodule.o Modules/iobase.o Modules/fileio.o Modules/bytesio.o Modules/bufferedio.o Modules/textio.o Modules/stringio.o  Modules/faulthandler.o  Modules/_tracemalloc.o  Modules/symtablemodule.o  Modules/xxsubtype.o Python/frozen.o
1342:info:build warning: /Library/Developer/CommandLineTools/usr/bin/ranlib: archive library: libpython3.10.a will be fat and ar(1) will not be able to operate on it
1343:info:build /usr/bin/install -c -d -m 755 Python.framework/Versions/3.10
1344:info:build /usr/bin/clang -o Python.framework/Versions/3.10/Python -arch x86_64 -arch i386 -isysroot /Library/Developer/CommandLineTools/SDKs/MacOSX10.13.sdk -L/opt/local/lib -Wl,-headerpad_max_install_names -Wl,-syslibroot,/Library/Developer/CommandLineTools/SDKs/MacOSX10.13.sdk -arch x86_64 -arch i386  -flto -Wl,-export_dynamic -g -fprofile-instr-generate -dynamiclib \
1345:info:build             -all_load libpython3.10.a -Wl,-single_module \
1346:info:build             -install_name /opt/local/Library/Frameworks/Python.framework/Versions/3.10/Python \
1347:info:build             -compatibility_version 3.10 \
1348:info:build             -current_version 3.10 \
1349:info:build             -framework CoreFoundation -lintl -ldl   -framework CoreFoundation;
1350:info:build ld: warning: The i386 architecture is deprecated for macOS (remove from the Xcode build setting: ARCHS)
1351:info:build ld: warning: ignoring file /Library/Developer/CommandLineTools/usr/lib/clang/11.0.0/lib/darwin/libclang_rt.profile_osx.a, missing required architecture i386 in file /Library/Developer/CommandLineTools/usr/lib/clang/11.0.0/lib/darwin/libclang_rt.profile_osx.a (2 slices)
1352:info:build undef: ___llvm_profile_runtime
1353:info:build Undefined symbols for architecture i386:
1354:info:build   "___llvm_profile_runtime", referenced from:
1355:info:build       ___llvm_profile_runtime_user in lto.o
1356:info:build      (maybe you meant: ___llvm_profile_runtime_user)
1357:info:build ld: symbol(s) not found for architecture i386
1358:info:build clang: error: linker command failed with exit code 1 (use -v to see invocation)
1359:info:build make[3]: *** [Python.framework/Versions/3.10/Python] Error 1
1360:info:build make[3]: Leaving directory `/opt/local/var/macports/build/_opt_local_var_macports_sources_rsync.macports.org_macports_release_tarballs_ports_lang_python310/python310/work/Python-3.10.8'
1361:info:build make[2]: *** [build_all_generate_profile] Error 2
1362:info:build make[2]: Leaving directory `/opt/local/var/macports/build/_opt_local_var_macports_sources_rsync.macports.org_macports_release_tarballs_ports_lang_python310/python310/work/Python-3.10.8'
1363:info:build make[1]: *** [profile-gen-stamp] Error 2
1364:info:build make[1]: Leaving directory `/opt/local/var/macports/build/_opt_local_var_macports_sources_rsync.macports.org_macports_release_tarballs_ports_lang_python310/python310/work/Python-3.10.8'
1365:info:build make: *** [profile-run-stamp] Error 2
1366:info:build make: Leaving directory `/opt/local/var/macports/build/_opt_local_var_macports_sources_rsync.macports.org_macports_release_tarballs_ports_lang_python310/python310/work/Python-3.10.8'
1367:info:build Command failed:  cd "/opt/local/var/macports/build/_opt_local_var_macports_sources_rsync.macports.org_macports_release_tarballs_ports_lang_python310/python310/work/Python-3.10.8" && /usr/bin/make -j4 -w all
1368:info:build Exit code: 2
1369:error:build Failed to build python310: command execution failed
1370:debug:build Error code: CHILDSTATUS 85846 2
1371:debug:build Backtrace: command execution failed
1372:debug:build     while executing
1373:debug:build "system {*}$notty {*}$callback {*}$nice $fullcmdstring"
1374:debug:build     invoked from within
1375:debug:build "command_exec -callback portprogress::target_progress_callback build"
1376:debug:build     (procedure "portbuild::build_main" line 8)
1377:debug:build     invoked from within
1378:debug:build "$procedure $targetname"
1379:error:build See /opt/local/var/macports/logs/_opt_local_var_macports_sources_rsync.macports.org_macports_release_tarballs_ports_lang_python310/python310/main.log for details.