Ticket #57184: main-2.log

File main-2.log, 212.4 KB (added by clegra, 2 years ago)

logfile after trying to install texlive-bin-extra (28-09-2018, 0945 MEST) /opt/local/var/macports/logs/_opt_local_var_macports_sources_rsync.macports.org_release_tarballs_ports_graphics_dvisvgm/dvisvgm/main.log

Line 
1version:1
2:debug:sysinfo macOS 10.13 (darwin/17.7.0) arch i386
3:debug:sysinfo MacPorts 2.5.3
4:debug:sysinfo Xcode 10.0
5:debug:sysinfo SDK 10.13
6:debug:sysinfo MACOSX_DEPLOYMENT_TARGET: 10.13
7:msg:clean --->  Computing dependencies for dvisvgm:info:clean .:debug:clean dvisvgm has no conflicts
8:debug:clean Searching for dependency: pkgconfig
9:debug:clean Found Dependency: receipt exists for pkgconfig
10:debug:clean Searching for dependency: freetype
11:debug:clean Found Dependency: receipt exists for freetype
12:debug:clean Searching for dependency: ghostscript
13:debug:clean Found Dependency: receipt exists for ghostscript
14:debug:clean Searching for dependency: potrace
15:debug:clean Found Dependency: receipt exists for potrace
16:debug:clean Searching for dependency: texlive-bin
17:debug:clean Found Dependency: receipt exists for texlive-bin
18:debug:clean Searching for dependency: zlib
19:debug:clean Found Dependency: receipt exists for zlib
20:debug:main Executing org.macports.main (dvisvgm)
21:debug:main dropping privileges: euid changed to 502, egid changed to 501.
22:debug:archivefetch archivefetch phase started at Mon Sep 24 11:58:55 CEST 2018
23:msg:archivefetch --->  Fetching archive for dvisvgm
24:debug:archivefetch Executing org.macports.archivefetch (dvisvgm)
25:debug:archivefetch euid/egid changed to: 0/0
26:debug:archivefetch chowned /opt/local/var/macports/incoming to macports
27:debug:archivefetch euid/egid changed to: 502/501
28:info:archivefetch --->  dvisvgm-2.3.4_3.darwin_17.x86_64.tbz2 doesn't seem to exist in /opt/local/var/macports/incoming/verified
29:msg:archivefetch --->  Attempting to fetch dvisvgm-2.3.4_3.darwin_17.x86_64.tbz2 from http://lil.fr.packages.macports.org/dvisvgm
30:debug:archivefetch Fetching archive failed: The requested URL returned error: 404 Not Found
31:msg:archivefetch --->  Attempting to fetch dvisvgm-2.3.4_3.darwin_17.x86_64.tbz2 from https://packages.macports.org/dvisvgm
32:debug:archivefetch Fetching archive failed: The requested URL returned error: 404 Not Found
33:msg:archivefetch --->  Attempting to fetch dvisvgm-2.3.4_3.darwin_17.x86_64.tbz2 from http://nue.de.packages.macports.org/dvisvgm
34:debug:archivefetch Fetching archive failed: The requested URL returned error: 404 Not Found
35:debug:archivefetch Privilege de-escalation not attempted as not running as root.
36:debug:fetch fetch phase started at Mon Sep 24 11:58:55 CEST 2018
37:notice:fetch --->  Fetching distfiles for dvisvgm
38:debug:fetch elevating privileges for fetch: euid changed to 0, egid changed to 0.
39:debug:fetch dropping privileges: euid changed to 502, egid changed to 501.
40:debug:fetch Executing org.macports.fetch (dvisvgm)
41:info:fetch --->  dvisvgm-2.3.4.tar.gz does not exist in /opt/local/var/macports/distfiles/dvisvgm
42:notice:fetch --->  Attempting to fetch dvisvgm-2.3.4.tar.gz from http://lil.fr.distfiles.macports.org/dvisvgm
43:debug:fetch Privilege de-escalation not attempted as not running as root.
44:debug:checksum checksum phase started at Mon Sep 24 11:58:57 CEST 2018
45:notice:checksum --->  Verifying checksums for dvisvgm
46:debug:checksum Executing org.macports.checksum (dvisvgm)
47:info:checksum --->  Checksumming dvisvgm-2.3.4.tar.gz
48:debug:checksum Calculated (rmd160) is a6b6bae339fb915b2c5f585b4f176a93fd901fc3
49:debug:checksum Correct (rmd160) checksum for dvisvgm-2.3.4.tar.gz
50:debug:checksum Calculated (sha256) is 5399f9ac2b254bc8a5c4862bc2126f2e8c6caec243c3205c0223564371100129
51:debug:checksum Correct (sha256) checksum for dvisvgm-2.3.4.tar.gz
52:debug:checksum Privilege de-escalation not attempted as not running as root.
53:debug:extract extract phase started at Mon Sep 24 11:58:57 CEST 2018
54:notice:extract --->  Extracting dvisvgm
55:debug:extract Executing org.macports.extract (dvisvgm)
56:info:extract --->  Extracting dvisvgm-2.3.4.tar.gz
57:debug:extract setting option extract.args to '/opt/local/var/macports/distfiles/dvisvgm/dvisvgm-2.3.4.tar.gz'
58:debug:extract Environment:
59:debug:extract CC_PRINT_OPTIONS='YES'
60:debug:extract CC_PRINT_OPTIONS_FILE='/opt/local/var/macports/build/_opt_local_var_macports_sources_rsync.macports.org_release_tarballs_ports_graphics_dvisvgm/dvisvgm/work/.CC_PRINT_OPTIONS'
61:debug:extract CPATH='/opt/local/include'
62:debug:extract LIBRARY_PATH='/opt/local/lib'
63:debug:extract MACOSX_DEPLOYMENT_TARGET='10.13'
64:info:extract Executing:  cd "/opt/local/var/macports/build/_opt_local_var_macports_sources_rsync.macports.org_release_tarballs_ports_graphics_dvisvgm/dvisvgm/work" && /usr/bin/gzip -dc '/opt/local/var/macports/distfiles/dvisvgm/dvisvgm-2.3.4.tar.gz' | /usr/bin/tar -xf -
65:debug:extract system:  cd "/opt/local/var/macports/build/_opt_local_var_macports_sources_rsync.macports.org_release_tarballs_ports_graphics_dvisvgm/dvisvgm/work" && /usr/bin/gzip -dc '/opt/local/var/macports/distfiles/dvisvgm/dvisvgm-2.3.4.tar.gz' | /usr/bin/tar -xf -
66:debug:extract euid/egid changed to: 0/0
67:debug:extract chowned /opt/local/var/macports/build/_opt_local_var_macports_sources_rsync.macports.org_release_tarballs_ports_graphics_dvisvgm/dvisvgm/work to macports
68:debug:extract euid/egid changed to: 502/501
69:debug:extract Executing proc-post-org.macports.extract-extract-0
70:debug:extract Privilege de-escalation not attempted as not running as root.
71:debug:patch patch phase started at Mon Sep 24 11:58:58 CEST 2018
72:debug:patch Executing org.macports.patch (dvisvgm)
73:debug:patch Privilege de-escalation not attempted as not running as root.
74:debug:configure configure phase started at Mon Sep 24 11:58:58 CEST 2018
75:notice:configure --->  Configuring dvisvgm
76:debug:configure Preferred compilers: clang macports-clang-5.0 macports-clang-4.0
77:debug:configure Using compiler 'Xcode Clang'
78:debug:configure Executing org.macports.configure (dvisvgm)
79:debug:configure Environment:
80:debug:configure CC='/usr/bin/clang'
81:debug:configure CC_PRINT_OPTIONS='YES'
82:debug:configure CC_PRINT_OPTIONS_FILE='/opt/local/var/macports/build/_opt_local_var_macports_sources_rsync.macports.org_release_tarballs_ports_graphics_dvisvgm/dvisvgm/work/.CC_PRINT_OPTIONS'
83:debug:configure CFLAGS='-pipe -Os -arch x86_64'
84:debug:configure CPATH='/opt/local/include'
85:debug:configure CPPFLAGS='-I/opt/local/include'
86:debug:configure CXX='/usr/bin/clang++'
87:debug:configure CXXFLAGS='-pipe -Os -stdlib=libc++ -arch x86_64'
88:debug:configure F77FLAGS='-m64'
89:debug:configure F90FLAGS='-pipe -Os -m64'
90:debug:configure FCFLAGS='-pipe -Os -m64'
91:debug:configure FFLAGS='-pipe -Os'
92:debug:configure INSTALL='/usr/bin/install -c'
93:debug:configure LDFLAGS='-L/opt/local/lib -Wl,-headerpad_max_install_names -arch x86_64'
94:debug:configure LIBRARY_PATH='/opt/local/lib'
95:debug:configure MACOSX_DEPLOYMENT_TARGET='10.13'
96:debug:configure OBJC='/usr/bin/clang'
97:debug:configure OBJCFLAGS='-pipe -Os -arch x86_64'
98:debug:configure OBJCXX='/usr/bin/clang++'
99:debug:configure OBJCXXFLAGS='-pipe -Os -stdlib=libc++ -arch x86_64'
100:info:configure Executing:  cd "/opt/local/var/macports/build/_opt_local_var_macports_sources_rsync.macports.org_release_tarballs_ports_graphics_dvisvgm/dvisvgm/work/dvisvgm-2.3.4" && ./configure --prefix=/opt/local
101:debug:configure system:  cd "/opt/local/var/macports/build/_opt_local_var_macports_sources_rsync.macports.org_release_tarballs_ports_graphics_dvisvgm/dvisvgm/work/dvisvgm-2.3.4" && ./configure --prefix=/opt/local
102:info:configure checking build system type... x86_64-apple-darwin17.7.0
103:info:configure checking host system type... x86_64-apple-darwin17.7.0
104:info:configure checking target system type... x86_64-apple-darwin17.7.0
105:info:configure checking for a BSD-compatible install... /usr/bin/install -c
106:info:configure checking whether build environment is sane... yes
107:info:configure checking for a thread-safe mkdir -p... /opt/local/bin/gmkdir -p
108:info:configure checking for gawk... gawk
109:info:configure checking whether make sets $(MAKE)... yes
110:info:configure checking whether make supports nested variables... yes
111:info:configure checking for gcc... /usr/bin/clang
112:info:configure checking whether the C compiler works... yes
113:info:configure checking for C compiler default output file name... a.out
114:info:configure checking for suffix of executables...
115:info:configure checking whether we are cross compiling... no
116:info:configure checking for suffix of object files... o
117:info:configure checking whether we are using the GNU C compiler... yes
118:info:configure checking whether /usr/bin/clang accepts -g... yes
119:info:configure checking for /usr/bin/clang option to accept ISO C89... none needed
120:info:configure checking whether /usr/bin/clang understands -c and -o together... yes
121:info:configure checking for style of include used by make... GNU
122:info:configure checking dependency style of /usr/bin/clang... gcc3
123:info:configure checking for /usr/bin/clang option to accept ISO C99... none needed
124:info:configure checking whether we are using the GNU C++ compiler... yes
125:info:configure checking whether /usr/bin/clang++ accepts -g... yes
126:info:configure checking dependency style of /usr/bin/clang++... gcc3
127:info:configure checking whether /usr/bin/clang++ supports C++11 features by default... no
128:info:configure checking whether /usr/bin/clang++ supports C++11 features with -std=gnu++11... yes
129:info:configure checking for ar... ar
130:info:configure checking the archiver (ar) interface... ar
131:info:configure checking how to print strings... printf
132:info:configure checking for a sed that does not truncate output... /opt/local/bin/gsed
133:info:configure checking for grep that handles long lines and -e... /opt/local/bin/ggrep
134:info:configure checking for egrep... /opt/local/bin/ggrep -E
135:info:configure checking for fgrep... /opt/local/bin/ggrep -F
136:info:configure checking for ld used by /usr/bin/clang... /Applications/Xcode.app/Contents/Developer/Toolchains/XcodeDefault.xctoolchain/usr/bin/ld
137:info:configure checking if the linker (/Applications/Xcode.app/Contents/Developer/Toolchains/XcodeDefault.xctoolchain/usr/bin/ld) is GNU ld... no
138:info:configure checking for BSD- or MS-compatible name lister (nm)... /opt/local/bin/nm -B
139:info:configure checking the name lister (/opt/local/bin/nm -B) interface... BSD nm
140:info:configure checking whether ln -s works... yes
141:info:configure checking the maximum length of command line arguments... 196608
142:info:configure checking how to convert x86_64-apple-darwin17.7.0 file names to x86_64-apple-darwin17.7.0 format... func_convert_file_noop
143:info:configure checking how to convert x86_64-apple-darwin17.7.0 file names to toolchain format... func_convert_file_noop
144:info:configure checking for /Applications/Xcode.app/Contents/Developer/Toolchains/XcodeDefault.xctoolchain/usr/bin/ld option to reload object files... -r
145:info:configure checking for objdump... objdump
146:info:configure checking how to recognize dependent libraries... pass_all
147:info:configure checking for dlltool... no
148:info:configure checking how to associate runtime and link libraries... printf %s\n
149:info:configure checking for archiver @FILE support... no
150:info:configure checking for strip... strip
151:info:configure checking for ranlib... ranlib
152:info:configure checking command to parse /opt/local/bin/nm -B output from /usr/bin/clang object... ok
153:info:configure checking for sysroot... no
154:info:configure checking for a working dd... /bin/dd
155:info:configure checking how to truncate binary pipes... /bin/dd bs=4096 count=1
156:info:configure checking for mt... no
157:info:configure checking if : is a manifest tool... no
158:info:configure checking for dsymutil... dsymutil
159:info:configure checking for nmedit... nmedit
160:info:configure checking for lipo... lipo
161:info:configure checking for otool... otool
162:info:configure checking for otool64... no
163:info:configure checking for -single_module linker flag... yes
164:info:configure checking for -exported_symbols_list linker flag... yes
165:info:configure checking for -force_load linker flag... yes
166:info:configure checking how to run the C preprocessor... /usr/bin/clang -E
167:info:configure checking for ANSI C header files... yes
168:info:configure checking for sys/types.h... yes
169:info:configure checking for sys/stat.h... yes
170:info:configure checking for stdlib.h... yes
171:info:configure checking for string.h... yes
172:info:configure checking for memory.h... yes
173:info:configure checking for strings.h... yes
174:info:configure checking for inttypes.h... yes
175:info:configure checking for stdint.h... yes
176:info:configure checking for unistd.h... yes
177:info:configure checking for dlfcn.h... yes
178:info:configure checking for objdir... .libs
179:info:configure checking if /usr/bin/clang supports -fno-rtti -fno-exceptions... yes
180:info:configure checking for /usr/bin/clang option to produce PIC... -fno-common -DPIC
181:info:configure checking if /usr/bin/clang PIC flag -fno-common -DPIC works... yes
182:info:configure checking if /usr/bin/clang static flag -static works... no
183:info:configure checking if /usr/bin/clang supports -c -o file.o... yes
184:info:configure checking if /usr/bin/clang supports -c -o file.o... (cached) yes
185:info:configure checking whether the /usr/bin/clang linker (/Applications/Xcode.app/Contents/Developer/Toolchains/XcodeDefault.xctoolchain/usr/bin/ld) supports shared libraries... yes
186:info:configure checking dynamic linker characteristics... darwin17.7.0 dyld
187:info:configure checking how to hardcode library paths into programs... immediate
188:info:configure checking whether stripping libraries is possible... yes
189:info:configure checking if libtool supports shared libraries... yes
190:info:configure checking whether to build shared libraries... yes
191:info:configure checking whether to build static libraries... yes
192:info:configure checking how to run the C++ preprocessor... /usr/bin/clang++ -std=gnu++11 -E
193:info:configure checking for ld used by /usr/bin/clang++ -std=gnu++11... /Applications/Xcode.app/Contents/Developer/Toolchains/XcodeDefault.xctoolchain/usr/bin/ld
194:info:configure checking if the linker (/Applications/Xcode.app/Contents/Developer/Toolchains/XcodeDefault.xctoolchain/usr/bin/ld) is GNU ld... no
195:info:configure checking whether the /usr/bin/clang++ -std=gnu++11 linker (/Applications/Xcode.app/Contents/Developer/Toolchains/XcodeDefault.xctoolchain/usr/bin/ld) supports shared libraries... yes
196:info:configure checking for /usr/bin/clang++ -std=gnu++11 option to produce PIC... -fno-common -DPIC
197:info:configure checking if /usr/bin/clang++ -std=gnu++11 PIC flag -fno-common -DPIC works... yes
198:info:configure checking if /usr/bin/clang++ -std=gnu++11 static flag -static works... no
199:info:configure checking if /usr/bin/clang++ -std=gnu++11 supports -c -o file.o... yes
200:info:configure checking if /usr/bin/clang++ -std=gnu++11 supports -c -o file.o... (cached) yes
201:info:configure checking whether the /usr/bin/clang++ -std=gnu++11 linker (/Applications/Xcode.app/Contents/Developer/Toolchains/XcodeDefault.xctoolchain/usr/bin/ld) supports shared libraries... yes
202:info:configure checking dynamic linker characteristics... darwin17.7.0 dyld
203:info:configure checking how to hardcode library paths into programs... immediate
204:info:configure checking for ranlib... (cached) ranlib
205:info:configure checking sys/time.h usability... yes
206:info:configure checking sys/time.h presence... yes
207:info:configure checking for sys/time.h... yes
208:info:configure checking sys/timeb.h usability... yes
209:info:configure checking sys/timeb.h presence... yes
210:info:configure checking for sys/timeb.h... yes
211:info:configure checking xlocale.h usability... yes
212:info:configure checking xlocale.h presence... yes
213:info:configure checking for xlocale.h... yes
214:info:configure checking whether termios.h defines TIOCGWINSZ... yes
215:info:configure checking kpathsea/kpathsea.h usability... yes
216:info:configure checking kpathsea/kpathsea.h presence... yes
217:info:configure checking for kpathsea/kpathsea.h... yes
218:info:configure checking for kpse_find_file in -lkpathsea... yes
219:info:configure checking kpathsea version... "6.3.0"
220:info:configure checking potracelib.h usability... yes
221:info:configure checking potracelib.h presence... yes
222:info:configure checking for potracelib.h... yes
223:info:configure checking for sqrt in -lm... yes
224:info:configure checking for potrace_trace in -lpotrace... yes
225:info:configure checking ghostscript/iapi.h usability... yes
226:info:configure checking ghostscript/iapi.h presence... yes
227:info:configure checking for ghostscript/iapi.h... yes
228:info:configure checking for gsapi_revision in -lgs... yes
229:info:configure checking for pkg-config... /opt/local/bin/pkg-config
230:info:configure checking pkg-config is at least version 0.9.0... yes
231:info:configure checking for FREETYPE... yes
232:info:configure checking for gzopen in -lz... yes
233:info:configure checking for dirent.h that defines DIR... yes
234:info:configure checking for library containing opendir... none required
235:info:configure checking for ANSI C header files... (cached) yes
236:info:configure checking libintl.h usability... yes
237:info:configure checking libintl.h presence... yes
238:info:configure checking for libintl.h... yes
239:info:configure checking for stdlib.h... (cached) yes
240:info:configure checking for string.h... (cached) yes
241:info:configure checking for strings.h... (cached) yes
242:info:configure checking for unistd.h... (cached) yes
243:info:configure checking for stdbool.h that conforms to C99... yes
244:info:configure checking for _Bool... yes
245:info:configure checking for size_t... yes
246:info:configure checking whether struct tm is in sys/time.h or time.h... time.h
247:info:configure checking whether lstat correctly handles trailing slash... no
248:info:configure checking whether stat accepts an empty string... no
249:info:configure checking for ftime... yes
250:info:configure checking for gettimeofday... yes
251:info:configure checking for sigaction... yes
252:info:configure checking for uselocale... yes
253:info:configure checking if the kpathsea headers are C++ safe... yes
254:info:configure checking whether to build with code coverage support... no
255:info:configure checking that generated files are newer than configure... done
256:info:configure configure: creating ./config.status
257:info:configure config.status: creating Makefile
258:info:configure config.status: creating libs/Makefile
259:info:configure config.status: creating libs/brotli/Makefile
260:info:configure config.status: creating libs/clipper/Makefile
261:info:configure config.status: creating libs/ff-woff/Makefile
262:info:configure config.status: creating libs/variant/Makefile
263:info:configure config.status: creating libs/woff2/Makefile
264:info:configure config.status: creating libs/xxHash/Makefile
265:info:configure config.status: creating src/Makefile
266:info:configure config.status: creating src/version.hpp
267:info:configure config.status: creating tests/Makefile
268:info:configure config.status: creating tests/data/Makefile
269:info:configure config.status: creating doc/dvisvgm.txt
270:info:configure config.status: creating doc/Makefile
271:info:configure config.status: creating config.h
272:info:configure config.status: executing depfiles commands
273:info:configure config.status: executing libtool commands
274:debug:configure Privilege de-escalation not attempted as not running as root.
275:debug:build build phase started at Mon Sep 24 11:59:11 CEST 2018
276:notice:build --->  Building dvisvgm
277:debug:build Executing org.macports.build (dvisvgm)
278:debug:build Environment:
279:debug:build CC_PRINT_OPTIONS='YES'
280:debug:build CC_PRINT_OPTIONS_FILE='/opt/local/var/macports/build/_opt_local_var_macports_sources_rsync.macports.org_release_tarballs_ports_graphics_dvisvgm/dvisvgm/work/.CC_PRINT_OPTIONS'
281:debug:build CPATH='/opt/local/include'
282:debug:build LIBRARY_PATH='/opt/local/lib'
283:debug:build MACOSX_DEPLOYMENT_TARGET='10.13'
284:info:build Executing:  cd "/opt/local/var/macports/build/_opt_local_var_macports_sources_rsync.macports.org_release_tarballs_ports_graphics_dvisvgm/dvisvgm/work/dvisvgm-2.3.4" && /usr/bin/make -j8 -w all
285:debug:build system:  cd "/opt/local/var/macports/build/_opt_local_var_macports_sources_rsync.macports.org_release_tarballs_ports_graphics_dvisvgm/dvisvgm/work/dvisvgm-2.3.4" && /usr/bin/make -j8 -w all
286:info:build make: Entering directory `/opt/local/var/macports/build/_opt_local_var_macports_sources_rsync.macports.org_release_tarballs_ports_graphics_dvisvgm/dvisvgm/work/dvisvgm-2.3.4'
287:info:build /Applications/Xcode.app/Contents/Developer/usr/bin/make  all-recursive
288:info:build make[1]: Entering directory `/opt/local/var/macports/build/_opt_local_var_macports_sources_rsync.macports.org_release_tarballs_ports_graphics_dvisvgm/dvisvgm/work/dvisvgm-2.3.4'
289:info:build Making all in libs
290:info:build make[2]: Entering directory `/opt/local/var/macports/build/_opt_local_var_macports_sources_rsync.macports.org_release_tarballs_ports_graphics_dvisvgm/dvisvgm/work/dvisvgm-2.3.4/libs'
291:info:build Making all in clipper
292:info:build make[3]: Entering directory `/opt/local/var/macports/build/_opt_local_var_macports_sources_rsync.macports.org_release_tarballs_ports_graphics_dvisvgm/dvisvgm/work/dvisvgm-2.3.4/libs/clipper'
293:info:build depbase=`echo clipper.o | sed 's|[^/]*$|.deps/&|;s|\.o$||'`;\
294:info:build     /usr/bin/clang++ -std=gnu++11 -DHAVE_CONFIG_H -I. -I../..   -I/opt/local/include -Wall -pipe -Os -stdlib=libc++ -arch x86_64 -MT clipper.o -MD -MP -MF $depbase.Tpo -c -o clipper.o clipper.cpp &&\
295:info:build     mv -f $depbase.Tpo $depbase.Po
296:info:build rm -f libclipper.a
297:info:build ar cru libclipper.a clipper.o
298:info:build ranlib libclipper.a
299:info:build make[3]: Leaving directory `/opt/local/var/macports/build/_opt_local_var_macports_sources_rsync.macports.org_release_tarballs_ports_graphics_dvisvgm/dvisvgm/work/dvisvgm-2.3.4/libs/clipper'
300:info:build Making all in variant
301:info:build make[3]: Entering directory `/opt/local/var/macports/build/_opt_local_var_macports_sources_rsync.macports.org_release_tarballs_ports_graphics_dvisvgm/dvisvgm/work/dvisvgm-2.3.4/libs/variant'
302:info:build make[3]: Nothing to be done for `all'.
303:info:build make[3]: Leaving directory `/opt/local/var/macports/build/_opt_local_var_macports_sources_rsync.macports.org_release_tarballs_ports_graphics_dvisvgm/dvisvgm/work/dvisvgm-2.3.4/libs/variant'
304:info:build Making all in xxHash
305:info:build make[3]: Entering directory `/opt/local/var/macports/build/_opt_local_var_macports_sources_rsync.macports.org_release_tarballs_ports_graphics_dvisvgm/dvisvgm/work/dvisvgm-2.3.4/libs/xxHash'
306:info:build depbase=`echo xxhash.o | sed 's|[^/]*$|.deps/&|;s|\.o$||'`;\
307:info:build     /usr/bin/clang -DHAVE_CONFIG_H -I. -I../..   -I/opt/local/include  -pipe -Os -arch x86_64 -MT xxhash.o -MD -MP -MF $depbase.Tpo -c -o xxhash.o xxhash.c &&\
308:info:build     mv -f $depbase.Tpo $depbase.Po
309:info:build rm -f libxxhash.a
310:info:build ar cru libxxhash.a xxhash.o
311:info:build ranlib libxxhash.a
312:info:build make[3]: Leaving directory `/opt/local/var/macports/build/_opt_local_var_macports_sources_rsync.macports.org_release_tarballs_ports_graphics_dvisvgm/dvisvgm/work/dvisvgm-2.3.4/libs/xxHash'
313:info:build Making all in brotli
314:info:build make[3]: Entering directory `/opt/local/var/macports/build/_opt_local_var_macports_sources_rsync.macports.org_release_tarballs_ports_graphics_dvisvgm/dvisvgm/work/dvisvgm-2.3.4/libs/brotli'
315:info:build depbase=`echo common/dictionary.o | sed 's|[^/]*$|.deps/&|;s|\.o$||'`;\
316:info:build     /usr/bin/clang -DHAVE_CONFIG_H -I. -I../..   -I/opt/local/include -Wall -I./include -pipe -Os -arch x86_64 -MT common/dictionary.o -MD -MP -MF $depbase.Tpo -c -o common/dictionary.o common/dictionary.c &&\
317:info:build     mv -f $depbase.Tpo $depbase.Po
318:info:build depbase=`echo enc/backward_references.o | sed 's|[^/]*$|.deps/&|;s|\.o$||'`;\
319:info:build     /usr/bin/clang -DHAVE_CONFIG_H -I. -I../..   -I/opt/local/include -Wall -I./include -pipe -Os -arch x86_64 -MT enc/backward_references.o -MD -MP -MF $depbase.Tpo -c -o enc/backward_references.o enc/backward_references.c &&\
320:info:build     mv -f $depbase.Tpo $depbase.Po
321:info:build depbase=`echo enc/backward_references_hq.o | sed 's|[^/]*$|.deps/&|;s|\.o$||'`;\
322:info:build     /usr/bin/clang -DHAVE_CONFIG_H -I. -I../..   -I/opt/local/include -Wall -I./include -pipe -Os -arch x86_64 -MT enc/backward_references_hq.o -MD -MP -MF $depbase.Tpo -c -o enc/backward_references_hq.o enc/backward_references_hq.c &&\
323:info:build     mv -f $depbase.Tpo $depbase.Po
324:info:build depbase=`echo enc/bit_cost.o | sed 's|[^/]*$|.deps/&|;s|\.o$||'`;\
325:info:build     /usr/bin/clang -DHAVE_CONFIG_H -I. -I../..   -I/opt/local/include -Wall -I./include -pipe -Os -arch x86_64 -MT enc/bit_cost.o -MD -MP -MF $depbase.Tpo -c -o enc/bit_cost.o enc/bit_cost.c &&\
326:info:build     mv -f $depbase.Tpo $depbase.Po
327:info:build depbase=`echo enc/block_splitter.o | sed 's|[^/]*$|.deps/&|;s|\.o$||'`;\
328:info:build     /usr/bin/clang -DHAVE_CONFIG_H -I. -I../..   -I/opt/local/include -Wall -I./include -pipe -Os -arch x86_64 -MT enc/block_splitter.o -MD -MP -MF $depbase.Tpo -c -o enc/block_splitter.o enc/block_splitter.c &&\
329:info:build     mv -f $depbase.Tpo $depbase.Po
330:info:build depbase=`echo enc/brotli_bit_stream.o | sed 's|[^/]*$|.deps/&|;s|\.o$||'`;\
331:info:build     /usr/bin/clang -DHAVE_CONFIG_H -I. -I../..   -I/opt/local/include -Wall -I./include -pipe -Os -arch x86_64 -MT enc/brotli_bit_stream.o -MD -MP -MF $depbase.Tpo -c -o enc/brotli_bit_stream.o enc/brotli_bit_stream.c &&\
332:info:build     mv -f $depbase.Tpo $depbase.Po
333:info:build depbase=`echo enc/cluster.o | sed 's|[^/]*$|.deps/&|;s|\.o$||'`;\
334:info:build     /usr/bin/clang -DHAVE_CONFIG_H -I. -I../..   -I/opt/local/include -Wall -I./include -pipe -Os -arch x86_64 -MT enc/cluster.o -MD -MP -MF $depbase.Tpo -c -o enc/cluster.o enc/cluster.c &&\
335:info:build     mv -f $depbase.Tpo $depbase.Po
336:info:build depbase=`echo enc/compress_fragment.o | sed 's|[^/]*$|.deps/&|;s|\.o$||'`;\
337:info:build     /usr/bin/clang -DHAVE_CONFIG_H -I. -I../..   -I/opt/local/include -Wall -I./include -pipe -Os -arch x86_64 -MT enc/compress_fragment.o -MD -MP -MF $depbase.Tpo -c -o enc/compress_fragment.o enc/compress_fragment.c &&\
338:info:build     mv -f $depbase.Tpo $depbase.Po
339:info:build depbase=`echo enc/compress_fragment_two_pass.o | sed 's|[^/]*$|.deps/&|;s|\.o$||'`;\
340:info:build     /usr/bin/clang -DHAVE_CONFIG_H -I. -I../..   -I/opt/local/include -Wall -I./include -pipe -Os -arch x86_64 -MT enc/compress_fragment_two_pass.o -MD -MP -MF $depbase.Tpo -c -o enc/compress_fragment_two_pass.o enc/compress_fragment_two_pass.c &&\
341:info:build     mv -f $depbase.Tpo $depbase.Po
342:info:build depbase=`echo enc/dictionary_hash.o | sed 's|[^/]*$|.deps/&|;s|\.o$||'`;\
343:info:build     /usr/bin/clang -DHAVE_CONFIG_H -I. -I../..   -I/opt/local/include -Wall -I./include -pipe -Os -arch x86_64 -MT enc/dictionary_hash.o -MD -MP -MF $depbase.Tpo -c -o enc/dictionary_hash.o enc/dictionary_hash.c &&\
344:info:build     mv -f $depbase.Tpo $depbase.Po
345:info:build depbase=`echo enc/encode.o | sed 's|[^/]*$|.deps/&|;s|\.o$||'`;\
346:info:build     /usr/bin/clang -DHAVE_CONFIG_H -I. -I../..   -I/opt/local/include -Wall -I./include -pipe -Os -arch x86_64 -MT enc/encode.o -MD -MP -MF $depbase.Tpo -c -o enc/encode.o enc/encode.c &&\
347:info:build     mv -f $depbase.Tpo $depbase.Po
348:info:build depbase=`echo enc/encoder_dict.o | sed 's|[^/]*$|.deps/&|;s|\.o$||'`;\
349:info:build     /usr/bin/clang -DHAVE_CONFIG_H -I. -I../..   -I/opt/local/include -Wall -I./include -pipe -Os -arch x86_64 -MT enc/encoder_dict.o -MD -MP -MF $depbase.Tpo -c -o enc/encoder_dict.o enc/encoder_dict.c &&\
350:info:build     mv -f $depbase.Tpo $depbase.Po
351:info:build depbase=`echo enc/entropy_encode.o | sed 's|[^/]*$|.deps/&|;s|\.o$||'`;\
352:info:build     /usr/bin/clang -DHAVE_CONFIG_H -I. -I../..   -I/opt/local/include -Wall -I./include -pipe -Os -arch x86_64 -MT enc/entropy_encode.o -MD -MP -MF $depbase.Tpo -c -o enc/entropy_encode.o enc/entropy_encode.c &&\
353:info:build     mv -f $depbase.Tpo $depbase.Po
354:info:build depbase=`echo enc/histogram.o | sed 's|[^/]*$|.deps/&|;s|\.o$||'`;\
355:info:build     /usr/bin/clang -DHAVE_CONFIG_H -I. -I../..   -I/opt/local/include -Wall -I./include -pipe -Os -arch x86_64 -MT enc/histogram.o -MD -MP -MF $depbase.Tpo -c -o enc/histogram.o enc/histogram.c &&\
356:info:build     mv -f $depbase.Tpo $depbase.Po
357:info:build depbase=`echo enc/literal_cost.o | sed 's|[^/]*$|.deps/&|;s|\.o$||'`;\
358:info:build     /usr/bin/clang -DHAVE_CONFIG_H -I. -I../..   -I/opt/local/include -Wall -I./include -pipe -Os -arch x86_64 -MT enc/literal_cost.o -MD -MP -MF $depbase.Tpo -c -o enc/literal_cost.o enc/literal_cost.c &&\
359:info:build     mv -f $depbase.Tpo $depbase.Po
360:info:build depbase=`echo enc/memory.o | sed 's|[^/]*$|.deps/&|;s|\.o$||'`;\
361:info:build     /usr/bin/clang -DHAVE_CONFIG_H -I. -I../..   -I/opt/local/include -Wall -I./include -pipe -Os -arch x86_64 -MT enc/memory.o -MD -MP -MF $depbase.Tpo -c -o enc/memory.o enc/memory.c &&\
362:info:build     mv -f $depbase.Tpo $depbase.Po
363:info:build depbase=`echo enc/metablock.o | sed 's|[^/]*$|.deps/&|;s|\.o$||'`;\
364:info:build     /usr/bin/clang -DHAVE_CONFIG_H -I. -I../..   -I/opt/local/include -Wall -I./include -pipe -Os -arch x86_64 -MT enc/metablock.o -MD -MP -MF $depbase.Tpo -c -o enc/metablock.o enc/metablock.c &&\
365:info:build     mv -f $depbase.Tpo $depbase.Po
366:info:build depbase=`echo enc/static_dict.o | sed 's|[^/]*$|.deps/&|;s|\.o$||'`;\
367:info:build     /usr/bin/clang -DHAVE_CONFIG_H -I. -I../..   -I/opt/local/include -Wall -I./include -pipe -Os -arch x86_64 -MT enc/static_dict.o -MD -MP -MF $depbase.Tpo -c -o enc/static_dict.o enc/static_dict.c &&\
368:info:build     mv -f $depbase.Tpo $depbase.Po
369:info:build depbase=`echo enc/utf8_util.o | sed 's|[^/]*$|.deps/&|;s|\.o$||'`;\
370:info:build     /usr/bin/clang -DHAVE_CONFIG_H -I. -I../..   -I/opt/local/include -Wall -I./include -pipe -Os -arch x86_64 -MT enc/utf8_util.o -MD -MP -MF $depbase.Tpo -c -o enc/utf8_util.o enc/utf8_util.c &&\
371:info:build     mv -f $depbase.Tpo $depbase.Po
372:info:build rm -f libbrotli.a
373:info:build ar cru libbrotli.a common/dictionary.o enc/backward_references.o enc/backward_references_hq.o enc/bit_cost.o enc/block_splitter.o enc/brotli_bit_stream.o enc/cluster.o enc/compress_fragment.o enc/compress_fragment_two_pass.o enc/dictionary_hash.o enc/encode.o enc/encoder_dict.o enc/entropy_encode.o enc/histogram.o enc/literal_cost.o enc/memory.o enc/metablock.o enc/static_dict.o enc/utf8_util.o
374:info:build ranlib libbrotli.a
375:info:build make[3]: Leaving directory `/opt/local/var/macports/build/_opt_local_var_macports_sources_rsync.macports.org_release_tarballs_ports_graphics_dvisvgm/dvisvgm/work/dvisvgm-2.3.4/libs/brotli'
376:info:build Making all in ff-woff
377:info:build make[3]: Entering directory `/opt/local/var/macports/build/_opt_local_var_macports_sources_rsync.macports.org_release_tarballs_ports_graphics_dvisvgm/dvisvgm/work/dvisvgm-2.3.4/libs/ff-woff'
378:info:build depbase=`echo fontforge/alphabet.o | sed 's|[^/]*$|.deps/&|;s|\.o$||'`;\
379:info:build     /usr/bin/clang -DHAVE_CONFIG_H -I. -I../..   -I/opt/local/include -I./inc -I./fontforge -pipe -Os -arch x86_64 -MT fontforge/alphabet.o -MD -MP -MF $depbase.Tpo -c -o fontforge/alphabet.o fontforge/alphabet.c &&\
380:info:build     mv -f $depbase.Tpo $depbase.Po
381:info:build depbase=`echo fontforge/asmfpst.o | sed 's|[^/]*$|.deps/&|;s|\.o$||'`;\
382:info:build     /usr/bin/clang -DHAVE_CONFIG_H -I. -I../..   -I/opt/local/include -I./inc -I./fontforge -pipe -Os -arch x86_64 -MT fontforge/asmfpst.o -MD -MP -MF $depbase.Tpo -c -o fontforge/asmfpst.o fontforge/asmfpst.c &&\
383:info:build     mv -f $depbase.Tpo $depbase.Po
384:info:build depbase=`echo fontforge/autohint.o | sed 's|[^/]*$|.deps/&|;s|\.o$||'`;\
385:info:build     /usr/bin/clang -DHAVE_CONFIG_H -I. -I../..   -I/opt/local/include -I./inc -I./fontforge -pipe -Os -arch x86_64 -MT fontforge/autohint.o -MD -MP -MF $depbase.Tpo -c -o fontforge/autohint.o fontforge/autohint.c &&\
386:info:build     mv -f $depbase.Tpo $depbase.Po
387:info:build depbase=`echo fontforge/char.o | sed 's|[^/]*$|.deps/&|;s|\.o$||'`;\
388:info:build     /usr/bin/clang -DHAVE_CONFIG_H -I. -I../..   -I/opt/local/include -I./inc -I./fontforge -pipe -Os -arch x86_64 -MT fontforge/char.o -MD -MP -MF $depbase.Tpo -c -o fontforge/char.o fontforge/char.c &&\
389:info:build     mv -f $depbase.Tpo $depbase.Po
390:info:build depbase=`echo fontforge/cjk.o | sed 's|[^/]*$|.deps/&|;s|\.o$||'`;\
391:info:build     /usr/bin/clang -DHAVE_CONFIG_H -I. -I../..   -I/opt/local/include -I./inc -I./fontforge -pipe -Os -arch x86_64 -MT fontforge/cjk.o -MD -MP -MF $depbase.Tpo -c -o fontforge/cjk.o fontforge/cjk.c &&\
392:info:build     mv -f $depbase.Tpo $depbase.Po
393:info:build depbase=`echo fontforge/cvundoes.o | sed 's|[^/]*$|.deps/&|;s|\.o$||'`;\
394:info:build     /usr/bin/clang -DHAVE_CONFIG_H -I. -I../..   -I/opt/local/include -I./inc -I./fontforge -pipe -Os -arch x86_64 -MT fontforge/cvundoes.o -MD -MP -MF $depbase.Tpo -c -o fontforge/cvundoes.o fontforge/cvundoes.c &&\
395:info:build     mv -f $depbase.Tpo $depbase.Po
396:info:build depbase=`echo fontforge/dumppfa.o | sed 's|[^/]*$|.deps/&|;s|\.o$||'`;\
397:info:build     /usr/bin/clang -DHAVE_CONFIG_H -I. -I../..   -I/opt/local/include -I./inc -I./fontforge -pipe -Os -arch x86_64 -MT fontforge/dumppfa.o -MD -MP -MF $depbase.Tpo -c -o fontforge/dumppfa.o fontforge/dumppfa.c &&\
398:info:build     mv -f $depbase.Tpo $depbase.Po
399:info:build depbase=`echo fontforge/encoding.o | sed 's|[^/]*$|.deps/&|;s|\.o$||'`;\
400:info:build     /usr/bin/clang -DHAVE_CONFIG_H -I. -I../..   -I/opt/local/include -I./inc -I./fontforge -pipe -Os -arch x86_64 -MT fontforge/encoding.o -MD -MP -MF $depbase.Tpo -c -o fontforge/encoding.o fontforge/encoding.c &&\
401:info:build     mv -f $depbase.Tpo $depbase.Po
402:info:build depbase=`echo fontforge/fflocale.o | sed 's|[^/]*$|.deps/&|;s|\.o$||'`;\
403:info:build     /usr/bin/clang -DHAVE_CONFIG_H -I. -I../..   -I/opt/local/include -I./inc -I./fontforge -pipe -Os -arch x86_64 -MT fontforge/fflocale.o -MD -MP -MF $depbase.Tpo -c -o fontforge/fflocale.o fontforge/fflocale.c &&\
404:info:build     mv -f $depbase.Tpo $depbase.Po
405:info:build depbase=`echo fontforge/fvfonts.o | sed 's|[^/]*$|.deps/&|;s|\.o$||'`;\
406:info:build     /usr/bin/clang -DHAVE_CONFIG_H -I. -I../..   -I/opt/local/include -I./inc -I./fontforge -pipe -Os -arch x86_64 -MT fontforge/fvfonts.o -MD -MP -MF $depbase.Tpo -c -o fontforge/fvfonts.o fontforge/fvfonts.c &&\
407:info:build     mv -f $depbase.Tpo $depbase.Po
408:info:build depbase=`echo fontforge/gwwiconv.o | sed 's|[^/]*$|.deps/&|;s|\.o$||'`;\
409:info:build     /usr/bin/clang -DHAVE_CONFIG_H -I. -I../..   -I/opt/local/include -I./inc -I./fontforge -pipe -Os -arch x86_64 -MT fontforge/gwwiconv.o -MD -MP -MF $depbase.Tpo -c -o fontforge/gwwiconv.o fontforge/gwwiconv.c &&\
410:info:build     mv -f $depbase.Tpo $depbase.Po
411:info:build depbase=`echo fontforge/lookups.o | sed 's|[^/]*$|.deps/&|;s|\.o$||'`;\
412:info:build     /usr/bin/clang -DHAVE_CONFIG_H -I. -I../..   -I/opt/local/include -I./inc -I./fontforge -pipe -Os -arch x86_64 -MT fontforge/lookups.o -MD -MP -MF $depbase.Tpo -c -o fontforge/lookups.o fontforge/lookups.c &&\
413:info:build     mv -f $depbase.Tpo $depbase.Po
414:info:build depbase=`echo fontforge/macbinary.o | sed 's|[^/]*$|.deps/&|;s|\.o$||'`;\
415:info:build     /usr/bin/clang -DHAVE_CONFIG_H -I. -I../..   -I/opt/local/include -I./inc -I./fontforge -pipe -Os -arch x86_64 -MT fontforge/macbinary.o -MD -MP -MF $depbase.Tpo -c -o fontforge/macbinary.o fontforge/macbinary.c &&\
416:info:build     mv -f $depbase.Tpo $depbase.Po
417:info:build fontforge/gwwiconv.c:116:14: warning: implicit conversion from enumeration type 'enum extended_encoding' to different enumeration type 'enum encoding' [-Wenum-conversion]
418:info:build         { "EUC-CN", e_jisgbpk },
419:info:build         ~           ^~~~~~~~~
420:info:build depbase=`echo fontforge/macenc.o | sed 's|[^/]*$|.deps/&|;s|\.o$||'`;\
421:info:build     /usr/bin/clang -DHAVE_CONFIG_H -I. -I../..   -I/opt/local/include -I./inc -I./fontforge -pipe -Os -arch x86_64 -MT fontforge/macenc.o -MD -MP -MF $depbase.Tpo -c -o fontforge/macenc.o fontforge/macenc.c &&\
422:info:build     mv -f $depbase.Tpo $depbase.Po
423:info:build depbase=`echo fontforge/mathconstants.o | sed 's|[^/]*$|.deps/&|;s|\.o$||'`;\
424:info:build     /usr/bin/clang -DHAVE_CONFIG_H -I. -I../..   -I/opt/local/include -I./inc -I./fontforge -pipe -Os -arch x86_64 -MT fontforge/mathconstants.o -MD -MP -MF $depbase.Tpo -c -o fontforge/mathconstants.o fontforge/mathconstants.c &&\
425:info:build     mv -f $depbase.Tpo $depbase.Po
426:info:build depbase=`echo fontforge/memory.o | sed 's|[^/]*$|.deps/&|;s|\.o$||'`;\
427:info:build     /usr/bin/clang -DHAVE_CONFIG_H -I. -I../..   -I/opt/local/include -I./inc -I./fontforge -pipe -Os -arch x86_64 -MT fontforge/memory.o -MD -MP -MF $depbase.Tpo -c -o fontforge/memory.o fontforge/memory.c &&\
428:info:build     mv -f $depbase.Tpo $depbase.Po
429:info:build depbase=`echo fontforge/mm.o | sed 's|[^/]*$|.deps/&|;s|\.o$||'`;\
430:info:build     /usr/bin/clang -DHAVE_CONFIG_H -I. -I../..   -I/opt/local/include -I./inc -I./fontforge -pipe -Os -arch x86_64 -MT fontforge/mm.o -MD -MP -MF $depbase.Tpo -c -o fontforge/mm.o fontforge/mm.c &&\
431:info:build     mv -f $depbase.Tpo $depbase.Po
432:info:build 1 warning generated.
433:info:build depbase=`echo fontforge/namelist.o | sed 's|[^/]*$|.deps/&|;s|\.o$||'`;\
434:info:build     /usr/bin/clang -DHAVE_CONFIG_H -I. -I../..   -I/opt/local/include -I./inc -I./fontforge -pipe -Os -arch x86_64 -MT fontforge/namelist.o -MD -MP -MF $depbase.Tpo -c -o fontforge/namelist.o fontforge/namelist.c &&\
435:info:build     mv -f $depbase.Tpo $depbase.Po
436:info:build depbase=`echo fontforge/nouiutil.o | sed 's|[^/]*$|.deps/&|;s|\.o$||'`;\
437:info:build     /usr/bin/clang -DHAVE_CONFIG_H -I. -I../..   -I/opt/local/include -I./inc -I./fontforge -pipe -Os -arch x86_64 -MT fontforge/nouiutil.o -MD -MP -MF $depbase.Tpo -c -o fontforge/nouiutil.o fontforge/nouiutil.c &&\
438:info:build     mv -f $depbase.Tpo $depbase.Po
439:info:build depbase=`echo fontforge/nowakowskittfinstr.o | sed 's|[^/]*$|.deps/&|;s|\.o$||'`;\
440:info:build     /usr/bin/clang -DHAVE_CONFIG_H -I. -I../..   -I/opt/local/include -I./inc -I./fontforge -pipe -Os -arch x86_64 -MT fontforge/nowakowskittfinstr.o -MD -MP -MF $depbase.Tpo -c -o fontforge/nowakowskittfinstr.o fontforge/nowakowskittfinstr.c &&\
441:info:build     mv -f $depbase.Tpo $depbase.Po
442:info:build depbase=`echo fontforge/parsepfa.o | sed 's|[^/]*$|.deps/&|;s|\.o$||'`;\
443:info:build     /usr/bin/clang -DHAVE_CONFIG_H -I. -I../..   -I/opt/local/include -I./inc -I./fontforge -pipe -Os -arch x86_64 -MT fontforge/parsepfa.o -MD -MP -MF $depbase.Tpo -c -o fontforge/parsepfa.o fontforge/parsepfa.c &&\
444:info:build     mv -f $depbase.Tpo $depbase.Po
445:info:build depbase=`echo fontforge/parsettf.o | sed 's|[^/]*$|.deps/&|;s|\.o$||'`;\
446:info:build     /usr/bin/clang -DHAVE_CONFIG_H -I. -I../..   -I/opt/local/include -I./inc -I./fontforge -pipe -Os -arch x86_64 -MT fontforge/parsettf.o -MD -MP -MF $depbase.Tpo -c -o fontforge/parsettf.o fontforge/parsettf.c &&\
447:info:build     mv -f $depbase.Tpo $depbase.Po
448:info:build fontforge/nowakowskittfinstr.c:3664:14: warning: using floating point absolute value function 'fabs' when argument is of integer type [-Wabsolute-value]
449:info:build         if ( fabs(swidth1 - swidth2) >= SNAP_THRESHOLD )
450:info:build              ^
451:info:build fontforge/nowakowskittfinstr.c:3664:14: note: use function 'abs' instead
452:info:build         if ( fabs(swidth1 - swidth2) >= SNAP_THRESHOLD )
453:info:build              ^~~~
454:info:build              abs
455:info:build depbase=`echo fontforge/parsettfatt.o | sed 's|[^/]*$|.deps/&|;s|\.o$||'`;\
456:info:build     /usr/bin/clang -DHAVE_CONFIG_H -I. -I../..   -I/opt/local/include -I./inc -I./fontforge -pipe -Os -arch x86_64 -MT fontforge/parsettfatt.o -MD -MP -MF $depbase.Tpo -c -o fontforge/parsettfatt.o fontforge/parsettfatt.c &&\
457:info:build     mv -f $depbase.Tpo $depbase.Po
458:info:build fontforge/nowakowskittfinstr.c:4924:17: warning: using integer absolute value function 'abs' when argument is of floating point type [-Wabsolute-value]
459:info:build             if (abs(coord - edgelist[i].pos) <= ct->gic->fudge ||
460:info:build                 ^
461:info:build fontforge/nowakowskittfinstr.c:4924:17: note: use function 'fabs' instead
462:info:build             if (abs(coord - edgelist[i].pos) <= ct->gic->fudge ||
463:info:build                 ^~~
464:info:build                 fabs
465:info:build depbase=`echo fontforge/psread.o | sed 's|[^/]*$|.deps/&|;s|\.o$||'`;\
466:info:build     /usr/bin/clang -DHAVE_CONFIG_H -I. -I../..   -I/opt/local/include -I./inc -I./fontforge -pipe -Os -arch x86_64 -MT fontforge/psread.o -MD -MP -MF $depbase.Tpo -c -o fontforge/psread.o fontforge/psread.c &&\
467:info:build     mv -f $depbase.Tpo $depbase.Po
468:info:build depbase=`echo fontforge/pua.o | sed 's|[^/]*$|.deps/&|;s|\.o$||'`;\
469:info:build     /usr/bin/clang -DHAVE_CONFIG_H -I. -I../..   -I/opt/local/include -I./inc -I./fontforge -pipe -Os -arch x86_64 -MT fontforge/pua.o -MD -MP -MF $depbase.Tpo -c -o fontforge/pua.o fontforge/pua.c &&\
470:info:build     mv -f $depbase.Tpo $depbase.Po
471:info:build depbase=`echo fontforge/sfd.o | sed 's|[^/]*$|.deps/&|;s|\.o$||'`;\
472:info:build     /usr/bin/clang -DHAVE_CONFIG_H -I. -I../..   -I/opt/local/include -I./inc -I./fontforge -pipe -Os -arch x86_64 -MT fontforge/sfd.o -MD -MP -MF $depbase.Tpo -c -o fontforge/sfd.o fontforge/sfd.c &&\
473:info:build     mv -f $depbase.Tpo $depbase.Po
474:info:build depbase=`echo fontforge/sfd1.o | sed 's|[^/]*$|.deps/&|;s|\.o$||'`;\
475:info:build     /usr/bin/clang -DHAVE_CONFIG_H -I. -I../..   -I/opt/local/include -I./inc -I./fontforge -pipe -Os -arch x86_64 -MT fontforge/sfd1.o -MD -MP -MF $depbase.Tpo -c -o fontforge/sfd1.o fontforge/sfd1.c &&\
476:info:build     mv -f $depbase.Tpo $depbase.Po
477:info:build depbase=`echo fontforge/splinechar.o | sed 's|[^/]*$|.deps/&|;s|\.o$||'`;\
478:info:build     /usr/bin/clang -DHAVE_CONFIG_H -I. -I../..   -I/opt/local/include -I./inc -I./fontforge -pipe -Os -arch x86_64 -MT fontforge/splinechar.o -MD -MP -MF $depbase.Tpo -c -o fontforge/splinechar.o fontforge/splinechar.c &&\
479:info:build     mv -f $depbase.Tpo $depbase.Po
480:info:build depbase=`echo fontforge/splinefont.o | sed 's|[^/]*$|.deps/&|;s|\.o$||'`;\
481:info:build     /usr/bin/clang -DHAVE_CONFIG_H -I. -I../..   -I/opt/local/include -I./inc -I./fontforge -pipe -Os -arch x86_64 -MT fontforge/splinefont.o -MD -MP -MF $depbase.Tpo -c -o fontforge/splinefont.o fontforge/splinefont.c &&\
482:info:build     mv -f $depbase.Tpo $depbase.Po
483:info:build depbase=`echo fontforge/splineorder2.o | sed 's|[^/]*$|.deps/&|;s|\.o$||'`;\
484:info:build     /usr/bin/clang -DHAVE_CONFIG_H -I. -I../..   -I/opt/local/include -I./inc -I./fontforge -pipe -Os -arch x86_64 -MT fontforge/splineorder2.o -MD -MP -MF $depbase.Tpo -c -o fontforge/splineorder2.o fontforge/splineorder2.c &&\
485:info:build     mv -f $depbase.Tpo $depbase.Po
486:info:build fontforge/sfd.c:3800:54: warning: while loop has empty body [-Wempty-body]
487:info:build             while ( (temp=nlgetc(sfd))=='\n' || temp=='\r' ); ungetc(temp,sfd);
488:info:build                                                             ^
489:info:build fontforge/sfd.c:3800:54: note: put the semicolon on a separate line to silence this warning
490:info:build fontforge/sfd.c:3817:54: warning: while loop has empty body [-Wempty-body]
491:info:build             while ( (temp=nlgetc(sfd))=='\n' || temp=='\r' ); ungetc(temp,sfd);
492:info:build                                                             ^
493:info:build fontforge/sfd.c:3817:54: note: put the semicolon on a separate line to silence this warning
494:info:build fontforge/sfd.c:3883:37: warning: while loop has empty body [-Wempty-body]
495:info:build             while ((ch=nlgetc(sfd)) == ' '); ungetc(ch, sfd); if (ch == '\n' || ch == EOF) continue;
496:info:build                                            ^
497:info:build fontforge/sfd.c:3883:37: note: put the semicolon on a separate line to silence this warning
498:info:build fontforge/sfd.c:3885:37: warning: while loop has empty body [-Wempty-body]
499:info:build             while ((ch=nlgetc(sfd)) == ' '); ungetc(ch, sfd); if (ch == '\n' || ch == EOF) continue;
500:info:build                                            ^
501:info:build fontforge/sfd.c:3885:37: note: put the semicolon on a separate line to silence this warning
502:info:build fontforge/sfd.c:3888:51: warning: while loop has empty body [-Wempty-body]
503:info:build             while ((ch=nlgetc(sfd)) == ' ' || ch == '\n'); ungetc(ch, sfd);
504:info:build                                                          ^
505:info:build fontforge/sfd.c:3888:51: note: put the semicolon on a separate line to silence this warning
506:info:build fontforge/sfd.c:3901:37: warning: while loop has empty body [-Wempty-body]
507:info:build             while ((ch=nlgetc(sfd)) == ' '); ungetc(ch, sfd); if (ch == '\n' || ch == EOF) continue;
508:info:build                                            ^
509:info:build fontforge/sfd.c:3901:37: note: put the semicolon on a separate line to silence this warning
510:info:build fontforge/sfd.c:3903:37: warning: while loop has empty body [-Wempty-body]
511:info:build             while ((ch=nlgetc(sfd)) == ' '); ungetc(ch, sfd); if (ch == '\n' || ch == EOF) continue;
512:info:build                                            ^
513:info:build fontforge/sfd.c:3903:37: note: put the semicolon on a separate line to silence this warning
514:info:build fontforge/sfd.c:3906:51: warning: while loop has empty body [-Wempty-body]
515:info:build             while ((ch=nlgetc(sfd)) == ' ' || ch == '\n'); ungetc(ch, sfd);
516:info:build                                                          ^
517:info:build fontforge/sfd.c:3906:51: note: put the semicolon on a separate line to silence this warning
518:info:build fontforge/sfd.c:3963:40: warning: while loop has empty body [-Wempty-body]
519:info:build         while ((ch=nlgetc(sfd)) == ' '); ungetc(ch, sfd);
520:info:build                                        ^
521:info:build fontforge/sfd.c:3963:40: note: put the semicolon on a separate line to silence this warning
522:info:build fontforge/sfd.c:3965:40: warning: while loop has empty body [-Wempty-body]
523:info:build         while ((ch=nlgetc(sfd)) == ' '); ungetc(ch, sfd);
524:info:build                                        ^
525:info:build fontforge/sfd.c:3965:40: note: put the semicolon on a separate line to silence this warning
526:info:build fontforge/sfd.c:3967:54: warning: while loop has empty body [-Wempty-body]
527:info:build         while ((ch=nlgetc(sfd)) == ' ' || ch == '\n'); ungetc(ch, sfd);
528:info:build                                                      ^
529:info:build fontforge/sfd.c:3967:54: note: put the semicolon on a separate line to silence this warning
530:info:build fontforge/sfd.c:3974:40: warning: while loop has empty body [-Wempty-body]
531:info:build         while ((ch=nlgetc(sfd)) == ' '); ungetc(ch, sfd);
532:info:build                                        ^
533:info:build fontforge/sfd.c:3974:40: note: put the semicolon on a separate line to silence this warning
534:info:build fontforge/sfd.c:3976:40: warning: while loop has empty body [-Wempty-body]
535:info:build         while ((ch=nlgetc(sfd)) == ' '); ungetc(ch, sfd);
536:info:build                                        ^
537:info:build fontforge/sfd.c:3976:40: note: put the semicolon on a separate line to silence this warning
538:info:build fontforge/sfd.c:3978:40: warning: while loop has empty body [-Wempty-body]
539:info:build         while ((ch=nlgetc(sfd)) == ' '); ungetc(ch, sfd);
540:info:build                                        ^
541:info:build fontforge/sfd.c:3978:40: note: put the semicolon on a separate line to silence this warning
542:info:build fontforge/sfd.c:3981:54: warning: while loop has empty body [-Wempty-body]
543:info:build         while ((ch=nlgetc(sfd)) == ' ' || ch == '\n'); ungetc(ch, sfd);
544:info:build                                                      ^
545:info:build fontforge/sfd.c:3981:54: note: put the semicolon on a separate line to silence this warning
546:info:build fontforge/sfd.c:3988:40: warning: while loop has empty body [-Wempty-body]
547:info:build         while ((ch=nlgetc(sfd)) == ' '); ungetc(ch, sfd);
548:info:build                                        ^
549:info:build fontforge/sfd.c:3988:40: note: put the semicolon on a separate line to silence this warning
550:info:build fontforge/sfd.c:3990:40: warning: while loop has empty body [-Wempty-body]
551:info:build         while ((ch=nlgetc(sfd)) == ' '); ungetc(ch, sfd);
552:info:build                                        ^
553:info:build fontforge/sfd.c:3990:40: note: put the semicolon on a separate line to silence this warning
554:info:build fontforge/sfd.c:3992:40: warning: while loop has empty body [-Wempty-body]
555:info:build         while ((ch=nlgetc(sfd)) == ' '); ungetc(ch, sfd);
556:info:build                                        ^
557:info:build fontforge/sfd.c:3992:40: note: put the semicolon on a separate line to silence this warning
558:info:build fontforge/sfd.c:3995:54: warning: while loop has empty body [-Wempty-body]
559:info:build         while ((ch=nlgetc(sfd)) == ' ' || ch == '\n'); ungetc(ch, sfd);
560:info:build                                                      ^
561:info:build fontforge/sfd.c:3995:54: note: put the semicolon on a separate line to silence this warning
562:info:build depbase=`echo fontforge/splineoverlap.o | sed 's|[^/]*$|.deps/&|;s|\.o$||'`;\
563:info:build     /usr/bin/clang -DHAVE_CONFIG_H -I. -I../..   -I/opt/local/include -I./inc -I./fontforge -pipe -Os -arch x86_64 -MT fontforge/splineoverlap.o -MD -MP -MF $depbase.Tpo -c -o fontforge/splineoverlap.o fontforge/splineoverlap.c &&\
564:info:build     mv -f $depbase.Tpo $depbase.Po
565:info:build depbase=`echo fontforge/splinerefigure.o | sed 's|[^/]*$|.deps/&|;s|\.o$||'`;\
566:info:build     /usr/bin/clang -DHAVE_CONFIG_H -I. -I../..   -I/opt/local/include -I./inc -I./fontforge -pipe -Os -arch x86_64 -MT fontforge/splinerefigure.o -MD -MP -MF $depbase.Tpo -c -o fontforge/splinerefigure.o fontforge/splinerefigure.c &&\
567:info:build     mv -f $depbase.Tpo $depbase.Po
568:info:build depbase=`echo fontforge/splinesave.o | sed 's|[^/]*$|.deps/&|;s|\.o$||'`;\
569:info:build     /usr/bin/clang -DHAVE_CONFIG_H -I. -I../..   -I/opt/local/include -I./inc -I./fontforge -pipe -Os -arch x86_64 -MT fontforge/splinesave.o -MD -MP -MF $depbase.Tpo -c -o fontforge/splinesave.o fontforge/splinesave.c &&\
570:info:build     mv -f $depbase.Tpo $depbase.Po
571:info:build depbase=`echo fontforge/splinesaveafm.o | sed 's|[^/]*$|.deps/&|;s|\.o$||'`;\
572:info:build     /usr/bin/clang -DHAVE_CONFIG_H -I. -I../..   -I/opt/local/include -I./inc -I./fontforge -pipe -Os -arch x86_64 -MT fontforge/splinesaveafm.o -MD -MP -MF $depbase.Tpo -c -o fontforge/splinesaveafm.o fontforge/splinesaveafm.c &&\
573:info:build     mv -f $depbase.Tpo $depbase.Po
574:info:build depbase=`echo fontforge/splineutil.o | sed 's|[^/]*$|.deps/&|;s|\.o$||'`;\
575:info:build     /usr/bin/clang -DHAVE_CONFIG_H -I. -I../..   -I/opt/local/include -I./inc -I./fontforge -pipe -Os -arch x86_64 -MT fontforge/splineutil.o -MD -MP -MF $depbase.Tpo -c -o fontforge/splineutil.o fontforge/splineutil.c &&\
576:info:build     mv -f $depbase.Tpo $depbase.Po
577:info:build depbase=`echo fontforge/splineutil2.o | sed 's|[^/]*$|.deps/&|;s|\.o$||'`;\
578:info:build     /usr/bin/clang -DHAVE_CONFIG_H -I. -I../..   -I/opt/local/include -I./inc -I./fontforge -pipe -Os -arch x86_64 -MT fontforge/splineutil2.o -MD -MP -MF $depbase.Tpo -c -o fontforge/splineutil2.o fontforge/splineutil2.c &&\
579:info:build     mv -f $depbase.Tpo $depbase.Po
580:info:build depbase=`echo fontforge/start.o | sed 's|[^/]*$|.deps/&|;s|\.o$||'`;\
581:info:build     /usr/bin/clang -DHAVE_CONFIG_H -I. -I../..   -I/opt/local/include -I./inc -I./fontforge -pipe -Os -arch x86_64 -MT fontforge/start.o -MD -MP -MF $depbase.Tpo -c -o fontforge/start.o fontforge/start.c &&\
582:info:build     mv -f $depbase.Tpo $depbase.Po
583:info:build depbase=`echo fontforge/stemdb.o | sed 's|[^/]*$|.deps/&|;s|\.o$||'`;\
584:info:build     /usr/bin/clang -DHAVE_CONFIG_H -I. -I../..   -I/opt/local/include -I./inc -I./fontforge -pipe -Os -arch x86_64 -MT fontforge/stemdb.o -MD -MP -MF $depbase.Tpo -c -o fontforge/stemdb.o fontforge/stemdb.c &&\
585:info:build     mv -f $depbase.Tpo $depbase.Po
586:info:build depbase=`echo fontforge/tmpfile2.o | sed 's|[^/]*$|.deps/&|;s|\.o$||'`;\
587:info:build     /usr/bin/clang++ -std=gnu++11 -DHAVE_CONFIG_H -I. -I../..   -I/opt/local/include  -pipe -Os -stdlib=libc++ -arch x86_64 -MT fontforge/tmpfile2.o -MD -MP -MF $depbase.Tpo -c -o fontforge/tmpfile2.o fontforge/tmpfile2.cpp &&\
588:info:build     mv -f $depbase.Tpo $depbase.Po
589:info:build fontforge/stemdb.c:2358:32: warning: comparison of address of 'other->to->next' not equal to a null pointer is always true [-Wtautological-pointer-compare]
590:info:build         topd->colinear && &other->to->next != NULL ) {
591:info:build                            ~~~~~~~~~~~^~~~    ~~~~
592:info:build fontforge/stemdb.c:2374:36: warning: comparison of address of 'other->from->prev' not equal to a null pointer is always true [-Wtautological-pointer-compare]
593:info:build         frompd->colinear && &other->from->prev != NULL ) {
594:info:build                              ~~~~~~~~~~~~~^~~~    ~~~~
595:info:build depbase=`echo fontforge/tottf.o | sed 's|[^/]*$|.deps/&|;s|\.o$||'`;\
596:info:build     /usr/bin/clang -DHAVE_CONFIG_H -I. -I../..   -I/opt/local/include -I./inc -I./fontforge -pipe -Os -arch x86_64 -MT fontforge/tottf.o -MD -MP -MF $depbase.Tpo -c -o fontforge/tottf.o fontforge/tottf.c &&\
597:info:build     mv -f $depbase.Tpo $depbase.Po
598:info:build depbase=`echo fontforge/tottfaat.o | sed 's|[^/]*$|.deps/&|;s|\.o$||'`;\
599:info:build     /usr/bin/clang -DHAVE_CONFIG_H -I. -I../..   -I/opt/local/include -I./inc -I./fontforge -pipe -Os -arch x86_64 -MT fontforge/tottfaat.o -MD -MP -MF $depbase.Tpo -c -o fontforge/tottfaat.o fontforge/tottfaat.c &&\
600:info:build     mv -f $depbase.Tpo $depbase.Po
601:info:build depbase=`echo fontforge/tottfgpos.o | sed 's|[^/]*$|.deps/&|;s|\.o$||'`;\
602:info:build     /usr/bin/clang -DHAVE_CONFIG_H -I. -I../..   -I/opt/local/include -I./inc -I./fontforge -pipe -Os -arch x86_64 -MT fontforge/tottfgpos.o -MD -MP -MF $depbase.Tpo -c -o fontforge/tottfgpos.o fontforge/tottfgpos.c &&\
603:info:build     mv -f $depbase.Tpo $depbase.Po
604:info:build fontforge/tmpfile2.cpp:75:1: warning: control may reach end of non-void function [-Wreturn-type]
605:info:build }
606:info:build ^
607:info:build 1 warning generated.
608:info:build depbase=`echo fontforge/tottfvar.o | sed 's|[^/]*$|.deps/&|;s|\.o$||'`;\
609:info:build     /usr/bin/clang -DHAVE_CONFIG_H -I. -I../..   -I/opt/local/include -I./inc -I./fontforge -pipe -Os -arch x86_64 -MT fontforge/tottfvar.o -MD -MP -MF $depbase.Tpo -c -o fontforge/tottfvar.o fontforge/tottfvar.c &&\
610:info:build     mv -f $depbase.Tpo $depbase.Po
611:info:build depbase=`echo fontforge/ttfinstrs.o | sed 's|[^/]*$|.deps/&|;s|\.o$||'`;\
612:info:build     /usr/bin/clang -DHAVE_CONFIG_H -I. -I../..   -I/opt/local/include -I./inc -I./fontforge -pipe -Os -arch x86_64 -MT fontforge/ttfinstrs.o -MD -MP -MF $depbase.Tpo -c -o fontforge/ttfinstrs.o fontforge/ttfinstrs.c &&\
613:info:build     mv -f $depbase.Tpo $depbase.Po
614:info:build 2 warnings generated.
615:info:build depbase=`echo fontforge/ttfspecial.o | sed 's|[^/]*$|.deps/&|;s|\.o$||'`;\
616:info:build     /usr/bin/clang -DHAVE_CONFIG_H -I. -I../..   -I/opt/local/include -I./inc -I./fontforge -pipe -Os -arch x86_64 -MT fontforge/ttfspecial.o -MD -MP -MF $depbase.Tpo -c -o fontforge/ttfspecial.o fontforge/ttfspecial.c &&\
617:info:build     mv -f $depbase.Tpo $depbase.Po
618:info:build depbase=`echo fontforge/unialt.o | sed 's|[^/]*$|.deps/&|;s|\.o$||'`;\
619:info:build     /usr/bin/clang -DHAVE_CONFIG_H -I. -I../..   -I/opt/local/include -I./inc -I./fontforge -pipe -Os -arch x86_64 -MT fontforge/unialt.o -MD -MP -MF $depbase.Tpo -c -o fontforge/unialt.o fontforge/unialt.c &&\
620:info:build     mv -f $depbase.Tpo $depbase.Po
621:info:build 19 warnings generated.
622:info:build depbase=`echo fontforge/ustring.o | sed 's|[^/]*$|.deps/&|;s|\.o$||'`;\
623:info:build     /usr/bin/clang -DHAVE_CONFIG_H -I. -I../..   -I/opt/local/include -I./inc -I./fontforge -pipe -Os -arch x86_64 -MT fontforge/ustring.o -MD -MP -MF $depbase.Tpo -c -o fontforge/ustring.o fontforge/ustring.c &&\
624:info:build     mv -f $depbase.Tpo $depbase.Po
625:info:build depbase=`echo fontforge/utype.o | sed 's|[^/]*$|.deps/&|;s|\.o$||'`;\
626:info:build     /usr/bin/clang -DHAVE_CONFIG_H -I. -I../..   -I/opt/local/include -I./inc -I./fontforge -pipe -Os -arch x86_64 -MT fontforge/utype.o -MD -MP -MF $depbase.Tpo -c -o fontforge/utype.o fontforge/utype.c &&\
627:info:build     mv -f $depbase.Tpo $depbase.Po
628:info:build depbase=`echo fontforge/woff.o | sed 's|[^/]*$|.deps/&|;s|\.o$||'`;\
629:info:build     /usr/bin/clang -DHAVE_CONFIG_H -I. -I../..   -I/opt/local/include -I./inc -I./fontforge -pipe -Os -arch x86_64 -MT fontforge/woff.o -MD -MP -MF $depbase.Tpo -c -o fontforge/woff.o fontforge/woff.c &&\
630:info:build     mv -f $depbase.Tpo $depbase.Po
631:info:build 2 warnings generated.
632:info:build rm -f libfontforge.a
633:info:build ar cru libfontforge.a fontforge/alphabet.o fontforge/asmfpst.o fontforge/autohint.o fontforge/char.o fontforge/cjk.o fontforge/cvundoes.o fontforge/dumppfa.o fontforge/encoding.o fontforge/fflocale.o fontforge/fvfonts.o fontforge/gwwiconv.o fontforge/lookups.o fontforge/macbinary.o fontforge/macenc.o fontforge/mathconstants.o fontforge/memory.o fontforge/mm.o fontforge/namelist.o fontforge/nouiutil.o fontforge/nowakowskittfinstr.o fontforge/parsepfa.o fontforge/parsettf.o fontforge/parsettfatt.o fontforge/psread.o fontforge/pua.o fontforge/sfd.o fontforge/sfd1.o fontforge/splinechar.o fontforge/splinefont.o fontforge/splineorder2.o fontforge/splineoverlap.o fontforge/splinerefigure.o fontforge/splinesave.o fontforge/splinesaveafm.o fontforge/splineutil.o fontforge/splineutil2.o fontforge/start.o fontforge/stemdb.o fontforge/tmpfile2.o fontforge/tottf.o fontforge/tottfaat.o fontforge/tottfgpos.o fontforge/tottfvar.o fontforge/ttfinstrs.o fontforge/ttfspecial.o fontforge/unialt.o fontforge/ustring.o fontforge/utype.o fontforge/woff.o
634:info:build ranlib libfontforge.a
635:info:build make[3]: Leaving directory `/opt/local/var/macports/build/_opt_local_var_macports_sources_rsync.macports.org_release_tarballs_ports_graphics_dvisvgm/dvisvgm/work/dvisvgm-2.3.4/libs/ff-woff'
636:info:build Making all in woff2
637:info:build make[3]: Entering directory `/opt/local/var/macports/build/_opt_local_var_macports_sources_rsync.macports.org_release_tarballs_ports_graphics_dvisvgm/dvisvgm/work/dvisvgm-2.3.4/libs/woff2'
638:info:build depbase=`echo src/font.o | sed 's|[^/]*$|.deps/&|;s|\.o$||'`;\
639:info:build     /usr/bin/clang++ -std=gnu++11 -DHAVE_CONFIG_H -I. -I../..   -I/opt/local/include -Wall -I./include -I./../brotli/include -pipe -Os -stdlib=libc++ -arch x86_64 -MT src/font.o -MD -MP -MF $depbase.Tpo -c -o src/font.o src/font.cc &&\
640:info:build     mv -f $depbase.Tpo $depbase.Po
641:info:build depbase=`echo src/glyph.o | sed 's|[^/]*$|.deps/&|;s|\.o$||'`;\
642:info:build     /usr/bin/clang++ -std=gnu++11 -DHAVE_CONFIG_H -I. -I../..   -I/opt/local/include -Wall -I./include -I./../brotli/include -pipe -Os -stdlib=libc++ -arch x86_64 -MT src/glyph.o -MD -MP -MF $depbase.Tpo -c -o src/glyph.o src/glyph.cc &&\
643:info:build     mv -f $depbase.Tpo $depbase.Po
644:info:build depbase=`echo src/normalize.o | sed 's|[^/]*$|.deps/&|;s|\.o$||'`;\
645:info:build     /usr/bin/clang++ -std=gnu++11 -DHAVE_CONFIG_H -I. -I../..   -I/opt/local/include -Wall -I./include -I./../brotli/include -pipe -Os -stdlib=libc++ -arch x86_64 -MT src/normalize.o -MD -MP -MF $depbase.Tpo -c -o src/normalize.o src/normalize.cc &&\
646:info:build     mv -f $depbase.Tpo $depbase.Po
647:info:build depbase=`echo src/table_tags.o | sed 's|[^/]*$|.deps/&|;s|\.o$||'`;\
648:info:build     /usr/bin/clang++ -std=gnu++11 -DHAVE_CONFIG_H -I. -I../..   -I/opt/local/include -Wall -I./include -I./../brotli/include -pipe -Os -stdlib=libc++ -arch x86_64 -MT src/table_tags.o -MD -MP -MF $depbase.Tpo -c -o src/table_tags.o src/table_tags.cc &&\
649:info:build     mv -f $depbase.Tpo $depbase.Po
650:info:build depbase=`echo src/transform.o | sed 's|[^/]*$|.deps/&|;s|\.o$||'`;\
651:info:build     /usr/bin/clang++ -std=gnu++11 -DHAVE_CONFIG_H -I. -I../..   -I/opt/local/include -Wall -I./include -I./../brotli/include -pipe -Os -stdlib=libc++ -arch x86_64 -MT src/transform.o -MD -MP -MF $depbase.Tpo -c -o src/transform.o src/transform.cc &&\
652:info:build     mv -f $depbase.Tpo $depbase.Po
653:info:build depbase=`echo src/variable_length.o | sed 's|[^/]*$|.deps/&|;s|\.o$||'`;\
654:info:build     /usr/bin/clang++ -std=gnu++11 -DHAVE_CONFIG_H -I. -I../..   -I/opt/local/include -Wall -I./include -I./../brotli/include -pipe -Os -stdlib=libc++ -arch x86_64 -MT src/variable_length.o -MD -MP -MF $depbase.Tpo -c -o src/variable_length.o src/variable_length.cc &&\
655:info:build     mv -f $depbase.Tpo $depbase.Po
656:info:build depbase=`echo src/woff2_common.o | sed 's|[^/]*$|.deps/&|;s|\.o$||'`;\
657:info:build     /usr/bin/clang++ -std=gnu++11 -DHAVE_CONFIG_H -I. -I../..   -I/opt/local/include -Wall -I./include -I./../brotli/include -pipe -Os -stdlib=libc++ -arch x86_64 -MT src/woff2_common.o -MD -MP -MF $depbase.Tpo -c -o src/woff2_common.o src/woff2_common.cc &&\
658:info:build     mv -f $depbase.Tpo $depbase.Po
659:info:build depbase=`echo src/woff2_enc.o | sed 's|[^/]*$|.deps/&|;s|\.o$||'`;\
660:info:build     /usr/bin/clang++ -std=gnu++11 -DHAVE_CONFIG_H -I. -I../..   -I/opt/local/include -Wall -I./include -I./../brotli/include -pipe -Os -stdlib=libc++ -arch x86_64 -MT src/woff2_enc.o -MD -MP -MF $depbase.Tpo -c -o src/woff2_enc.o src/woff2_enc.cc &&\
661:info:build     mv -f $depbase.Tpo $depbase.Po
662:info:build depbase=`echo src/woff2_out.o | sed 's|[^/]*$|.deps/&|;s|\.o$||'`;\
663:info:build     /usr/bin/clang++ -std=gnu++11 -DHAVE_CONFIG_H -I. -I../..   -I/opt/local/include -Wall -I./include -I./../brotli/include -pipe -Os -stdlib=libc++ -arch x86_64 -MT src/woff2_out.o -MD -MP -MF $depbase.Tpo -c -o src/woff2_out.o src/woff2_out.cc &&\
664:info:build     mv -f $depbase.Tpo $depbase.Po
665:info:build src/transform.cc:23:11: warning: unused variable 'FLAG_ARG_1_AND_2_ARE_WORDS' [-Wunused-const-variable]
666:info:build const int FLAG_ARG_1_AND_2_ARE_WORDS = 1 << 0;
667:info:build           ^
668:info:build src/transform.cc:24:11: warning: unused variable 'FLAG_WE_HAVE_INSTRUCTIONS' [-Wunused-const-variable]
669:info:build const int FLAG_WE_HAVE_INSTRUCTIONS = 1 << 8;
670:info:build           ^
671:info:build src/woff2_enc.cc:39:14: warning: unused variable 'kWoff2EntrySize' [-Wunused-const-variable]
672:info:build const size_t kWoff2EntrySize = 20;
673:info:build              ^
674:info:build 2 warnings generated.
675:info:build 1 warning generated.
676:info:build rm -f libwoff2.a
677:info:build ar cru libwoff2.a src/font.o src/glyph.o src/normalize.o src/table_tags.o src/transform.o src/variable_length.o src/woff2_common.o src/woff2_enc.o src/woff2_out.o
678:info:build ranlib libwoff2.a
679:info:build make[3]: Leaving directory `/opt/local/var/macports/build/_opt_local_var_macports_sources_rsync.macports.org_release_tarballs_ports_graphics_dvisvgm/dvisvgm/work/dvisvgm-2.3.4/libs/woff2'
680:info:build make[3]: Entering directory `/opt/local/var/macports/build/_opt_local_var_macports_sources_rsync.macports.org_release_tarballs_ports_graphics_dvisvgm/dvisvgm/work/dvisvgm-2.3.4/libs'
681:info:build make[3]: Nothing to be done for `all-am'.
682:info:build make[3]: Leaving directory `/opt/local/var/macports/build/_opt_local_var_macports_sources_rsync.macports.org_release_tarballs_ports_graphics_dvisvgm/dvisvgm/work/dvisvgm-2.3.4/libs'
683:info:build make[2]: Leaving directory `/opt/local/var/macports/build/_opt_local_var_macports_sources_rsync.macports.org_release_tarballs_ports_graphics_dvisvgm/dvisvgm/work/dvisvgm-2.3.4/libs'
684:info:build Making all in src
685:info:build make[2]: Entering directory `/opt/local/var/macports/build/_opt_local_var_macports_sources_rsync.macports.org_release_tarballs_ports_graphics_dvisvgm/dvisvgm/work/dvisvgm-2.3.4/src'
686:info:build depbase=`echo BasicDVIReader.o | sed 's|[^/]*$|.deps/&|;s|\.o$||'`;\
687:info:build     /usr/bin/clang++ -std=gnu++11 -DHAVE_CONFIG_H -I. -I..   -I/opt/local/include -Wall -Wnon-virtual-dtor -Wno-mismatched-tags -I../libs/clipper -I../libs/variant/include -I../libs/xxHash  -I/opt/local/include/freetype2 -I/opt/local/include/libpng16    -I../libs/brotli/include -I../libs/woff2/include -pipe -Os -stdlib=libc++ -arch x86_64 -MT BasicDVIReader.o -MD -MP -MF $depbase.Tpo -c -o BasicDVIReader.o BasicDVIReader.cpp &&\
688:info:build     mv -f $depbase.Tpo $depbase.Po
689:info:build depbase=`echo Bezier.o | sed 's|[^/]*$|.deps/&|;s|\.o$||'`;\
690:info:build     /usr/bin/clang++ -std=gnu++11 -DHAVE_CONFIG_H -I. -I..   -I/opt/local/include -Wall -Wnon-virtual-dtor -Wno-mismatched-tags -I../libs/clipper -I../libs/variant/include -I../libs/xxHash  -I/opt/local/include/freetype2 -I/opt/local/include/libpng16    -I../libs/brotli/include -I../libs/woff2/include -pipe -Os -stdlib=libc++ -arch x86_64 -MT Bezier.o -MD -MP -MF $depbase.Tpo -c -o Bezier.o Bezier.cpp &&\
691:info:build     mv -f $depbase.Tpo $depbase.Po
692:info:build depbase=`echo BgColorSpecialHandler.o | sed 's|[^/]*$|.deps/&|;s|\.o$||'`;\
693:info:build     /usr/bin/clang++ -std=gnu++11 -DHAVE_CONFIG_H -I. -I..   -I/opt/local/include -Wall -Wnon-virtual-dtor -Wno-mismatched-tags -I../libs/clipper -I../libs/variant/include -I../libs/xxHash  -I/opt/local/include/freetype2 -I/opt/local/include/libpng16    -I../libs/brotli/include -I../libs/woff2/include -pipe -Os -stdlib=libc++ -arch x86_64 -MT BgColorSpecialHandler.o -MD -MP -MF $depbase.Tpo -c -o BgColorSpecialHandler.o BgColorSpecialHandler.cpp &&\
694:info:build     mv -f $depbase.Tpo $depbase.Po
695:info:build depbase=`echo Bitmap.o | sed 's|[^/]*$|.deps/&|;s|\.o$||'`;\
696:info:build     /usr/bin/clang++ -std=gnu++11 -DHAVE_CONFIG_H -I. -I..   -I/opt/local/include -Wall -Wnon-virtual-dtor -Wno-mismatched-tags -I../libs/clipper -I../libs/variant/include -I../libs/xxHash  -I/opt/local/include/freetype2 -I/opt/local/include/libpng16    -I../libs/brotli/include -I../libs/woff2/include -pipe -Os -stdlib=libc++ -arch x86_64 -MT Bitmap.o -MD -MP -MF $depbase.Tpo -c -o Bitmap.o Bitmap.cpp &&\
697:info:build     mv -f $depbase.Tpo $depbase.Po
698:info:build depbase=`echo BoundingBox.o | sed 's|[^/]*$|.deps/&|;s|\.o$||'`;\
699:info:build     /usr/bin/clang++ -std=gnu++11 -DHAVE_CONFIG_H -I. -I..   -I/opt/local/include -Wall -Wnon-virtual-dtor -Wno-mismatched-tags -I../libs/clipper -I../libs/variant/include -I../libs/xxHash  -I/opt/local/include/freetype2 -I/opt/local/include/libpng16    -I../libs/brotli/include -I../libs/woff2/include -pipe -Os -stdlib=libc++ -arch x86_64 -MT BoundingBox.o -MD -MP -MF $depbase.Tpo -c -o BoundingBox.o BoundingBox.cpp &&\
700:info:build     mv -f $depbase.Tpo $depbase.Po
701:info:build depbase=`echo Calculator.o | sed 's|[^/]*$|.deps/&|;s|\.o$||'`;\
702:info:build     /usr/bin/clang++ -std=gnu++11 -DHAVE_CONFIG_H -I. -I..   -I/opt/local/include -Wall -Wnon-virtual-dtor -Wno-mismatched-tags -I../libs/clipper -I../libs/variant/include -I../libs/xxHash  -I/opt/local/include/freetype2 -I/opt/local/include/libpng16    -I../libs/brotli/include -I../libs/woff2/include -pipe -Os -stdlib=libc++ -arch x86_64 -MT Calculator.o -MD -MP -MF $depbase.Tpo -c -o Calculator.o Calculator.cpp &&\
703:info:build     mv -f $depbase.Tpo $depbase.Po
704:info:build depbase=`echo CharMapID.o | sed 's|[^/]*$|.deps/&|;s|\.o$||'`;\
705:info:build     /usr/bin/clang++ -std=gnu++11 -DHAVE_CONFIG_H -I. -I..   -I/opt/local/include -Wall -Wnon-virtual-dtor -Wno-mismatched-tags -I../libs/clipper -I../libs/variant/include -I../libs/xxHash  -I/opt/local/include/freetype2 -I/opt/local/include/libpng16    -I../libs/brotli/include -I../libs/woff2/include -pipe -Os -stdlib=libc++ -arch x86_64 -MT CharMapID.o -MD -MP -MF $depbase.Tpo -c -o CharMapID.o CharMapID.cpp &&\
706:info:build     mv -f $depbase.Tpo $depbase.Po
707:info:build depbase=`echo CLCommandLine.o | sed 's|[^/]*$|.deps/&|;s|\.o$||'`;\
708:info:build     /usr/bin/clang++ -std=gnu++11 -DHAVE_CONFIG_H -I. -I..   -I/opt/local/include -Wall -Wnon-virtual-dtor -Wno-mismatched-tags -I../libs/clipper -I../libs/variant/include -I../libs/xxHash  -I/opt/local/include/freetype2 -I/opt/local/include/libpng16    -I../libs/brotli/include -I../libs/woff2/include -pipe -Os -stdlib=libc++ -arch x86_64 -MT CLCommandLine.o -MD -MP -MF $depbase.Tpo -c -o CLCommandLine.o CLCommandLine.cpp &&\
709:info:build     mv -f $depbase.Tpo $depbase.Po
710:info:build depbase=`echo CMap.o | sed 's|[^/]*$|.deps/&|;s|\.o$||'`;\
711:info:build     /usr/bin/clang++ -std=gnu++11 -DHAVE_CONFIG_H -I. -I..   -I/opt/local/include -Wall -Wnon-virtual-dtor -Wno-mismatched-tags -I../libs/clipper -I../libs/variant/include -I../libs/xxHash  -I/opt/local/include/freetype2 -I/opt/local/include/libpng16    -I../libs/brotli/include -I../libs/woff2/include -pipe -Os -stdlib=libc++ -arch x86_64 -MT CMap.o -MD -MP -MF $depbase.Tpo -c -o CMap.o CMap.cpp &&\
712:info:build     mv -f $depbase.Tpo $depbase.Po
713:info:build depbase=`echo CMapManager.o | sed 's|[^/]*$|.deps/&|;s|\.o$||'`;\
714:info:build     /usr/bin/clang++ -std=gnu++11 -DHAVE_CONFIG_H -I. -I..   -I/opt/local/include -Wall -Wnon-virtual-dtor -Wno-mismatched-tags -I../libs/clipper -I../libs/variant/include -I../libs/xxHash  -I/opt/local/include/freetype2 -I/opt/local/include/libpng16    -I../libs/brotli/include -I../libs/woff2/include -pipe -Os -stdlib=libc++ -arch x86_64 -MT CMapManager.o -MD -MP -MF $depbase.Tpo -c -o CMapManager.o CMapManager.cpp &&\
715:info:build     mv -f $depbase.Tpo $depbase.Po
716:info:build depbase=`echo CMapReader.o | sed 's|[^/]*$|.deps/&|;s|\.o$||'`;\
717:info:build     /usr/bin/clang++ -std=gnu++11 -DHAVE_CONFIG_H -I. -I..   -I/opt/local/include -Wall -Wnon-virtual-dtor -Wno-mismatched-tags -I../libs/clipper -I../libs/variant/include -I../libs/xxHash  -I/opt/local/include/freetype2 -I/opt/local/include/libpng16    -I../libs/brotli/include -I../libs/woff2/include -pipe -Os -stdlib=libc++ -arch x86_64 -MT CMapReader.o -MD -MP -MF $depbase.Tpo -c -o CMapReader.o CMapReader.cpp &&\
718:info:build     mv -f $depbase.Tpo $depbase.Po
719:info:build depbase=`echo Color.o | sed 's|[^/]*$|.deps/&|;s|\.o$||'`;\
720:info:build     /usr/bin/clang++ -std=gnu++11 -DHAVE_CONFIG_H -I. -I..   -I/opt/local/include -Wall -Wnon-virtual-dtor -Wno-mismatched-tags -I../libs/clipper -I../libs/variant/include -I../libs/xxHash  -I/opt/local/include/freetype2 -I/opt/local/include/libpng16    -I../libs/brotli/include -I../libs/woff2/include -pipe -Os -stdlib=libc++ -arch x86_64 -MT Color.o -MD -MP -MF $depbase.Tpo -c -o Color.o Color.cpp &&\
721:info:build     mv -f $depbase.Tpo $depbase.Po
722:info:build depbase=`echo ColorSpecialHandler.o | sed 's|[^/]*$|.deps/&|;s|\.o$||'`;\
723:info:build     /usr/bin/clang++ -std=gnu++11 -DHAVE_CONFIG_H -I. -I..   -I/opt/local/include -Wall -Wnon-virtual-dtor -Wno-mismatched-tags -I../libs/clipper -I../libs/variant/include -I../libs/xxHash  -I/opt/local/include/freetype2 -I/opt/local/include/libpng16    -I../libs/brotli/include -I../libs/woff2/include -pipe -Os -stdlib=libc++ -arch x86_64 -MT ColorSpecialHandler.o -MD -MP -MF $depbase.Tpo -c -o ColorSpecialHandler.o ColorSpecialHandler.cpp &&\
724:info:build     mv -f $depbase.Tpo $depbase.Po
725:info:build depbase=`echo CRC32.o | sed 's|[^/]*$|.deps/&|;s|\.o$||'`;\
726:info:build     /usr/bin/clang++ -std=gnu++11 -DHAVE_CONFIG_H -I. -I..   -I/opt/local/include -Wall -Wnon-virtual-dtor -Wno-mismatched-tags -I../libs/clipper -I../libs/variant/include -I../libs/xxHash  -I/opt/local/include/freetype2 -I/opt/local/include/libpng16    -I../libs/brotli/include -I../libs/woff2/include -pipe -Os -stdlib=libc++ -arch x86_64 -MT CRC32.o -MD -MP -MF $depbase.Tpo -c -o CRC32.o CRC32.cpp &&\
727:info:build     mv -f $depbase.Tpo $depbase.Po
728:info:build depbase=`echo Directory.o | sed 's|[^/]*$|.deps/&|;s|\.o$||'`;\
729:info:build     /usr/bin/clang++ -std=gnu++11 -DHAVE_CONFIG_H -I. -I..   -I/opt/local/include -Wall -Wnon-virtual-dtor -Wno-mismatched-tags -I../libs/clipper -I../libs/variant/include -I../libs/xxHash  -I/opt/local/include/freetype2 -I/opt/local/include/libpng16    -I../libs/brotli/include -I../libs/woff2/include -pipe -Os -stdlib=libc++ -arch x86_64 -MT Directory.o -MD -MP -MF $depbase.Tpo -c -o Directory.o Directory.cpp &&\
730:info:build     mv -f $depbase.Tpo $depbase.Po
731:info:build depbase=`echo DLLoader.o | sed 's|[^/]*$|.deps/&|;s|\.o$||'`;\
732:info:build     /usr/bin/clang++ -std=gnu++11 -DHAVE_CONFIG_H -I. -I..   -I/opt/local/include -Wall -Wnon-virtual-dtor -Wno-mismatched-tags -I../libs/clipper -I../libs/variant/include -I../libs/xxHash  -I/opt/local/include/freetype2 -I/opt/local/include/libpng16    -I../libs/brotli/include -I../libs/woff2/include -pipe -Os -stdlib=libc++ -arch x86_64 -MT DLLoader.o -MD -MP -MF $depbase.Tpo -c -o DLLoader.o DLLoader.cpp &&\
733:info:build     mv -f $depbase.Tpo $depbase.Po
734:info:build depbase=`echo DVIReader.o | sed 's|[^/]*$|.deps/&|;s|\.o$||'`;\
735:info:build     /usr/bin/clang++ -std=gnu++11 -DHAVE_CONFIG_H -I. -I..   -I/opt/local/include -Wall -Wnon-virtual-dtor -Wno-mismatched-tags -I../libs/clipper -I../libs/variant/include -I../libs/xxHash  -I/opt/local/include/freetype2 -I/opt/local/include/libpng16    -I../libs/brotli/include -I../libs/woff2/include -pipe -Os -stdlib=libc++ -arch x86_64 -MT DVIReader.o -MD -MP -MF $depbase.Tpo -c -o DVIReader.o DVIReader.cpp &&\
736:info:build     mv -f $depbase.Tpo $depbase.Po
737:info:build depbase=`echo DvisvgmSpecialHandler.o | sed 's|[^/]*$|.deps/&|;s|\.o$||'`;\
738:info:build     /usr/bin/clang++ -std=gnu++11 -DHAVE_CONFIG_H -I. -I..   -I/opt/local/include -Wall -Wnon-virtual-dtor -Wno-mismatched-tags -I../libs/clipper -I../libs/variant/include -I../libs/xxHash  -I/opt/local/include/freetype2 -I/opt/local/include/libpng16    -I../libs/brotli/include -I../libs/woff2/include -pipe -Os -stdlib=libc++ -arch x86_64 -MT DvisvgmSpecialHandler.o -MD -MP -MF $depbase.Tpo -c -o DvisvgmSpecialHandler.o DvisvgmSpecialHandler.cpp &&\
739:info:build     mv -f $depbase.Tpo $depbase.Po
740:info:build depbase=`echo DVIToSVG.o | sed 's|[^/]*$|.deps/&|;s|\.o$||'`;\
741:info:build     /usr/bin/clang++ -std=gnu++11 -DHAVE_CONFIG_H -I. -I..   -I/opt/local/include -Wall -Wnon-virtual-dtor -Wno-mismatched-tags -I../libs/clipper -I../libs/variant/include -I../libs/xxHash  -I/opt/local/include/freetype2 -I/opt/local/include/libpng16    -I../libs/brotli/include -I../libs/woff2/include -pipe -Os -stdlib=libc++ -arch x86_64 -MT DVIToSVG.o -MD -MP -MF $depbase.Tpo -c -o DVIToSVG.o DVIToSVG.cpp &&\
742:info:build     mv -f $depbase.Tpo $depbase.Po
743:info:build depbase=`echo DVIToSVGActions.o | sed 's|[^/]*$|.deps/&|;s|\.o$||'`;\
744:info:build     /usr/bin/clang++ -std=gnu++11 -DHAVE_CONFIG_H -I. -I..   -I/opt/local/include -Wall -Wnon-virtual-dtor -Wno-mismatched-tags -I../libs/clipper -I../libs/variant/include -I../libs/xxHash  -I/opt/local/include/freetype2 -I/opt/local/include/libpng16    -I../libs/brotli/include -I../libs/woff2/include -pipe -Os -stdlib=libc++ -arch x86_64 -MT DVIToSVGActions.o -MD -MP -MF $depbase.Tpo -c -o DVIToSVGActions.o DVIToSVGActions.cpp &&\
745:info:build     mv -f $depbase.Tpo $depbase.Po
746:info:build depbase=`echo EmSpecialHandler.o | sed 's|[^/]*$|.deps/&|;s|\.o$||'`;\
747:info:build     /usr/bin/clang++ -std=gnu++11 -DHAVE_CONFIG_H -I. -I..   -I/opt/local/include -Wall -Wnon-virtual-dtor -Wno-mismatched-tags -I../libs/clipper -I../libs/variant/include -I../libs/xxHash  -I/opt/local/include/freetype2 -I/opt/local/include/libpng16    -I../libs/brotli/include -I../libs/woff2/include -pipe -Os -stdlib=libc++ -arch x86_64 -MT EmSpecialHandler.o -MD -MP -MF $depbase.Tpo -c -o EmSpecialHandler.o EmSpecialHandler.cpp &&\
748:info:build     mv -f $depbase.Tpo $depbase.Po
749:info:build depbase=`echo EncFile.o | sed 's|[^/]*$|.deps/&|;s|\.o$||'`;\
750:info:build     /usr/bin/clang++ -std=gnu++11 -DHAVE_CONFIG_H -I. -I..   -I/opt/local/include -Wall -Wnon-virtual-dtor -Wno-mismatched-tags -I../libs/clipper -I../libs/variant/include -I../libs/xxHash  -I/opt/local/include/freetype2 -I/opt/local/include/libpng16    -I../libs/brotli/include -I../libs/woff2/include -pipe -Os -stdlib=libc++ -arch x86_64 -MT EncFile.o -MD -MP -MF $depbase.Tpo -c -o EncFile.o EncFile.cpp &&\
751:info:build     mv -f $depbase.Tpo $depbase.Po
752:info:build depbase=`echo EPSFile.o | sed 's|[^/]*$|.deps/&|;s|\.o$||'`;\
753:info:build     /usr/bin/clang++ -std=gnu++11 -DHAVE_CONFIG_H -I. -I..   -I/opt/local/include -Wall -Wnon-virtual-dtor -Wno-mismatched-tags -I../libs/clipper -I../libs/variant/include -I../libs/xxHash  -I/opt/local/include/freetype2 -I/opt/local/include/libpng16    -I../libs/brotli/include -I../libs/woff2/include -pipe -Os -stdlib=libc++ -arch x86_64 -MT EPSFile.o -MD -MP -MF $depbase.Tpo -c -o EPSFile.o EPSFile.cpp &&\
754:info:build     mv -f $depbase.Tpo $depbase.Po
755:info:build depbase=`echo EPSToSVG.o | sed 's|[^/]*$|.deps/&|;s|\.o$||'`;\
756:info:build     /usr/bin/clang++ -std=gnu++11 -DHAVE_CONFIG_H -I. -I..   -I/opt/local/include -Wall -Wnon-virtual-dtor -Wno-mismatched-tags -I../libs/clipper -I../libs/variant/include -I../libs/xxHash  -I/opt/local/include/freetype2 -I/opt/local/include/libpng16    -I../libs/brotli/include -I../libs/woff2/include -pipe -Os -stdlib=libc++ -arch x86_64 -MT EPSToSVG.o -MD -MP -MF $depbase.Tpo -c -o EPSToSVG.o EPSToSVG.cpp &&\
757:info:build     mv -f $depbase.Tpo $depbase.Po
758:info:build depbase=`echo FileFinder.o | sed 's|[^/]*$|.deps/&|;s|\.o$||'`;\
759:info:build     /usr/bin/clang++ -std=gnu++11 -DHAVE_CONFIG_H -I. -I..   -I/opt/local/include -Wall -Wnon-virtual-dtor -Wno-mismatched-tags -I../libs/clipper -I../libs/variant/include -I../libs/xxHash  -I/opt/local/include/freetype2 -I/opt/local/include/libpng16    -I../libs/brotli/include -I../libs/woff2/include -pipe -Os -stdlib=libc++ -arch x86_64 -MT FileFinder.o -MD -MP -MF $depbase.Tpo -c -o FileFinder.o FileFinder.cpp &&\
760:info:build     mv -f $depbase.Tpo $depbase.Po
761:info:build depbase=`echo FilePath.o | sed 's|[^/]*$|.deps/&|;s|\.o$||'`;\
762:info:build     /usr/bin/clang++ -std=gnu++11 -DHAVE_CONFIG_H -I. -I..   -I/opt/local/include -Wall -Wnon-virtual-dtor -Wno-mismatched-tags -I../libs/clipper -I../libs/variant/include -I../libs/xxHash  -I/opt/local/include/freetype2 -I/opt/local/include/libpng16    -I../libs/brotli/include -I../libs/woff2/include -pipe -Os -stdlib=libc++ -arch x86_64 -MT FilePath.o -MD -MP -MF $depbase.Tpo -c -o FilePath.o FilePath.cpp &&\
763:info:build     mv -f $depbase.Tpo $depbase.Po
764:info:build depbase=`echo FileSystem.o | sed 's|[^/]*$|.deps/&|;s|\.o$||'`;\
765:info:build     /usr/bin/clang++ -std=gnu++11 -DHAVE_CONFIG_H -I. -I..   -I/opt/local/include -Wall -Wnon-virtual-dtor -Wno-mismatched-tags -I../libs/clipper -I../libs/variant/include -I../libs/xxHash  -I/opt/local/include/freetype2 -I/opt/local/include/libpng16    -I../libs/brotli/include -I../libs/woff2/include -pipe -Os -stdlib=libc++ -arch x86_64 -MT FileSystem.o -MD -MP -MF $depbase.Tpo -c -o FileSystem.o FileSystem.cpp &&\
766:info:build     mv -f $depbase.Tpo $depbase.Po
767:info:build depbase=`echo Font.o | sed 's|[^/]*$|.deps/&|;s|\.o$||'`;\
768:info:build     /usr/bin/clang++ -std=gnu++11 -DHAVE_CONFIG_H -I. -I..   -I/opt/local/include -Wall -Wnon-virtual-dtor -Wno-mismatched-tags -I../libs/clipper -I../libs/variant/include -I../libs/xxHash  -I/opt/local/include/freetype2 -I/opt/local/include/libpng16    -I../libs/brotli/include -I../libs/woff2/include -pipe -Os -stdlib=libc++ -arch x86_64 -MT Font.o -MD -MP -MF $depbase.Tpo -c -o Font.o Font.cpp &&\
769:info:build     mv -f $depbase.Tpo $depbase.Po
770:info:build depbase=`echo FontCache.o | sed 's|[^/]*$|.deps/&|;s|\.o$||'`;\
771:info:build     /usr/bin/clang++ -std=gnu++11 -DHAVE_CONFIG_H -I. -I..   -I/opt/local/include -Wall -Wnon-virtual-dtor -Wno-mismatched-tags -I../libs/clipper -I../libs/variant/include -I../libs/xxHash  -I/opt/local/include/freetype2 -I/opt/local/include/libpng16    -I../libs/brotli/include -I../libs/woff2/include -pipe -Os -stdlib=libc++ -arch x86_64 -MT FontCache.o -MD -MP -MF $depbase.Tpo -c -o FontCache.o FontCache.cpp &&\
772:info:build     mv -f $depbase.Tpo $depbase.Po
773:info:build depbase=`echo FontEncoding.o | sed 's|[^/]*$|.deps/&|;s|\.o$||'`;\
774:info:build     /usr/bin/clang++ -std=gnu++11 -DHAVE_CONFIG_H -I. -I..   -I/opt/local/include -Wall -Wnon-virtual-dtor -Wno-mismatched-tags -I../libs/clipper -I../libs/variant/include -I../libs/xxHash  -I/opt/local/include/freetype2 -I/opt/local/include/libpng16    -I../libs/brotli/include -I../libs/woff2/include -pipe -Os -stdlib=libc++ -arch x86_64 -MT FontEncoding.o -MD -MP -MF $depbase.Tpo -c -o FontEncoding.o FontEncoding.cpp &&\
775:info:build     mv -f $depbase.Tpo $depbase.Po
776:info:build depbase=`echo FontEngine.o | sed 's|[^/]*$|.deps/&|;s|\.o$||'`;\
777:info:build     /usr/bin/clang++ -std=gnu++11 -DHAVE_CONFIG_H -I. -I..   -I/opt/local/include -Wall -Wnon-virtual-dtor -Wno-mismatched-tags -I../libs/clipper -I../libs/variant/include -I../libs/xxHash  -I/opt/local/include/freetype2 -I/opt/local/include/libpng16    -I../libs/brotli/include -I../libs/woff2/include -pipe -Os -stdlib=libc++ -arch x86_64 -MT FontEngine.o -MD -MP -MF $depbase.Tpo -c -o FontEngine.o FontEngine.cpp &&\
778:info:build     mv -f $depbase.Tpo $depbase.Po
779:info:build depbase=`echo FontManager.o | sed 's|[^/]*$|.deps/&|;s|\.o$||'`;\
780:info:build     /usr/bin/clang++ -std=gnu++11 -DHAVE_CONFIG_H -I. -I..   -I/opt/local/include -Wall -Wnon-virtual-dtor -Wno-mismatched-tags -I../libs/clipper -I../libs/variant/include -I../libs/xxHash  -I/opt/local/include/freetype2 -I/opt/local/include/libpng16    -I../libs/brotli/include -I../libs/woff2/include -pipe -Os -stdlib=libc++ -arch x86_64 -MT FontManager.o -MD -MP -MF $depbase.Tpo -c -o FontManager.o FontManager.cpp &&\
781:info:build     mv -f $depbase.Tpo $depbase.Po
782:info:build depbase=`echo FontMap.o | sed 's|[^/]*$|.deps/&|;s|\.o$||'`;\
783:info:build     /usr/bin/clang++ -std=gnu++11 -DHAVE_CONFIG_H -I. -I..   -I/opt/local/include -Wall -Wnon-virtual-dtor -Wno-mismatched-tags -I../libs/clipper -I../libs/variant/include -I../libs/xxHash  -I/opt/local/include/freetype2 -I/opt/local/include/libpng16    -I../libs/brotli/include -I../libs/woff2/include -pipe -Os -stdlib=libc++ -arch x86_64 -MT FontMap.o -MD -MP -MF $depbase.Tpo -c -o FontMap.o FontMap.cpp &&\
784:info:build     mv -f $depbase.Tpo $depbase.Po
785:info:build depbase=`echo FontMetrics.o | sed 's|[^/]*$|.deps/&|;s|\.o$||'`;\
786:info:build     /usr/bin/clang++ -std=gnu++11 -DHAVE_CONFIG_H -I. -I..   -I/opt/local/include -Wall -Wnon-virtual-dtor -Wno-mismatched-tags -I../libs/clipper -I../libs/variant/include -I../libs/xxHash  -I/opt/local/include/freetype2 -I/opt/local/include/libpng16    -I../libs/brotli/include -I../libs/woff2/include -pipe -Os -stdlib=libc++ -arch x86_64 -MT FontMetrics.o -MD -MP -MF $depbase.Tpo -c -o FontMetrics.o FontMetrics.cpp &&\
787:info:build     mv -f $depbase.Tpo $depbase.Po
788:info:build depbase=`echo FontWriter.o | sed 's|[^/]*$|.deps/&|;s|\.o$||'`;\
789:info:build     /usr/bin/clang++ -std=gnu++11 -DHAVE_CONFIG_H -I. -I..   -I/opt/local/include -Wall -Wnon-virtual-dtor -Wno-mismatched-tags -I../libs/clipper -I../libs/variant/include -I../libs/xxHash  -I/opt/local/include/freetype2 -I/opt/local/include/libpng16    -I../libs/brotli/include -I../libs/woff2/include -pipe -Os -stdlib=libc++ -arch x86_64 -MT FontWriter.o -MD -MP -MF $depbase.Tpo -c -o FontWriter.o FontWriter.cpp &&\
790:info:build     mv -f $depbase.Tpo $depbase.Po
791:info:build depbase=`echo GFGlyphTracer.o | sed 's|[^/]*$|.deps/&|;s|\.o$||'`;\
792:info:build     /usr/bin/clang++ -std=gnu++11 -DHAVE_CONFIG_H -I. -I..   -I/opt/local/include -Wall -Wnon-virtual-dtor -Wno-mismatched-tags -I../libs/clipper -I../libs/variant/include -I../libs/xxHash  -I/opt/local/include/freetype2 -I/opt/local/include/libpng16    -I../libs/brotli/include -I../libs/woff2/include -pipe -Os -stdlib=libc++ -arch x86_64 -MT GFGlyphTracer.o -MD -MP -MF $depbase.Tpo -c -o GFGlyphTracer.o GFGlyphTracer.cpp &&\
793:info:build     mv -f $depbase.Tpo $depbase.Po
794:info:build depbase=`echo GFReader.o | sed 's|[^/]*$|.deps/&|;s|\.o$||'`;\
795:info:build     /usr/bin/clang++ -std=gnu++11 -DHAVE_CONFIG_H -I. -I..   -I/opt/local/include -Wall -Wnon-virtual-dtor -Wno-mismatched-tags -I../libs/clipper -I../libs/variant/include -I../libs/xxHash  -I/opt/local/include/freetype2 -I/opt/local/include/libpng16    -I../libs/brotli/include -I../libs/woff2/include -pipe -Os -stdlib=libc++ -arch x86_64 -MT GFReader.o -MD -MP -MF $depbase.Tpo -c -o GFReader.o GFReader.cpp &&\
796:info:build     mv -f $depbase.Tpo $depbase.Po
797:info:build depbase=`echo GFTracer.o | sed 's|[^/]*$|.deps/&|;s|\.o$||'`;\
798:info:build     /usr/bin/clang++ -std=gnu++11 -DHAVE_CONFIG_H -I. -I..   -I/opt/local/include -Wall -Wnon-virtual-dtor -Wno-mismatched-tags -I../libs/clipper -I../libs/variant/include -I../libs/xxHash  -I/opt/local/include/freetype2 -I/opt/local/include/libpng16    -I../libs/brotli/include -I../libs/woff2/include -pipe -Os -stdlib=libc++ -arch x86_64 -MT GFTracer.o -MD -MP -MF $depbase.Tpo -c -o GFTracer.o GFTracer.cpp &&\
799:info:build     mv -f $depbase.Tpo $depbase.Po
800:info:build depbase=`echo Ghostscript.o | sed 's|[^/]*$|.deps/&|;s|\.o$||'`;\
801:info:build     /usr/bin/clang++ -std=gnu++11 -DHAVE_CONFIG_H -I. -I..   -I/opt/local/include -Wall -Wnon-virtual-dtor -Wno-mismatched-tags -I../libs/clipper -I../libs/variant/include -I../libs/xxHash  -I/opt/local/include/freetype2 -I/opt/local/include/libpng16    -I../libs/brotli/include -I../libs/woff2/include -pipe -Os -stdlib=libc++ -arch x86_64 -MT Ghostscript.o -MD -MP -MF $depbase.Tpo -c -o Ghostscript.o Ghostscript.cpp &&\
802:info:build     mv -f $depbase.Tpo $depbase.Po
803:info:build depbase=`echo HtmlSpecialHandler.o | sed 's|[^/]*$|.deps/&|;s|\.o$||'`;\
804:info:build     /usr/bin/clang++ -std=gnu++11 -DHAVE_CONFIG_H -I. -I..   -I/opt/local/include -Wall -Wnon-virtual-dtor -Wno-mismatched-tags -I../libs/clipper -I../libs/variant/include -I../libs/xxHash  -I/opt/local/include/freetype2 -I/opt/local/include/libpng16    -I../libs/brotli/include -I../libs/woff2/include -pipe -Os -stdlib=libc++ -arch x86_64 -MT HtmlSpecialHandler.o -MD -MP -MF $depbase.Tpo -c -o HtmlSpecialHandler.o HtmlSpecialHandler.cpp &&\
805:info:build     mv -f $depbase.Tpo $depbase.Po
806:info:build depbase=`echo HyperlinkManager.o | sed 's|[^/]*$|.deps/&|;s|\.o$||'`;\
807:info:build     /usr/bin/clang++ -std=gnu++11 -DHAVE_CONFIG_H -I. -I..   -I/opt/local/include -Wall -Wnon-virtual-dtor -Wno-mismatched-tags -I../libs/clipper -I../libs/variant/include -I../libs/xxHash  -I/opt/local/include/freetype2 -I/opt/local/include/libpng16    -I../libs/brotli/include -I../libs/woff2/include -pipe -Os -stdlib=libc++ -arch x86_64 -MT HyperlinkManager.o -MD -MP -MF $depbase.Tpo -c -o HyperlinkManager.o HyperlinkManager.cpp &&\
808:info:build     mv -f $depbase.Tpo $depbase.Po
809:info:build depbase=`echo InputBuffer.o | sed 's|[^/]*$|.deps/&|;s|\.o$||'`;\
810:info:build     /usr/bin/clang++ -std=gnu++11 -DHAVE_CONFIG_H -I. -I..   -I/opt/local/include -Wall -Wnon-virtual-dtor -Wno-mismatched-tags -I../libs/clipper -I../libs/variant/include -I../libs/xxHash  -I/opt/local/include/freetype2 -I/opt/local/include/libpng16    -I../libs/brotli/include -I../libs/woff2/include -pipe -Os -stdlib=libc++ -arch x86_64 -MT InputBuffer.o -MD -MP -MF $depbase.Tpo -c -o InputBuffer.o InputBuffer.cpp &&\
811:info:build     mv -f $depbase.Tpo $depbase.Po
812:info:build depbase=`echo InputReader.o | sed 's|[^/]*$|.deps/&|;s|\.o$||'`;\
813:info:build     /usr/bin/clang++ -std=gnu++11 -DHAVE_CONFIG_H -I. -I..   -I/opt/local/include -Wall -Wnon-virtual-dtor -Wno-mismatched-tags -I../libs/clipper -I../libs/variant/include -I../libs/xxHash  -I/opt/local/include/freetype2 -I/opt/local/include/libpng16    -I../libs/brotli/include -I../libs/woff2/include -pipe -Os -stdlib=libc++ -arch x86_64 -MT InputReader.o -MD -MP -MF $depbase.Tpo -c -o InputReader.o InputReader.cpp &&\
814:info:build     mv -f $depbase.Tpo $depbase.Po
815:info:build depbase=`echo JFM.o | sed 's|[^/]*$|.deps/&|;s|\.o$||'`;\
816:info:build     /usr/bin/clang++ -std=gnu++11 -DHAVE_CONFIG_H -I. -I..   -I/opt/local/include -Wall -Wnon-virtual-dtor -Wno-mismatched-tags -I../libs/clipper -I../libs/variant/include -I../libs/xxHash  -I/opt/local/include/freetype2 -I/opt/local/include/libpng16    -I../libs/brotli/include -I../libs/woff2/include -pipe -Os -stdlib=libc++ -arch x86_64 -MT JFM.o -MD -MP -MF $depbase.Tpo -c -o JFM.o JFM.cpp &&\
817:info:build     mv -f $depbase.Tpo $depbase.Po
818:info:build depbase=`echo Length.o | sed 's|[^/]*$|.deps/&|;s|\.o$||'`;\
819:info:build     /usr/bin/clang++ -std=gnu++11 -DHAVE_CONFIG_H -I. -I..   -I/opt/local/include -Wall -Wnon-virtual-dtor -Wno-mismatched-tags -I../libs/clipper -I../libs/variant/include -I../libs/xxHash  -I/opt/local/include/freetype2 -I/opt/local/include/libpng16    -I../libs/brotli/include -I../libs/woff2/include -pipe -Os -stdlib=libc++ -arch x86_64 -MT Length.o -MD -MP -MF $depbase.Tpo -c -o Length.o Length.cpp &&\
820:info:build     mv -f $depbase.Tpo $depbase.Po
821:info:build depbase=`echo MapLine.o | sed 's|[^/]*$|.deps/&|;s|\.o$||'`;\
822:info:build     /usr/bin/clang++ -std=gnu++11 -DHAVE_CONFIG_H -I. -I..   -I/opt/local/include -Wall -Wnon-virtual-dtor -Wno-mismatched-tags -I../libs/clipper -I../libs/variant/include -I../libs/xxHash  -I/opt/local/include/freetype2 -I/opt/local/include/libpng16    -I../libs/brotli/include -I../libs/woff2/include -pipe -Os -stdlib=libc++ -arch x86_64 -MT MapLine.o -MD -MP -MF $depbase.Tpo -c -o MapLine.o MapLine.cpp &&\
823:info:build     mv -f $depbase.Tpo $depbase.Po
824:info:build depbase=`echo Matrix.o | sed 's|[^/]*$|.deps/&|;s|\.o$||'`;\
825:info:build     /usr/bin/clang++ -std=gnu++11 -DHAVE_CONFIG_H -I. -I..   -I/opt/local/include -Wall -Wnon-virtual-dtor -Wno-mismatched-tags -I../libs/clipper -I../libs/variant/include -I../libs/xxHash  -I/opt/local/include/freetype2 -I/opt/local/include/libpng16    -I../libs/brotli/include -I../libs/woff2/include -pipe -Os -stdlib=libc++ -arch x86_64 -MT Matrix.o -MD -MP -MF $depbase.Tpo -c -o Matrix.o Matrix.cpp &&\
826:info:build     mv -f $depbase.Tpo $depbase.Po
827:info:build depbase=`echo Message.o | sed 's|[^/]*$|.deps/&|;s|\.o$||'`;\
828:info:build     /usr/bin/clang++ -std=gnu++11 -DHAVE_CONFIG_H -I. -I..   -I/opt/local/include -Wall -Wnon-virtual-dtor -Wno-mismatched-tags -I../libs/clipper -I../libs/variant/include -I../libs/xxHash  -I/opt/local/include/freetype2 -I/opt/local/include/libpng16    -I../libs/brotli/include -I../libs/woff2/include -pipe -Os -stdlib=libc++ -arch x86_64 -MT Message.o -MD -MP -MF $depbase.Tpo -c -o Message.o Message.cpp &&\
829:info:build     mv -f $depbase.Tpo $depbase.Po
830:info:build depbase=`echo MetafontWrapper.o | sed 's|[^/]*$|.deps/&|;s|\.o$||'`;\
831:info:build     /usr/bin/clang++ -std=gnu++11 -DHAVE_CONFIG_H -I. -I..   -I/opt/local/include -Wall -Wnon-virtual-dtor -Wno-mismatched-tags -I../libs/clipper -I../libs/variant/include -I../libs/xxHash  -I/opt/local/include/freetype2 -I/opt/local/include/libpng16    -I../libs/brotli/include -I../libs/woff2/include -pipe -Os -stdlib=libc++ -arch x86_64 -MT MetafontWrapper.o -MD -MP -MF $depbase.Tpo -c -o MetafontWrapper.o MetafontWrapper.cpp &&\
832:info:build     mv -f $depbase.Tpo $depbase.Po
833:info:build depbase=`echo NoPsSpecialHandler.o | sed 's|[^/]*$|.deps/&|;s|\.o$||'`;\
834:info:build     /usr/bin/clang++ -std=gnu++11 -DHAVE_CONFIG_H -I. -I..   -I/opt/local/include -Wall -Wnon-virtual-dtor -Wno-mismatched-tags -I../libs/clipper -I../libs/variant/include -I../libs/xxHash  -I/opt/local/include/freetype2 -I/opt/local/include/libpng16    -I../libs/brotli/include -I../libs/woff2/include -pipe -Os -stdlib=libc++ -arch x86_64 -MT NoPsSpecialHandler.o -MD -MP -MF $depbase.Tpo -c -o NoPsSpecialHandler.o NoPsSpecialHandler.cpp &&\
835:info:build     mv -f $depbase.Tpo $depbase.Po
836:info:build depbase=`echo PageRanges.o | sed 's|[^/]*$|.deps/&|;s|\.o$||'`;\
837:info:build     /usr/bin/clang++ -std=gnu++11 -DHAVE_CONFIG_H -I. -I..   -I/opt/local/include -Wall -Wnon-virtual-dtor -Wno-mismatched-tags -I../libs/clipper -I../libs/variant/include -I../libs/xxHash  -I/opt/local/include/freetype2 -I/opt/local/include/libpng16    -I../libs/brotli/include -I../libs/woff2/include -pipe -Os -stdlib=libc++ -arch x86_64 -MT PageRanges.o -MD -MP -MF $depbase.Tpo -c -o PageRanges.o PageRanges.cpp &&\
838:info:build     mv -f $depbase.Tpo $depbase.Po
839:info:build depbase=`echo PageSize.o | sed 's|[^/]*$|.deps/&|;s|\.o$||'`;\
840:info:build     /usr/bin/clang++ -std=gnu++11 -DHAVE_CONFIG_H -I. -I..   -I/opt/local/include -Wall -Wnon-virtual-dtor -Wno-mismatched-tags -I../libs/clipper -I../libs/variant/include -I../libs/xxHash  -I/opt/local/include/freetype2 -I/opt/local/include/libpng16    -I../libs/brotli/include -I../libs/woff2/include -pipe -Os -stdlib=libc++ -arch x86_64 -MT PageSize.o -MD -MP -MF $depbase.Tpo -c -o PageSize.o PageSize.cpp &&\
841:info:build     mv -f $depbase.Tpo $depbase.Po
842:info:build depbase=`echo PapersizeSpecialHandler.o | sed 's|[^/]*$|.deps/&|;s|\.o$||'`;\
843:info:build     /usr/bin/clang++ -std=gnu++11 -DHAVE_CONFIG_H -I. -I..   -I/opt/local/include -Wall -Wnon-virtual-dtor -Wno-mismatched-tags -I../libs/clipper -I../libs/variant/include -I../libs/xxHash  -I/opt/local/include/freetype2 -I/opt/local/include/libpng16    -I../libs/brotli/include -I../libs/woff2/include -pipe -Os -stdlib=libc++ -arch x86_64 -MT PapersizeSpecialHandler.o -MD -MP -MF $depbase.Tpo -c -o PapersizeSpecialHandler.o PapersizeSpecialHandler.cpp &&\
844:info:build     mv -f $depbase.Tpo $depbase.Po
845:info:build depbase=`echo PathClipper.o | sed 's|[^/]*$|.deps/&|;s|\.o$||'`;\
846:info:build     /usr/bin/clang++ -std=gnu++11 -DHAVE_CONFIG_H -I. -I..   -I/opt/local/include -Wall -Wnon-virtual-dtor -Wno-mismatched-tags -I../libs/clipper -I../libs/variant/include -I../libs/xxHash  -I/opt/local/include/freetype2 -I/opt/local/include/libpng16    -I../libs/brotli/include -I../libs/woff2/include -pipe -Os -stdlib=libc++ -arch x86_64 -MT PathClipper.o -MD -MP -MF $depbase.Tpo -c -o PathClipper.o PathClipper.cpp &&\
847:info:build     mv -f $depbase.Tpo $depbase.Po
848:info:build depbase=`echo PDFParser.o | sed 's|[^/]*$|.deps/&|;s|\.o$||'`;\
849:info:build     /usr/bin/clang++ -std=gnu++11 -DHAVE_CONFIG_H -I. -I..   -I/opt/local/include -Wall -Wnon-virtual-dtor -Wno-mismatched-tags -I../libs/clipper -I../libs/variant/include -I../libs/xxHash  -I/opt/local/include/freetype2 -I/opt/local/include/libpng16    -I../libs/brotli/include -I../libs/woff2/include -pipe -Os -stdlib=libc++ -arch x86_64 -MT PDFParser.o -MD -MP -MF $depbase.Tpo -c -o PDFParser.o PDFParser.cpp &&\
850:info:build     mv -f $depbase.Tpo $depbase.Po
851:info:build depbase=`echo PdfSpecialHandler.o | sed 's|[^/]*$|.deps/&|;s|\.o$||'`;\
852:info:build     /usr/bin/clang++ -std=gnu++11 -DHAVE_CONFIG_H -I. -I..   -I/opt/local/include -Wall -Wnon-virtual-dtor -Wno-mismatched-tags -I../libs/clipper -I../libs/variant/include -I../libs/xxHash  -I/opt/local/include/freetype2 -I/opt/local/include/libpng16    -I../libs/brotli/include -I../libs/woff2/include -pipe -Os -stdlib=libc++ -arch x86_64 -MT PdfSpecialHandler.o -MD -MP -MF $depbase.Tpo -c -o PdfSpecialHandler.o PdfSpecialHandler.cpp &&\
853:info:build     mv -f $depbase.Tpo $depbase.Po
854:info:build depbase=`echo PreScanDVIReader.o | sed 's|[^/]*$|.deps/&|;s|\.o$||'`;\
855:info:build     /usr/bin/clang++ -std=gnu++11 -DHAVE_CONFIG_H -I. -I..   -I/opt/local/include -Wall -Wnon-virtual-dtor -Wno-mismatched-tags -I../libs/clipper -I../libs/variant/include -I../libs/xxHash  -I/opt/local/include/freetype2 -I/opt/local/include/libpng16    -I../libs/brotli/include -I../libs/woff2/include -pipe -Os -stdlib=libc++ -arch x86_64 -MT PreScanDVIReader.o -MD -MP -MF $depbase.Tpo -c -o PreScanDVIReader.o PreScanDVIReader.cpp &&\
856:info:build     mv -f $depbase.Tpo $depbase.Po
857:info:build depbase=`echo Process.o | sed 's|[^/]*$|.deps/&|;s|\.o$||'`;\
858:info:build     /usr/bin/clang++ -std=gnu++11 -DHAVE_CONFIG_H -I. -I..   -I/opt/local/include -Wall -Wnon-virtual-dtor -Wno-mismatched-tags -I../libs/clipper -I../libs/variant/include -I../libs/xxHash  -I/opt/local/include/freetype2 -I/opt/local/include/libpng16    -I../libs/brotli/include -I../libs/woff2/include -pipe -Os -stdlib=libc++ -arch x86_64 -MT Process.o -MD -MP -MF $depbase.Tpo -c -o Process.o Process.cpp &&\
859:info:build     mv -f $depbase.Tpo $depbase.Po
860:info:build if test -f psdefs.ps; then \
861:info:build             ps2c PSInterpreter::PSDEFS psdefs.ps >psdefs.cpp; \
862:info:build     fi
863:info:build depbase=`echo PSInterpreter.o | sed 's|[^/]*$|.deps/&|;s|\.o$||'`;\
864:info:build     /usr/bin/clang++ -std=gnu++11 -DHAVE_CONFIG_H -I. -I..   -I/opt/local/include -Wall -Wnon-virtual-dtor -Wno-mismatched-tags -I../libs/clipper -I../libs/variant/include -I../libs/xxHash  -I/opt/local/include/freetype2 -I/opt/local/include/libpng16    -I../libs/brotli/include -I../libs/woff2/include -pipe -Os -stdlib=libc++ -arch x86_64 -MT PSInterpreter.o -MD -MP -MF $depbase.Tpo -c -o PSInterpreter.o PSInterpreter.cpp &&\
865:info:build     mv -f $depbase.Tpo $depbase.Po
866:info:build depbase=`echo PSPattern.o | sed 's|[^/]*$|.deps/&|;s|\.o$||'`;\
867:info:build     /usr/bin/clang++ -std=gnu++11 -DHAVE_CONFIG_H -I. -I..   -I/opt/local/include -Wall -Wnon-virtual-dtor -Wno-mismatched-tags -I../libs/clipper -I../libs/variant/include -I../libs/xxHash  -I/opt/local/include/freetype2 -I/opt/local/include/libpng16    -I../libs/brotli/include -I../libs/woff2/include -pipe -Os -stdlib=libc++ -arch x86_64 -MT PSPattern.o -MD -MP -MF $depbase.Tpo -c -o PSPattern.o PSPattern.cpp &&\
868:info:build     mv -f $depbase.Tpo $depbase.Po
869:info:build depbase=`echo PSPreviewFilter.o | sed 's|[^/]*$|.deps/&|;s|\.o$||'`;\
870:info:build     /usr/bin/clang++ -std=gnu++11 -DHAVE_CONFIG_H -I. -I..   -I/opt/local/include -Wall -Wnon-virtual-dtor -Wno-mismatched-tags -I../libs/clipper -I../libs/variant/include -I../libs/xxHash  -I/opt/local/include/freetype2 -I/opt/local/include/libpng16    -I../libs/brotli/include -I../libs/woff2/include -pipe -Os -stdlib=libc++ -arch x86_64 -MT PSPreviewFilter.o -MD -MP -MF $depbase.Tpo -c -o PSPreviewFilter.o PSPreviewFilter.cpp &&\
871:info:build     mv -f $depbase.Tpo $depbase.Po
872:info:build depbase=`echo PsSpecialHandler.o | sed 's|[^/]*$|.deps/&|;s|\.o$||'`;\
873:info:build     /usr/bin/clang++ -std=gnu++11 -DHAVE_CONFIG_H -I. -I..   -I/opt/local/include -Wall -Wnon-virtual-dtor -Wno-mismatched-tags -I../libs/clipper -I../libs/variant/include -I../libs/xxHash  -I/opt/local/include/freetype2 -I/opt/local/include/libpng16    -I../libs/brotli/include -I../libs/woff2/include -pipe -Os -stdlib=libc++ -arch x86_64 -MT PsSpecialHandler.o -MD -MP -MF $depbase.Tpo -c -o PsSpecialHandler.o PsSpecialHandler.cpp &&\
874:info:build     mv -f $depbase.Tpo $depbase.Po
875:info:build depbase=`echo RangeMap.o | sed 's|[^/]*$|.deps/&|;s|\.o$||'`;\
876:info:build     /usr/bin/clang++ -std=gnu++11 -DHAVE_CONFIG_H -I. -I..   -I/opt/local/include -Wall -Wnon-virtual-dtor -Wno-mismatched-tags -I../libs/clipper -I../libs/variant/include -I../libs/xxHash  -I/opt/local/include/freetype2 -I/opt/local/include/libpng16    -I../libs/brotli/include -I../libs/woff2/include -pipe -Os -stdlib=libc++ -arch x86_64 -MT RangeMap.o -MD -MP -MF $depbase.Tpo -c -o RangeMap.o RangeMap.cpp &&\
877:info:build     mv -f $depbase.Tpo $depbase.Po
878:info:build depbase=`echo ShadingPatch.o | sed 's|[^/]*$|.deps/&|;s|\.o$||'`;\
879:info:build     /usr/bin/clang++ -std=gnu++11 -DHAVE_CONFIG_H -I. -I..   -I/opt/local/include -Wall -Wnon-virtual-dtor -Wno-mismatched-tags -I../libs/clipper -I../libs/variant/include -I../libs/xxHash  -I/opt/local/include/freetype2 -I/opt/local/include/libpng16    -I../libs/brotli/include -I../libs/woff2/include -pipe -Os -stdlib=libc++ -arch x86_64 -MT ShadingPatch.o -MD -MP -MF $depbase.Tpo -c -o ShadingPatch.o ShadingPatch.cpp &&\
880:info:build     mv -f $depbase.Tpo $depbase.Po
881:info:build depbase=`echo SignalHandler.o | sed 's|[^/]*$|.deps/&|;s|\.o$||'`;\
882:info:build     /usr/bin/clang++ -std=gnu++11 -DHAVE_CONFIG_H -I. -I..   -I/opt/local/include -Wall -Wnon-virtual-dtor -Wno-mismatched-tags -I../libs/clipper -I../libs/variant/include -I../libs/xxHash  -I/opt/local/include/freetype2 -I/opt/local/include/libpng16    -I../libs/brotli/include -I../libs/woff2/include -pipe -Os -stdlib=libc++ -arch x86_64 -MT SignalHandler.o -MD -MP -MF $depbase.Tpo -c -o SignalHandler.o SignalHandler.cpp &&\
883:info:build     mv -f $depbase.Tpo $depbase.Po
884:info:build depbase=`echo SpecialManager.o | sed 's|[^/]*$|.deps/&|;s|\.o$||'`;\
885:info:build     /usr/bin/clang++ -std=gnu++11 -DHAVE_CONFIG_H -I. -I..   -I/opt/local/include -Wall -Wnon-virtual-dtor -Wno-mismatched-tags -I../libs/clipper -I../libs/variant/include -I../libs/xxHash  -I/opt/local/include/freetype2 -I/opt/local/include/libpng16    -I../libs/brotli/include -I../libs/woff2/include -pipe -Os -stdlib=libc++ -arch x86_64 -MT SpecialManager.o -MD -MP -MF $depbase.Tpo -c -o SpecialManager.o SpecialManager.cpp &&\
886:info:build     mv -f $depbase.Tpo $depbase.Po
887:info:build depbase=`echo StreamReader.o | sed 's|[^/]*$|.deps/&|;s|\.o$||'`;\
888:info:build     /usr/bin/clang++ -std=gnu++11 -DHAVE_CONFIG_H -I. -I..   -I/opt/local/include -Wall -Wnon-virtual-dtor -Wno-mismatched-tags -I../libs/clipper -I../libs/variant/include -I../libs/xxHash  -I/opt/local/include/freetype2 -I/opt/local/include/libpng16    -I../libs/brotli/include -I../libs/woff2/include -pipe -Os -stdlib=libc++ -arch x86_64 -MT StreamReader.o -MD -MP -MF $depbase.Tpo -c -o StreamReader.o StreamReader.cpp &&\
889:info:build     mv -f $depbase.Tpo $depbase.Po
890:info:build depbase=`echo StreamWriter.o | sed 's|[^/]*$|.deps/&|;s|\.o$||'`;\
891:info:build     /usr/bin/clang++ -std=gnu++11 -DHAVE_CONFIG_H -I. -I..   -I/opt/local/include -Wall -Wnon-virtual-dtor -Wno-mismatched-tags -I../libs/clipper -I../libs/variant/include -I../libs/xxHash  -I/opt/local/include/freetype2 -I/opt/local/include/libpng16    -I../libs/brotli/include -I../libs/woff2/include -pipe -Os -stdlib=libc++ -arch x86_64 -MT StreamWriter.o -MD -MP -MF $depbase.Tpo -c -o StreamWriter.o StreamWriter.cpp &&\
892:info:build     mv -f $depbase.Tpo $depbase.Po
893:info:build depbase=`echo Subfont.o | sed 's|[^/]*$|.deps/&|;s|\.o$||'`;\
894:info:build     /usr/bin/clang++ -std=gnu++11 -DHAVE_CONFIG_H -I. -I..   -I/opt/local/include -Wall -Wnon-virtual-dtor -Wno-mismatched-tags -I../libs/clipper -I../libs/variant/include -I../libs/xxHash  -I/opt/local/include/freetype2 -I/opt/local/include/libpng16    -I../libs/brotli/include -I../libs/woff2/include -pipe -Os -stdlib=libc++ -arch x86_64 -MT Subfont.o -MD -MP -MF $depbase.Tpo -c -o Subfont.o Subfont.cpp &&\
895:info:build     mv -f $depbase.Tpo $depbase.Po
896:info:build depbase=`echo SVGCharHandler.o | sed 's|[^/]*$|.deps/&|;s|\.o$||'`;\
897:info:build     /usr/bin/clang++ -std=gnu++11 -DHAVE_CONFIG_H -I. -I..   -I/opt/local/include -Wall -Wnon-virtual-dtor -Wno-mismatched-tags -I../libs/clipper -I../libs/variant/include -I../libs/xxHash  -I/opt/local/include/freetype2 -I/opt/local/include/libpng16    -I../libs/brotli/include -I../libs/woff2/include -pipe -Os -stdlib=libc++ -arch x86_64 -MT SVGCharHandler.o -MD -MP -MF $depbase.Tpo -c -o SVGCharHandler.o SVGCharHandler.cpp &&\
898:info:build     mv -f $depbase.Tpo $depbase.Po
899:info:build depbase=`echo SVGCharHandlerFactory.o | sed 's|[^/]*$|.deps/&|;s|\.o$||'`;\
900:info:build     /usr/bin/clang++ -std=gnu++11 -DHAVE_CONFIG_H -I. -I..   -I/opt/local/include -Wall -Wnon-virtual-dtor -Wno-mismatched-tags -I../libs/clipper -I../libs/variant/include -I../libs/xxHash  -I/opt/local/include/freetype2 -I/opt/local/include/libpng16    -I../libs/brotli/include -I../libs/woff2/include -pipe -Os -stdlib=libc++ -arch x86_64 -MT SVGCharHandlerFactory.o -MD -MP -MF $depbase.Tpo -c -o SVGCharHandlerFactory.o SVGCharHandlerFactory.cpp &&\
901:info:build     mv -f $depbase.Tpo $depbase.Po
902:info:build depbase=`echo SVGCharPathHandler.o | sed 's|[^/]*$|.deps/&|;s|\.o$||'`;\
903:info:build     /usr/bin/clang++ -std=gnu++11 -DHAVE_CONFIG_H -I. -I..   -I/opt/local/include -Wall -Wnon-virtual-dtor -Wno-mismatched-tags -I../libs/clipper -I../libs/variant/include -I../libs/xxHash  -I/opt/local/include/freetype2 -I/opt/local/include/libpng16    -I../libs/brotli/include -I../libs/woff2/include -pipe -Os -stdlib=libc++ -arch x86_64 -MT SVGCharPathHandler.o -MD -MP -MF $depbase.Tpo -c -o SVGCharPathHandler.o SVGCharPathHandler.cpp &&\
904:info:build     mv -f $depbase.Tpo $depbase.Po
905:info:build depbase=`echo SVGCharTspanTextHandler.o | sed 's|[^/]*$|.deps/&|;s|\.o$||'`;\
906:info:build     /usr/bin/clang++ -std=gnu++11 -DHAVE_CONFIG_H -I. -I..   -I/opt/local/include -Wall -Wnon-virtual-dtor -Wno-mismatched-tags -I../libs/clipper -I../libs/variant/include -I../libs/xxHash  -I/opt/local/include/freetype2 -I/opt/local/include/libpng16    -I../libs/brotli/include -I../libs/woff2/include -pipe -Os -stdlib=libc++ -arch x86_64 -MT SVGCharTspanTextHandler.o -MD -MP -MF $depbase.Tpo -c -o SVGCharTspanTextHandler.o SVGCharTspanTextHandler.cpp &&\
907:info:build     mv -f $depbase.Tpo $depbase.Po
908:info:build depbase=`echo SVGOutput.o | sed 's|[^/]*$|.deps/&|;s|\.o$||'`;\
909:info:build     /usr/bin/clang++ -std=gnu++11 -DHAVE_CONFIG_H -I. -I..   -I/opt/local/include -Wall -Wnon-virtual-dtor -Wno-mismatched-tags -I../libs/clipper -I../libs/variant/include -I../libs/xxHash  -I/opt/local/include/freetype2 -I/opt/local/include/libpng16    -I../libs/brotli/include -I../libs/woff2/include -pipe -Os -stdlib=libc++ -arch x86_64 -MT SVGOutput.o -MD -MP -MF $depbase.Tpo -c -o SVGOutput.o SVGOutput.cpp &&\
910:info:build     mv -f $depbase.Tpo $depbase.Po
911:info:build depbase=`echo SVGSingleCharTextHandler.o | sed 's|[^/]*$|.deps/&|;s|\.o$||'`;\
912:info:build     /usr/bin/clang++ -std=gnu++11 -DHAVE_CONFIG_H -I. -I..   -I/opt/local/include -Wall -Wnon-virtual-dtor -Wno-mismatched-tags -I../libs/clipper -I../libs/variant/include -I../libs/xxHash  -I/opt/local/include/freetype2 -I/opt/local/include/libpng16    -I../libs/brotli/include -I../libs/woff2/include -pipe -Os -stdlib=libc++ -arch x86_64 -MT SVGSingleCharTextHandler.o -MD -MP -MF $depbase.Tpo -c -o SVGSingleCharTextHandler.o SVGSingleCharTextHandler.cpp &&\
913:info:build     mv -f $depbase.Tpo $depbase.Po
914:info:build depbase=`echo SVGTree.o | sed 's|[^/]*$|.deps/&|;s|\.o$||'`;\
915:info:build     /usr/bin/clang++ -std=gnu++11 -DHAVE_CONFIG_H -I. -I..   -I/opt/local/include -Wall -Wnon-virtual-dtor -Wno-mismatched-tags -I../libs/clipper -I../libs/variant/include -I../libs/xxHash  -I/opt/local/include/freetype2 -I/opt/local/include/libpng16    -I../libs/brotli/include -I../libs/woff2/include -pipe -Os -stdlib=libc++ -arch x86_64 -MT SVGTree.o -MD -MP -MF $depbase.Tpo -c -o SVGTree.o SVGTree.cpp &&\
916:info:build     mv -f $depbase.Tpo $depbase.Po
917:info:build depbase=`echo System.o | sed 's|[^/]*$|.deps/&|;s|\.o$||'`;\
918:info:build     /usr/bin/clang++ -std=gnu++11 -DHAVE_CONFIG_H -I. -I..   -I/opt/local/include -Wall -Wnon-virtual-dtor -Wno-mismatched-tags -I../libs/clipper -I../libs/variant/include -I../libs/xxHash  -I/opt/local/include/freetype2 -I/opt/local/include/libpng16    -I../libs/brotli/include -I../libs/woff2/include -pipe -Os -stdlib=libc++ -arch x86_64 -MT System.o -MD -MP -MF $depbase.Tpo -c -o System.o System.cpp &&\
919:info:build     mv -f $depbase.Tpo $depbase.Po
920:info:build depbase=`echo TensorProductPatch.o | sed 's|[^/]*$|.deps/&|;s|\.o$||'`;\
921:info:build     /usr/bin/clang++ -std=gnu++11 -DHAVE_CONFIG_H -I. -I..   -I/opt/local/include -Wall -Wnon-virtual-dtor -Wno-mismatched-tags -I../libs/clipper -I../libs/variant/include -I../libs/xxHash  -I/opt/local/include/freetype2 -I/opt/local/include/libpng16    -I../libs/brotli/include -I../libs/woff2/include -pipe -Os -stdlib=libc++ -arch x86_64 -MT TensorProductPatch.o -MD -MP -MF $depbase.Tpo -c -o TensorProductPatch.o TensorProductPatch.cpp &&\
922:info:build     mv -f $depbase.Tpo $depbase.Po
923:info:build depbase=`echo Terminal.o | sed 's|[^/]*$|.deps/&|;s|\.o$||'`;\
924:info:build     /usr/bin/clang++ -std=gnu++11 -DHAVE_CONFIG_H -I. -I..   -I/opt/local/include -Wall -Wnon-virtual-dtor -Wno-mismatched-tags -I../libs/clipper -I../libs/variant/include -I../libs/xxHash  -I/opt/local/include/freetype2 -I/opt/local/include/libpng16    -I../libs/brotli/include -I../libs/woff2/include -pipe -Os -stdlib=libc++ -arch x86_64 -MT Terminal.o -MD -MP -MF $depbase.Tpo -c -o Terminal.o Terminal.cpp &&\
925:info:build     mv -f $depbase.Tpo $depbase.Po
926:info:build depbase=`echo TFM.o | sed 's|[^/]*$|.deps/&|;s|\.o$||'`;\
927:info:build     /usr/bin/clang++ -std=gnu++11 -DHAVE_CONFIG_H -I. -I..   -I/opt/local/include -Wall -Wnon-virtual-dtor -Wno-mismatched-tags -I../libs/clipper -I../libs/variant/include -I../libs/xxHash  -I/opt/local/include/freetype2 -I/opt/local/include/libpng16    -I../libs/brotli/include -I../libs/woff2/include -pipe -Os -stdlib=libc++ -arch x86_64 -MT TFM.o -MD -MP -MF $depbase.Tpo -c -o TFM.o TFM.cpp &&\
928:info:build     mv -f $depbase.Tpo $depbase.Po
929:info:build depbase=`echo ToUnicodeMap.o | sed 's|[^/]*$|.deps/&|;s|\.o$||'`;\
930:info:build     /usr/bin/clang++ -std=gnu++11 -DHAVE_CONFIG_H -I. -I..   -I/opt/local/include -Wall -Wnon-virtual-dtor -Wno-mismatched-tags -I../libs/clipper -I../libs/variant/include -I../libs/xxHash  -I/opt/local/include/freetype2 -I/opt/local/include/libpng16    -I../libs/brotli/include -I../libs/woff2/include -pipe -Os -stdlib=libc++ -arch x86_64 -MT ToUnicodeMap.o -MD -MP -MF $depbase.Tpo -c -o ToUnicodeMap.o ToUnicodeMap.cpp &&\
931:info:build     mv -f $depbase.Tpo $depbase.Po
932:info:build depbase=`echo TpicSpecialHandler.o | sed 's|[^/]*$|.deps/&|;s|\.o$||'`;\
933:info:build     /usr/bin/clang++ -std=gnu++11 -DHAVE_CONFIG_H -I. -I..   -I/opt/local/include -Wall -Wnon-virtual-dtor -Wno-mismatched-tags -I../libs/clipper -I../libs/variant/include -I../libs/xxHash  -I/opt/local/include/freetype2 -I/opt/local/include/libpng16    -I../libs/brotli/include -I../libs/woff2/include -pipe -Os -stdlib=libc++ -arch x86_64 -MT TpicSpecialHandler.o -MD -MP -MF $depbase.Tpo -c -o TpicSpecialHandler.o TpicSpecialHandler.cpp &&\
934:info:build     mv -f $depbase.Tpo $depbase.Po
935:info:build depbase=`echo TriangularPatch.o | sed 's|[^/]*$|.deps/&|;s|\.o$||'`;\
936:info:build     /usr/bin/clang++ -std=gnu++11 -DHAVE_CONFIG_H -I. -I..   -I/opt/local/include -Wall -Wnon-virtual-dtor -Wno-mismatched-tags -I../libs/clipper -I../libs/variant/include -I../libs/xxHash  -I/opt/local/include/freetype2 -I/opt/local/include/libpng16    -I../libs/brotli/include -I../libs/woff2/include -pipe -Os -stdlib=libc++ -arch x86_64 -MT TriangularPatch.o -MD -MP -MF $depbase.Tpo -c -o TriangularPatch.o TriangularPatch.cpp &&\
937:info:build     mv -f $depbase.Tpo $depbase.Po
938:info:build depbase=`echo TrueTypeFont.o | sed 's|[^/]*$|.deps/&|;s|\.o$||'`;\
939:info:build     /usr/bin/clang++ -std=gnu++11 -DHAVE_CONFIG_H -I. -I..   -I/opt/local/include -Wall -Wnon-virtual-dtor -Wno-mismatched-tags -I../libs/clipper -I../libs/variant/include -I../libs/xxHash  -I/opt/local/include/freetype2 -I/opt/local/include/libpng16    -I../libs/brotli/include -I../libs/woff2/include -pipe -Os -stdlib=libc++ -arch x86_64 -MT TrueTypeFont.o -MD -MP -MF $depbase.Tpo -c -o TrueTypeFont.o TrueTypeFont.cpp &&\
940:info:build     mv -f $depbase.Tpo $depbase.Po
941:info:build depbase=`echo TTFAutohint.o | sed 's|[^/]*$|.deps/&|;s|\.o$||'`;\
942:info:build     /usr/bin/clang++ -std=gnu++11 -DHAVE_CONFIG_H -I. -I..   -I/opt/local/include -Wall -Wnon-virtual-dtor -Wno-mismatched-tags -I../libs/clipper -I../libs/variant/include -I../libs/xxHash  -I/opt/local/include/freetype2 -I/opt/local/include/libpng16    -I../libs/brotli/include -I../libs/woff2/include -pipe -Os -stdlib=libc++ -arch x86_64 -MT TTFAutohint.o -MD -MP -MF $depbase.Tpo -c -o TTFAutohint.o TTFAutohint.cpp &&\
943:info:build     mv -f $depbase.Tpo $depbase.Po
944:info:build depbase=`echo Unicode.o | sed 's|[^/]*$|.deps/&|;s|\.o$||'`;\
945:info:build     /usr/bin/clang++ -std=gnu++11 -DHAVE_CONFIG_H -I. -I..   -I/opt/local/include -Wall -Wnon-virtual-dtor -Wno-mismatched-tags -I../libs/clipper -I../libs/variant/include -I../libs/xxHash  -I/opt/local/include/freetype2 -I/opt/local/include/libpng16    -I../libs/brotli/include -I../libs/woff2/include -pipe -Os -stdlib=libc++ -arch x86_64 -MT Unicode.o -MD -MP -MF $depbase.Tpo -c -o Unicode.o Unicode.cpp &&\
946:info:build     mv -f $depbase.Tpo $depbase.Po
947:info:build depbase=`echo utility.o | sed 's|[^/]*$|.deps/&|;s|\.o$||'`;\
948:info:build     /usr/bin/clang++ -std=gnu++11 -DHAVE_CONFIG_H -I. -I..   -I/opt/local/include -Wall -Wnon-virtual-dtor -Wno-mismatched-tags -I../libs/clipper -I../libs/variant/include -I../libs/xxHash  -I/opt/local/include/freetype2 -I/opt/local/include/libpng16    -I../libs/brotli/include -I../libs/woff2/include -pipe -Os -stdlib=libc++ -arch x86_64 -MT utility.o -MD -MP -MF $depbase.Tpo -c -o utility.o utility.cpp &&\
949:info:build     mv -f $depbase.Tpo $depbase.Po
950:info:build depbase=`echo VFReader.o | sed 's|[^/]*$|.deps/&|;s|\.o$||'`;\
951:info:build     /usr/bin/clang++ -std=gnu++11 -DHAVE_CONFIG_H -I. -I..   -I/opt/local/include -Wall -Wnon-virtual-dtor -Wno-mismatched-tags -I../libs/clipper -I../libs/variant/include -I../libs/xxHash  -I/opt/local/include/freetype2 -I/opt/local/include/libpng16    -I../libs/brotli/include -I../libs/woff2/include -pipe -Os -stdlib=libc++ -arch x86_64 -MT VFReader.o -MD -MP -MF $depbase.Tpo -c -o VFReader.o VFReader.cpp &&\
952:info:build     mv -f $depbase.Tpo $depbase.Po
953:info:build depbase=`echo XMLDocument.o | sed 's|[^/]*$|.deps/&|;s|\.o$||'`;\
954:info:build     /usr/bin/clang++ -std=gnu++11 -DHAVE_CONFIG_H -I. -I..   -I/opt/local/include -Wall -Wnon-virtual-dtor -Wno-mismatched-tags -I../libs/clipper -I../libs/variant/include -I../libs/xxHash  -I/opt/local/include/freetype2 -I/opt/local/include/libpng16    -I../libs/brotli/include -I../libs/woff2/include -pipe -Os -stdlib=libc++ -arch x86_64 -MT XMLDocument.o -MD -MP -MF $depbase.Tpo -c -o XMLDocument.o XMLDocument.cpp &&\
955:info:build     mv -f $depbase.Tpo $depbase.Po
956:info:build depbase=`echo XMLNode.o | sed 's|[^/]*$|.deps/&|;s|\.o$||'`;\
957:info:build     /usr/bin/clang++ -std=gnu++11 -DHAVE_CONFIG_H -I. -I..   -I/opt/local/include -Wall -Wnon-virtual-dtor -Wno-mismatched-tags -I../libs/clipper -I../libs/variant/include -I../libs/xxHash  -I/opt/local/include/freetype2 -I/opt/local/include/libpng16    -I../libs/brotli/include -I../libs/woff2/include -pipe -Os -stdlib=libc++ -arch x86_64 -MT XMLNode.o -MD -MP -MF $depbase.Tpo -c -o XMLNode.o XMLNode.cpp &&\
958:info:build     mv -f $depbase.Tpo $depbase.Po
959:info:build depbase=`echo XMLString.o | sed 's|[^/]*$|.deps/&|;s|\.o$||'`;\
960:info:build     /usr/bin/clang++ -std=gnu++11 -DHAVE_CONFIG_H -I. -I..   -I/opt/local/include -Wall -Wnon-virtual-dtor -Wno-mismatched-tags -I../libs/clipper -I../libs/variant/include -I../libs/xxHash  -I/opt/local/include/freetype2 -I/opt/local/include/libpng16    -I../libs/brotli/include -I../libs/woff2/include -pipe -Os -stdlib=libc++ -arch x86_64 -MT XMLString.o -MD -MP -MF $depbase.Tpo -c -o XMLString.o XMLString.cpp &&\
961:info:build     mv -f $depbase.Tpo $depbase.Po
962:info:build depbase=`echo ffwrapper.o | sed 's|[^/]*$|.deps/&|;s|\.o$||'`;\
963:info:build     /usr/bin/clang -DHAVE_CONFIG_H -I. -I..   -I/opt/local/include -Wall   -I../libs/ff-woff/fontforge -I../libs/ff-woff/inc -pipe -Os -arch x86_64 -MT ffwrapper.o -MD -MP -MF $depbase.Tpo -c -o ffwrapper.o ffwrapper.c &&\
964:info:build     mv -f $depbase.Tpo $depbase.Po
965:info:build depbase=`echo dvisvgm.o | sed 's|[^/]*$|.deps/&|;s|\.o$||'`;\
966:info:build     /usr/bin/clang++ -std=gnu++11 -DHAVE_CONFIG_H -I. -I..   -I/opt/local/include -Wall -Wnon-virtual-dtor -Wno-mismatched-tags -I../libs/clipper -I../libs/variant/include -I../libs/xxHash  -I/opt/local/include/freetype2 -I/opt/local/include/libpng16    -I../libs/brotli/include -I../libs/woff2/include -pipe -Os -stdlib=libc++ -arch x86_64 -MT dvisvgm.o -MD -MP -MF $depbase.Tpo -c -o dvisvgm.o dvisvgm.cpp &&\
967:info:build     mv -f $depbase.Tpo $depbase.Po
968:info:build depbase=`echo psdefs.o | sed 's|[^/]*$|.deps/&|;s|\.o$||'`;\
969:info:build     /usr/bin/clang++ -std=gnu++11 -DHAVE_CONFIG_H -I. -I..   -I/opt/local/include -Wall -Wnon-virtual-dtor -Wno-mismatched-tags -I../libs/clipper -I../libs/variant/include -I../libs/xxHash  -I/opt/local/include/freetype2 -I/opt/local/include/libpng16    -I../libs/brotli/include -I../libs/woff2/include -pipe -Os -stdlib=libc++ -arch x86_64 -MT psdefs.o -MD -MP -MF $depbase.Tpo -c -o psdefs.o psdefs.cpp &&\
970:info:build     mv -f $depbase.Tpo $depbase.Po
971:info:build rm -f libdvisvgm.a
972:info:build ar cru libdvisvgm.a BasicDVIReader.o Bezier.o BgColorSpecialHandler.o Bitmap.o BoundingBox.o Calculator.o CharMapID.o CLCommandLine.o CMap.o CMapManager.o CMapReader.o Color.o ColorSpecialHandler.o CRC32.o Directory.o DLLoader.o DVIReader.o DvisvgmSpecialHandler.o DVIToSVG.o DVIToSVGActions.o EmSpecialHandler.o EncFile.o EPSFile.o EPSToSVG.o FileFinder.o FilePath.o FileSystem.o Font.o FontCache.o FontEncoding.o FontEngine.o FontManager.o FontMap.o FontMetrics.o FontWriter.o GFGlyphTracer.o GFReader.o GFTracer.o Ghostscript.o HtmlSpecialHandler.o HyperlinkManager.o InputBuffer.o InputReader.o JFM.o Length.o MapLine.o Matrix.o Message.o MetafontWrapper.o NoPsSpecialHandler.o PageRanges.o PageSize.o PapersizeSpecialHandler.o PathClipper.o PDFParser.o PdfSpecialHandler.o PreScanDVIReader.o Process.o psdefs.o PSInterpreter.o PSPattern.o PSPreviewFilter.o PsSpecialHandler.o RangeMap.o ShadingPatch.o SignalHandler.o SpecialManager.o StreamReader.o StreamWriter.o Subfont.o SVGCharHandler.o SVGCharHandlerFactory.o SVGCharPathHandler.o SVGCharTspanTextHandler.o SVGOutput.o SVGSingleCharTextHandler.o SVGTree.o System.o TensorProductPatch.o Terminal.o TFM.o ToUnicodeMap.o TpicSpecialHandler.o TriangularPatch.o TrueTypeFont.o TTFAutohint.o Unicode.o utility.o VFReader.o XMLDocument.o XMLNode.o XMLString.o ffwrapper.o
973:info:build ranlib libdvisvgm.a
974:info:build /bin/sh ../libtool  --tag=CXX   --mode=link /usr/bin/clang++ -std=gnu++11 -Wall -Wnon-virtual-dtor -Wno-mismatched-tags -I../libs/clipper -I../libs/variant/include -I../libs/xxHash  -I/opt/local/include/freetype2 -I/opt/local/include/libpng16    -I../libs/brotli/include -I../libs/woff2/include -pipe -Os -stdlib=libc++ -arch x86_64    -L/opt/local/lib -Wl,-headerpad_max_install_names -arch x86_64 -o dvisvgm dvisvgm.o libdvisvgm.a ../libs/clipper/libclipper.a ../libs/xxHash/libxxhash.a -L/opt/local/lib -lfreetype   ../libs/ff-woff/libfontforge.a ../libs/woff2/libwoff2.a ../libs/brotli/libbrotli.a -lz -lgs -lpotrace -lm -lkpathsea
975:info:build libtool: link: /usr/bin/clang++ -std=gnu++11 -Wall -Wnon-virtual-dtor -Wno-mismatched-tags -I../libs/clipper -I../libs/variant/include -I../libs/xxHash -I/opt/local/include/freetype2 -I/opt/local/include/libpng16 -I../libs/brotli/include -I../libs/woff2/include -pipe -Os -stdlib=libc++ -arch x86_64 -Wl,-headerpad_max_install_names -arch x86_64 -o dvisvgm dvisvgm.o  -L/opt/local/lib libdvisvgm.a ../libs/clipper/libclipper.a ../libs/xxHash/libxxhash.a -lfreetype ../libs/ff-woff/libfontforge.a ../libs/woff2/libwoff2.a ../libs/brotli/libbrotli.a -lz -lgs -lpotrace -lm -lkpathsea
976:info:build make[2]: Leaving directory `/opt/local/var/macports/build/_opt_local_var_macports_sources_rsync.macports.org_release_tarballs_ports_graphics_dvisvgm/dvisvgm/work/dvisvgm-2.3.4/src'
977:info:build Making all in tests
978:info:build make[2]: Entering directory `/opt/local/var/macports/build/_opt_local_var_macports_sources_rsync.macports.org_release_tarballs_ports_graphics_dvisvgm/dvisvgm/work/dvisvgm-2.3.4/tests'
979:info:build Making all in data
980:info:build make[3]: Entering directory `/opt/local/var/macports/build/_opt_local_var_macports_sources_rsync.macports.org_release_tarballs_ports_graphics_dvisvgm/dvisvgm/work/dvisvgm-2.3.4/tests/data'
981:info:build make[3]: Nothing to be done for `all'.
982:info:build make[3]: Leaving directory `/opt/local/var/macports/build/_opt_local_var_macports_sources_rsync.macports.org_release_tarballs_ports_graphics_dvisvgm/dvisvgm/work/dvisvgm-2.3.4/tests/data'
983:info:build make[3]: Entering directory `/opt/local/var/macports/build/_opt_local_var_macports_sources_rsync.macports.org_release_tarballs_ports_graphics_dvisvgm/dvisvgm/work/dvisvgm-2.3.4/tests'
984:info:build make[3]: Nothing to be done for `all-am'.
985:info:build make[3]: Leaving directory `/opt/local/var/macports/build/_opt_local_var_macports_sources_rsync.macports.org_release_tarballs_ports_graphics_dvisvgm/dvisvgm/work/dvisvgm-2.3.4/tests'
986:info:build make[2]: Leaving directory `/opt/local/var/macports/build/_opt_local_var_macports_sources_rsync.macports.org_release_tarballs_ports_graphics_dvisvgm/dvisvgm/work/dvisvgm-2.3.4/tests'
987:info:build Making all in doc
988:info:build make[2]: Entering directory `/opt/local/var/macports/build/_opt_local_var_macports_sources_rsync.macports.org_release_tarballs_ports_graphics_dvisvgm/dvisvgm/work/dvisvgm-2.3.4/doc'
989:info:build if [ `type -p asciidoc` ]; then \
990:info:build             asciidoc -a icons -a 'iconsdir=.' -a badges -a 'revnumber=2.3.4' --unsafe -bdocbook -dmanpage -o dvisvgm-man.xml.tmp dvisvgm.txt; \
991:info:build             xsltproc -o dvisvgm-man.xml ../doc/tweak-db-refentry.xsl dvisvgm-man.xml.tmp; \
992:info:build             rm dvisvgm-man.xml.tmp; \
993:info:build     fi
994:info:build if [ `type -p xmlto` ]; then \
995:info:build             xmlto -m ../doc/conf-dblatex-man.xsl --stringparam man.endnotes.list.enabled=0 --stringparam man.endnotes.are.numbered=0 --stringparam man.authors.section.enabled=0 man dvisvgm-man.xml; \
996:info:build     fi
997:info:build Input file /opt/local/var/macports/build/_opt_local_var_macports_sources_rsync.macports.org_release_tarballs_ports_graphics_dvisvgm/dvisvgm/work/dvisvgm-2.3.4/doc/dvisvgm-man.xml not found
998:info:build make[2]: *** [dvisvgm.1] Error 1
999:info:build make[2]: Leaving directory `/opt/local/var/macports/build/_opt_local_var_macports_sources_rsync.macports.org_release_tarballs_ports_graphics_dvisvgm/dvisvgm/work/dvisvgm-2.3.4/doc'
1000:info:build make[1]: *** [all-recursive] Error 1
1001:info:build make[1]: Leaving directory `/opt/local/var/macports/build/_opt_local_var_macports_sources_rsync.macports.org_release_tarballs_ports_graphics_dvisvgm/dvisvgm/work/dvisvgm-2.3.4'
1002:info:build make: *** [all] Error 2
1003:info:build make: Leaving directory `/opt/local/var/macports/build/_opt_local_var_macports_sources_rsync.macports.org_release_tarballs_ports_graphics_dvisvgm/dvisvgm/work/dvisvgm-2.3.4'
1004:info:build Command failed:  cd "/opt/local/var/macports/build/_opt_local_var_macports_sources_rsync.macports.org_release_tarballs_ports_graphics_dvisvgm/dvisvgm/work/dvisvgm-2.3.4" && /usr/bin/make -j8 -w all
1005:info:build Exit code: 2
1006:error:build Failed to build dvisvgm: command execution failed
1007:debug:build Error code: CHILDSTATUS 4650 2
1008:debug:build Backtrace: command execution failed
1009:debug:build     while executing
1010:debug:build "system {*}$notty {*}$nice $fullcmdstring"
1011:debug:build     invoked from within
1012:debug:build "command_exec build"
1013:debug:build     (procedure "portbuild::build_main" line 8)
1014:debug:build     invoked from within
1015:debug:build "$procedure $targetname"
1016:error:build See /opt/local/var/macports/logs/_opt_local_var_macports_sources_rsync.macports.org_release_tarballs_ports_graphics_dvisvgm/dvisvgm/main.log for details.
1017version:1
1018:debug:sysinfo macOS 10.13 (darwin/17.7.0) arch i386
1019:debug:sysinfo MacPorts 2.5.3
1020:debug:sysinfo Xcode 10.0
1021:debug:sysinfo SDK 10.13
1022:debug:sysinfo MACOSX_DEPLOYMENT_TARGET: 10.13
1023:msg:main --->  Computing dependencies for dvisvgm:info:main .:debug:main dvisvgm has no conflicts
1024:debug:main Searching for dependency: pkgconfig
1025:debug:main Found Dependency: receipt exists for pkgconfig
1026:debug:main Searching for dependency: freetype
1027:debug:main Found Dependency: receipt exists for freetype
1028:debug:main Searching for dependency: ghostscript
1029:debug:main Found Dependency: receipt exists for ghostscript
1030:debug:main Searching for dependency: potrace
1031:debug:main Found Dependency: receipt exists for potrace
1032:debug:main Searching for dependency: texlive-bin
1033:debug:main Found Dependency: receipt exists for texlive-bin
1034:debug:main Searching for dependency: zlib
1035:debug:main Found Dependency: receipt exists for zlib
1036:debug:main Executing org.macports.main (dvisvgm)
1037:debug:main dropping privileges: euid changed to 502, egid changed to 501.
1038:debug:main Skipping completed org.macports.archivefetch (dvisvgm)
1039:debug:main Privilege de-escalation not attempted as not running as root.
1040:debug:main Skipping completed org.macports.fetch (dvisvgm)
1041:debug:main Privilege de-escalation not attempted as not running as root.
1042:debug:main Skipping completed org.macports.checksum (dvisvgm)
1043:debug:main Privilege de-escalation not attempted as not running as root.
1044:debug:main Skipping completed org.macports.extract (dvisvgm)
1045:debug:main Privilege de-escalation not attempted as not running as root.
1046:debug:main Skipping completed org.macports.patch (dvisvgm)
1047:debug:main Privilege de-escalation not attempted as not running as root.
1048:debug:main Skipping completed org.macports.configure (dvisvgm)
1049:debug:main Privilege de-escalation not attempted as not running as root.
1050:debug:build build phase started at Mon Sep 24 18:44:48 CEST 2018
1051:notice:build --->  Building dvisvgm
1052:debug:build Executing org.macports.build (dvisvgm)
1053:debug:build Environment:
1054:debug:build CC_PRINT_OPTIONS='YES'
1055:debug:build CC_PRINT_OPTIONS_FILE='/opt/local/var/macports/build/_opt_local_var_macports_sources_rsync.macports.org_release_tarballs_ports_graphics_dvisvgm/dvisvgm/work/.CC_PRINT_OPTIONS'
1056:debug:build CPATH='/opt/local/include'
1057:debug:build LIBRARY_PATH='/opt/local/lib'
1058:debug:build MACOSX_DEPLOYMENT_TARGET='10.13'
1059:info:build Executing:  cd "/opt/local/var/macports/build/_opt_local_var_macports_sources_rsync.macports.org_release_tarballs_ports_graphics_dvisvgm/dvisvgm/work/dvisvgm-2.3.4" && /usr/bin/make -j8 -w all
1060:debug:build system:  cd "/opt/local/var/macports/build/_opt_local_var_macports_sources_rsync.macports.org_release_tarballs_ports_graphics_dvisvgm/dvisvgm/work/dvisvgm-2.3.4" && /usr/bin/make -j8 -w all
1061:info:build make: Entering directory `/opt/local/var/macports/build/_opt_local_var_macports_sources_rsync.macports.org_release_tarballs_ports_graphics_dvisvgm/dvisvgm/work/dvisvgm-2.3.4'
1062:info:build /Applications/Xcode.app/Contents/Developer/usr/bin/make  all-recursive
1063:info:build make[1]: Entering directory `/opt/local/var/macports/build/_opt_local_var_macports_sources_rsync.macports.org_release_tarballs_ports_graphics_dvisvgm/dvisvgm/work/dvisvgm-2.3.4'
1064:info:build Making all in libs
1065:info:build make[2]: Entering directory `/opt/local/var/macports/build/_opt_local_var_macports_sources_rsync.macports.org_release_tarballs_ports_graphics_dvisvgm/dvisvgm/work/dvisvgm-2.3.4/libs'
1066:info:build Making all in clipper
1067:info:build make[3]: Entering directory `/opt/local/var/macports/build/_opt_local_var_macports_sources_rsync.macports.org_release_tarballs_ports_graphics_dvisvgm/dvisvgm/work/dvisvgm-2.3.4/libs/clipper'
1068:info:build make[3]: Nothing to be done for `all'.
1069:info:build make[3]: Leaving directory `/opt/local/var/macports/build/_opt_local_var_macports_sources_rsync.macports.org_release_tarballs_ports_graphics_dvisvgm/dvisvgm/work/dvisvgm-2.3.4/libs/clipper'
1070:info:build Making all in variant
1071:info:build make[3]: Entering directory `/opt/local/var/macports/build/_opt_local_var_macports_sources_rsync.macports.org_release_tarballs_ports_graphics_dvisvgm/dvisvgm/work/dvisvgm-2.3.4/libs/variant'
1072:info:build make[3]: Nothing to be done for `all'.
1073:info:build make[3]: Leaving directory `/opt/local/var/macports/build/_opt_local_var_macports_sources_rsync.macports.org_release_tarballs_ports_graphics_dvisvgm/dvisvgm/work/dvisvgm-2.3.4/libs/variant'
1074:info:build Making all in xxHash
1075:info:build make[3]: Entering directory `/opt/local/var/macports/build/_opt_local_var_macports_sources_rsync.macports.org_release_tarballs_ports_graphics_dvisvgm/dvisvgm/work/dvisvgm-2.3.4/libs/xxHash'
1076:info:build make[3]: Nothing to be done for `all'.
1077:info:build make[3]: Leaving directory `/opt/local/var/macports/build/_opt_local_var_macports_sources_rsync.macports.org_release_tarballs_ports_graphics_dvisvgm/dvisvgm/work/dvisvgm-2.3.4/libs/xxHash'
1078:info:build Making all in brotli
1079:info:build make[3]: Entering directory `/opt/local/var/macports/build/_opt_local_var_macports_sources_rsync.macports.org_release_tarballs_ports_graphics_dvisvgm/dvisvgm/work/dvisvgm-2.3.4/libs/brotli'
1080:info:build make[3]: Nothing to be done for `all'.
1081:info:build make[3]: Leaving directory `/opt/local/var/macports/build/_opt_local_var_macports_sources_rsync.macports.org_release_tarballs_ports_graphics_dvisvgm/dvisvgm/work/dvisvgm-2.3.4/libs/brotli'
1082:info:build Making all in ff-woff
1083:info:build make[3]: Entering directory `/opt/local/var/macports/build/_opt_local_var_macports_sources_rsync.macports.org_release_tarballs_ports_graphics_dvisvgm/dvisvgm/work/dvisvgm-2.3.4/libs/ff-woff'
1084:info:build make[3]: Nothing to be done for `all'.
1085:info:build make[3]: Leaving directory `/opt/local/var/macports/build/_opt_local_var_macports_sources_rsync.macports.org_release_tarballs_ports_graphics_dvisvgm/dvisvgm/work/dvisvgm-2.3.4/libs/ff-woff'
1086:info:build Making all in woff2
1087:info:build make[3]: Entering directory `/opt/local/var/macports/build/_opt_local_var_macports_sources_rsync.macports.org_release_tarballs_ports_graphics_dvisvgm/dvisvgm/work/dvisvgm-2.3.4/libs/woff2'
1088:info:build make[3]: Nothing to be done for `all'.
1089:info:build make[3]: Leaving directory `/opt/local/var/macports/build/_opt_local_var_macports_sources_rsync.macports.org_release_tarballs_ports_graphics_dvisvgm/dvisvgm/work/dvisvgm-2.3.4/libs/woff2'
1090:info:build make[3]: Entering directory `/opt/local/var/macports/build/_opt_local_var_macports_sources_rsync.macports.org_release_tarballs_ports_graphics_dvisvgm/dvisvgm/work/dvisvgm-2.3.4/libs'
1091:info:build make[3]: Nothing to be done for `all-am'.
1092:info:build make[3]: Leaving directory `/opt/local/var/macports/build/_opt_local_var_macports_sources_rsync.macports.org_release_tarballs_ports_graphics_dvisvgm/dvisvgm/work/dvisvgm-2.3.4/libs'
1093:info:build make[2]: Leaving directory `/opt/local/var/macports/build/_opt_local_var_macports_sources_rsync.macports.org_release_tarballs_ports_graphics_dvisvgm/dvisvgm/work/dvisvgm-2.3.4/libs'
1094:info:build Making all in src
1095:info:build make[2]: Entering directory `/opt/local/var/macports/build/_opt_local_var_macports_sources_rsync.macports.org_release_tarballs_ports_graphics_dvisvgm/dvisvgm/work/dvisvgm-2.3.4/src'
1096:info:build if test -f psdefs.ps; then \
1097:info:build             ps2c PSInterpreter::PSDEFS psdefs.ps >psdefs.cpp; \
1098:info:build     fi
1099:info:build make[2]: Leaving directory `/opt/local/var/macports/build/_opt_local_var_macports_sources_rsync.macports.org_release_tarballs_ports_graphics_dvisvgm/dvisvgm/work/dvisvgm-2.3.4/src'
1100:info:build Making all in tests
1101:info:build make[2]: Entering directory `/opt/local/var/macports/build/_opt_local_var_macports_sources_rsync.macports.org_release_tarballs_ports_graphics_dvisvgm/dvisvgm/work/dvisvgm-2.3.4/tests'
1102:info:build Making all in data
1103:info:build make[3]: Entering directory `/opt/local/var/macports/build/_opt_local_var_macports_sources_rsync.macports.org_release_tarballs_ports_graphics_dvisvgm/dvisvgm/work/dvisvgm-2.3.4/tests/data'
1104:info:build make[3]: Nothing to be done for `all'.
1105:info:build make[3]: Leaving directory `/opt/local/var/macports/build/_opt_local_var_macports_sources_rsync.macports.org_release_tarballs_ports_graphics_dvisvgm/dvisvgm/work/dvisvgm-2.3.4/tests/data'
1106:info:build make[3]: Entering directory `/opt/local/var/macports/build/_opt_local_var_macports_sources_rsync.macports.org_release_tarballs_ports_graphics_dvisvgm/dvisvgm/work/dvisvgm-2.3.4/tests'
1107:info:build make[3]: Nothing to be done for `all-am'.
1108:info:build make[3]: Leaving directory `/opt/local/var/macports/build/_opt_local_var_macports_sources_rsync.macports.org_release_tarballs_ports_graphics_dvisvgm/dvisvgm/work/dvisvgm-2.3.4/tests'
1109:info:build make[2]: Leaving directory `/opt/local/var/macports/build/_opt_local_var_macports_sources_rsync.macports.org_release_tarballs_ports_graphics_dvisvgm/dvisvgm/work/dvisvgm-2.3.4/tests'
1110:info:build Making all in doc
1111:info:build make[2]: Entering directory `/opt/local/var/macports/build/_opt_local_var_macports_sources_rsync.macports.org_release_tarballs_ports_graphics_dvisvgm/dvisvgm/work/dvisvgm-2.3.4/doc'
1112:info:build if [ `type -p asciidoc` ]; then \
1113:info:build             asciidoc -a icons -a 'iconsdir=.' -a badges -a 'revnumber=2.3.4' --unsafe -bdocbook -dmanpage -o dvisvgm-man.xml.tmp dvisvgm.txt; \
1114:info:build             xsltproc -o dvisvgm-man.xml ../doc/tweak-db-refentry.xsl dvisvgm-man.xml.tmp; \
1115:info:build             rm dvisvgm-man.xml.tmp; \
1116:info:build     fi
1117:info:build if [ `type -p xmlto` ]; then \
1118:info:build             xmlto -m ../doc/conf-dblatex-man.xsl --stringparam man.endnotes.list.enabled=0 --stringparam man.endnotes.are.numbered=0 --stringparam man.authors.section.enabled=0 man dvisvgm-man.xml; \
1119:info:build     fi
1120:info:build Input file /opt/local/var/macports/build/_opt_local_var_macports_sources_rsync.macports.org_release_tarballs_ports_graphics_dvisvgm/dvisvgm/work/dvisvgm-2.3.4/doc/dvisvgm-man.xml not found
1121:info:build make[2]: *** [dvisvgm.1] Error 1
1122:info:build make[2]: Leaving directory `/opt/local/var/macports/build/_opt_local_var_macports_sources_rsync.macports.org_release_tarballs_ports_graphics_dvisvgm/dvisvgm/work/dvisvgm-2.3.4/doc'
1123:info:build make[1]: *** [all-recursive] Error 1
1124:info:build make[1]: Leaving directory `/opt/local/var/macports/build/_opt_local_var_macports_sources_rsync.macports.org_release_tarballs_ports_graphics_dvisvgm/dvisvgm/work/dvisvgm-2.3.4'
1125:info:build make: *** [all] Error 2
1126:info:build make: Leaving directory `/opt/local/var/macports/build/_opt_local_var_macports_sources_rsync.macports.org_release_tarballs_ports_graphics_dvisvgm/dvisvgm/work/dvisvgm-2.3.4'
1127:info:build Command failed:  cd "/opt/local/var/macports/build/_opt_local_var_macports_sources_rsync.macports.org_release_tarballs_ports_graphics_dvisvgm/dvisvgm/work/dvisvgm-2.3.4" && /usr/bin/make -j8 -w all
1128:info:build Exit code: 2
1129:error:build Failed to build dvisvgm: command execution failed
1130:debug:build Error code: CHILDSTATUS 7606 2
1131:debug:build Backtrace: command execution failed
1132:debug:build     while executing
1133:debug:build "system {*}$notty {*}$nice $fullcmdstring"
1134:debug:build     invoked from within
1135:debug:build "command_exec build"
1136:debug:build     (procedure "portbuild::build_main" line 8)
1137:debug:build     invoked from within
1138:debug:build "$procedure $targetname"
1139:error:build See /opt/local/var/macports/logs/_opt_local_var_macports_sources_rsync.macports.org_release_tarballs_ports_graphics_dvisvgm/dvisvgm/main.log for details.
1140version:1
1141:debug:sysinfo macOS 10.13 (darwin/17.7.0) arch i386
1142:debug:sysinfo MacPorts 2.5.3
1143:debug:sysinfo Xcode 10.0
1144:debug:sysinfo SDK 10.13
1145:debug:sysinfo MACOSX_DEPLOYMENT_TARGET: 10.13
1146:msg:clean --->  Computing dependencies for dvisvgm:info:clean .:debug:clean dvisvgm has no conflicts
1147:debug:clean Searching for dependency: pkgconfig
1148:debug:clean Found Dependency: receipt exists for pkgconfig
1149:debug:clean Searching for dependency: freetype
1150:debug:clean Found Dependency: receipt exists for freetype
1151:debug:clean Searching for dependency: ghostscript
1152:debug:clean Found Dependency: receipt exists for ghostscript
1153:debug:clean Searching for dependency: potrace
1154:debug:clean Found Dependency: receipt exists for potrace
1155:debug:clean Searching for dependency: texlive-bin
1156:debug:clean Found Dependency: receipt exists for texlive-bin
1157:debug:clean Searching for dependency: zlib
1158:debug:clean Found Dependency: receipt exists for zlib
1159:debug:main Executing org.macports.main (dvisvgm)
1160:debug:main dropping privileges: euid changed to 502, egid changed to 501.
1161:debug:main Skipping completed org.macports.archivefetch (dvisvgm)
1162:debug:main Privilege de-escalation not attempted as not running as root.
1163:debug:main Skipping completed org.macports.fetch (dvisvgm)
1164:debug:main Privilege de-escalation not attempted as not running as root.
1165:debug:main Skipping completed org.macports.checksum (dvisvgm)
1166:debug:main Privilege de-escalation not attempted as not running as root.
1167:debug:main Skipping completed org.macports.extract (dvisvgm)
1168:debug:main Privilege de-escalation not attempted as not running as root.
1169:debug:main Skipping completed org.macports.patch (dvisvgm)
1170:debug:main Privilege de-escalation not attempted as not running as root.
1171:debug:main Skipping completed org.macports.configure (dvisvgm)
1172:debug:main Privilege de-escalation not attempted as not running as root.
1173:debug:build build phase started at Tue Sep 25 18:40:36 CEST 2018
1174:notice:build --->  Building dvisvgm
1175:debug:build Executing org.macports.build (dvisvgm)
1176:debug:build Environment:
1177:debug:build CC_PRINT_OPTIONS='YES'
1178:debug:build CC_PRINT_OPTIONS_FILE='/opt/local/var/macports/build/_opt_local_var_macports_sources_rsync.macports.org_release_tarballs_ports_graphics_dvisvgm/dvisvgm/work/.CC_PRINT_OPTIONS'
1179:debug:build CPATH='/opt/local/include'
1180:debug:build LIBRARY_PATH='/opt/local/lib'
1181:debug:build MACOSX_DEPLOYMENT_TARGET='10.13'
1182:info:build Executing:  cd "/opt/local/var/macports/build/_opt_local_var_macports_sources_rsync.macports.org_release_tarballs_ports_graphics_dvisvgm/dvisvgm/work/dvisvgm-2.3.4" && /usr/bin/make -j8 -w all
1183:debug:build system:  cd "/opt/local/var/macports/build/_opt_local_var_macports_sources_rsync.macports.org_release_tarballs_ports_graphics_dvisvgm/dvisvgm/work/dvisvgm-2.3.4" && /usr/bin/make -j8 -w all
1184:info:build make: Entering directory `/opt/local/var/macports/build/_opt_local_var_macports_sources_rsync.macports.org_release_tarballs_ports_graphics_dvisvgm/dvisvgm/work/dvisvgm-2.3.4'
1185:info:build /Applications/Xcode.app/Contents/Developer/usr/bin/make  all-recursive
1186:info:build make[1]: Entering directory `/opt/local/var/macports/build/_opt_local_var_macports_sources_rsync.macports.org_release_tarballs_ports_graphics_dvisvgm/dvisvgm/work/dvisvgm-2.3.4'
1187:info:build Making all in libs
1188:info:build make[2]: Entering directory `/opt/local/var/macports/build/_opt_local_var_macports_sources_rsync.macports.org_release_tarballs_ports_graphics_dvisvgm/dvisvgm/work/dvisvgm-2.3.4/libs'
1189:info:build Making all in clipper
1190:info:build make[3]: Entering directory `/opt/local/var/macports/build/_opt_local_var_macports_sources_rsync.macports.org_release_tarballs_ports_graphics_dvisvgm/dvisvgm/work/dvisvgm-2.3.4/libs/clipper'
1191:info:build make[3]: Nothing to be done for `all'.
1192:info:build make[3]: Leaving directory `/opt/local/var/macports/build/_opt_local_var_macports_sources_rsync.macports.org_release_tarballs_ports_graphics_dvisvgm/dvisvgm/work/dvisvgm-2.3.4/libs/clipper'
1193:info:build Making all in variant
1194:info:build make[3]: Entering directory `/opt/local/var/macports/build/_opt_local_var_macports_sources_rsync.macports.org_release_tarballs_ports_graphics_dvisvgm/dvisvgm/work/dvisvgm-2.3.4/libs/variant'
1195:info:build make[3]: Nothing to be done for `all'.
1196:info:build make[3]: Leaving directory `/opt/local/var/macports/build/_opt_local_var_macports_sources_rsync.macports.org_release_tarballs_ports_graphics_dvisvgm/dvisvgm/work/dvisvgm-2.3.4/libs/variant'
1197:info:build Making all in xxHash
1198:info:build make[3]: Entering directory `/opt/local/var/macports/build/_opt_local_var_macports_sources_rsync.macports.org_release_tarballs_ports_graphics_dvisvgm/dvisvgm/work/dvisvgm-2.3.4/libs/xxHash'
1199:info:build make[3]: Nothing to be done for `all'.
1200:info:build make[3]: Leaving directory `/opt/local/var/macports/build/_opt_local_var_macports_sources_rsync.macports.org_release_tarballs_ports_graphics_dvisvgm/dvisvgm/work/dvisvgm-2.3.4/libs/xxHash'
1201:info:build Making all in brotli
1202:info:build make[3]: Entering directory `/opt/local/var/macports/build/_opt_local_var_macports_sources_rsync.macports.org_release_tarballs_ports_graphics_dvisvgm/dvisvgm/work/dvisvgm-2.3.4/libs/brotli'
1203:info:build make[3]: Nothing to be done for `all'.
1204:info:build make[3]: Leaving directory `/opt/local/var/macports/build/_opt_local_var_macports_sources_rsync.macports.org_release_tarballs_ports_graphics_dvisvgm/dvisvgm/work/dvisvgm-2.3.4/libs/brotli'
1205:info:build Making all in ff-woff
1206:info:build make[3]: Entering directory `/opt/local/var/macports/build/_opt_local_var_macports_sources_rsync.macports.org_release_tarballs_ports_graphics_dvisvgm/dvisvgm/work/dvisvgm-2.3.4/libs/ff-woff'
1207:info:build make[3]: Nothing to be done for `all'.
1208:info:build make[3]: Leaving directory `/opt/local/var/macports/build/_opt_local_var_macports_sources_rsync.macports.org_release_tarballs_ports_graphics_dvisvgm/dvisvgm/work/dvisvgm-2.3.4/libs/ff-woff'
1209:info:build Making all in woff2
1210:info:build make[3]: Entering directory `/opt/local/var/macports/build/_opt_local_var_macports_sources_rsync.macports.org_release_tarballs_ports_graphics_dvisvgm/dvisvgm/work/dvisvgm-2.3.4/libs/woff2'
1211:info:build make[3]: Nothing to be done for `all'.
1212:info:build make[3]: Leaving directory `/opt/local/var/macports/build/_opt_local_var_macports_sources_rsync.macports.org_release_tarballs_ports_graphics_dvisvgm/dvisvgm/work/dvisvgm-2.3.4/libs/woff2'
1213:info:build make[3]: Entering directory `/opt/local/var/macports/build/_opt_local_var_macports_sources_rsync.macports.org_release_tarballs_ports_graphics_dvisvgm/dvisvgm/work/dvisvgm-2.3.4/libs'
1214:info:build make[3]: Nothing to be done for `all-am'.
1215:info:build make[3]: Leaving directory `/opt/local/var/macports/build/_opt_local_var_macports_sources_rsync.macports.org_release_tarballs_ports_graphics_dvisvgm/dvisvgm/work/dvisvgm-2.3.4/libs'
1216:info:build make[2]: Leaving directory `/opt/local/var/macports/build/_opt_local_var_macports_sources_rsync.macports.org_release_tarballs_ports_graphics_dvisvgm/dvisvgm/work/dvisvgm-2.3.4/libs'
1217:info:build Making all in src
1218:info:build make[2]: Entering directory `/opt/local/var/macports/build/_opt_local_var_macports_sources_rsync.macports.org_release_tarballs_ports_graphics_dvisvgm/dvisvgm/work/dvisvgm-2.3.4/src'
1219:info:build if test -f psdefs.ps; then \
1220:info:build             ps2c PSInterpreter::PSDEFS psdefs.ps >psdefs.cpp; \
1221:info:build     fi
1222:info:build make[2]: Leaving directory `/opt/local/var/macports/build/_opt_local_var_macports_sources_rsync.macports.org_release_tarballs_ports_graphics_dvisvgm/dvisvgm/work/dvisvgm-2.3.4/src'
1223:info:build Making all in tests
1224:info:build make[2]: Entering directory `/opt/local/var/macports/build/_opt_local_var_macports_sources_rsync.macports.org_release_tarballs_ports_graphics_dvisvgm/dvisvgm/work/dvisvgm-2.3.4/tests'
1225:info:build Making all in data
1226:info:build make[3]: Entering directory `/opt/local/var/macports/build/_opt_local_var_macports_sources_rsync.macports.org_release_tarballs_ports_graphics_dvisvgm/dvisvgm/work/dvisvgm-2.3.4/tests/data'
1227:info:build make[3]: Nothing to be done for `all'.
1228:info:build make[3]: Leaving directory `/opt/local/var/macports/build/_opt_local_var_macports_sources_rsync.macports.org_release_tarballs_ports_graphics_dvisvgm/dvisvgm/work/dvisvgm-2.3.4/tests/data'
1229:info:build make[3]: Entering directory `/opt/local/var/macports/build/_opt_local_var_macports_sources_rsync.macports.org_release_tarballs_ports_graphics_dvisvgm/dvisvgm/work/dvisvgm-2.3.4/tests'
1230:info:build make[3]: Nothing to be done for `all-am'.
1231:info:build make[3]: Leaving directory `/opt/local/var/macports/build/_opt_local_var_macports_sources_rsync.macports.org_release_tarballs_ports_graphics_dvisvgm/dvisvgm/work/dvisvgm-2.3.4/tests'
1232:info:build make[2]: Leaving directory `/opt/local/var/macports/build/_opt_local_var_macports_sources_rsync.macports.org_release_tarballs_ports_graphics_dvisvgm/dvisvgm/work/dvisvgm-2.3.4/tests'
1233:info:build Making all in doc
1234:info:build make[2]: Entering directory `/opt/local/var/macports/build/_opt_local_var_macports_sources_rsync.macports.org_release_tarballs_ports_graphics_dvisvgm/dvisvgm/work/dvisvgm-2.3.4/doc'
1235:info:build if [ `type -p asciidoc` ]; then \
1236:info:build             asciidoc -a icons -a 'iconsdir=.' -a badges -a 'revnumber=2.3.4' --unsafe -bdocbook -dmanpage -o dvisvgm-man.xml.tmp dvisvgm.txt; \
1237:info:build             xsltproc -o dvisvgm-man.xml ../doc/tweak-db-refentry.xsl dvisvgm-man.xml.tmp; \
1238:info:build             rm dvisvgm-man.xml.tmp; \
1239:info:build     fi
1240:info:build if [ `type -p xmlto` ]; then \
1241:info:build             xmlto -m ../doc/conf-dblatex-man.xsl --stringparam man.endnotes.list.enabled=0 --stringparam man.endnotes.are.numbered=0 --stringparam man.authors.section.enabled=0 man dvisvgm-man.xml; \
1242:info:build     fi
1243:info:build Input file /opt/local/var/macports/build/_opt_local_var_macports_sources_rsync.macports.org_release_tarballs_ports_graphics_dvisvgm/dvisvgm/work/dvisvgm-2.3.4/doc/dvisvgm-man.xml not found
1244:info:build make[2]: *** [dvisvgm.1] Error 1
1245:info:build make[2]: Leaving directory `/opt/local/var/macports/build/_opt_local_var_macports_sources_rsync.macports.org_release_tarballs_ports_graphics_dvisvgm/dvisvgm/work/dvisvgm-2.3.4/doc'
1246:info:build make[1]: *** [all-recursive] Error 1
1247:info:build make[1]: Leaving directory `/opt/local/var/macports/build/_opt_local_var_macports_sources_rsync.macports.org_release_tarballs_ports_graphics_dvisvgm/dvisvgm/work/dvisvgm-2.3.4'
1248:info:build make: *** [all] Error 2
1249:info:build make: Leaving directory `/opt/local/var/macports/build/_opt_local_var_macports_sources_rsync.macports.org_release_tarballs_ports_graphics_dvisvgm/dvisvgm/work/dvisvgm-2.3.4'
1250:info:build Command failed:  cd "/opt/local/var/macports/build/_opt_local_var_macports_sources_rsync.macports.org_release_tarballs_ports_graphics_dvisvgm/dvisvgm/work/dvisvgm-2.3.4" && /usr/bin/make -j8 -w all
1251:info:build Exit code: 2
1252:error:build Failed to build dvisvgm: command execution failed
1253:debug:build Error code: CHILDSTATUS 10557 2
1254:debug:build Backtrace: command execution failed
1255:debug:build     while executing
1256:debug:build "system {*}$notty {*}$nice $fullcmdstring"
1257:debug:build     invoked from within
1258:debug:build "command_exec build"
1259:debug:build     (procedure "portbuild::build_main" line 8)
1260:debug:build     invoked from within
1261:debug:build "$procedure $targetname"
1262:error:build See /opt/local/var/macports/logs/_opt_local_var_macports_sources_rsync.macports.org_release_tarballs_ports_graphics_dvisvgm/dvisvgm/main.log for details.
1263version:1
1264:debug:sysinfo macOS 10.13 (darwin/17.7.0) arch i386
1265:debug:sysinfo MacPorts 2.5.3
1266:debug:sysinfo Xcode 10.0
1267:debug:sysinfo SDK 10.13
1268:debug:sysinfo MACOSX_DEPLOYMENT_TARGET: 10.13
1269:msg:clean --->  Computing dependencies for dvisvgm:info:clean .:debug:clean dvisvgm has no conflicts
1270:debug:clean Searching for dependency: pkgconfig
1271:debug:clean Found Dependency: receipt exists for pkgconfig
1272:debug:clean Searching for dependency: freetype
1273:debug:clean Found Dependency: receipt exists for freetype
1274:debug:clean Searching for dependency: ghostscript
1275:debug:clean Found Dependency: receipt exists for ghostscript
1276:debug:clean Searching for dependency: potrace
1277:debug:clean Found Dependency: receipt exists for potrace
1278:debug:clean Searching for dependency: texlive-bin
1279:debug:clean Found Dependency: receipt exists for texlive-bin
1280:debug:clean Searching for dependency: zlib
1281:debug:clean Found Dependency: receipt exists for zlib
1282:debug:main Executing org.macports.main (dvisvgm)
1283:debug:main dropping privileges: euid changed to 502, egid changed to 501.
1284:debug:main Skipping completed org.macports.archivefetch (dvisvgm)
1285:debug:main Privilege de-escalation not attempted as not running as root.
1286:debug:main Skipping completed org.macports.fetch (dvisvgm)
1287:debug:main Privilege de-escalation not attempted as not running as root.
1288:debug:main Skipping completed org.macports.checksum (dvisvgm)
1289:debug:main Privilege de-escalation not attempted as not running as root.
1290:debug:main Skipping completed org.macports.extract (dvisvgm)
1291:debug:main Privilege de-escalation not attempted as not running as root.
1292:debug:main Skipping completed org.macports.patch (dvisvgm)
1293:debug:main Privilege de-escalation not attempted as not running as root.
1294:debug:main Skipping completed org.macports.configure (dvisvgm)
1295:debug:main Privilege de-escalation not attempted as not running as root.
1296:debug:build build phase started at Wed Sep 26 22:50:38 CEST 2018
1297:notice:build --->  Building dvisvgm
1298:debug:build Executing org.macports.build (dvisvgm)
1299:debug:build Environment:
1300:debug:build CC_PRINT_OPTIONS='YES'
1301:debug:build CC_PRINT_OPTIONS_FILE='/opt/local/var/macports/build/_opt_local_var_macports_sources_rsync.macports.org_release_tarballs_ports_graphics_dvisvgm/dvisvgm/work/.CC_PRINT_OPTIONS'
1302:debug:build CPATH='/opt/local/include'
1303:debug:build LIBRARY_PATH='/opt/local/lib'
1304:debug:build MACOSX_DEPLOYMENT_TARGET='10.13'
1305:info:build Executing:  cd "/opt/local/var/macports/build/_opt_local_var_macports_sources_rsync.macports.org_release_tarballs_ports_graphics_dvisvgm/dvisvgm/work/dvisvgm-2.3.4" && /usr/bin/make -j8 -w all
1306:debug:build system:  cd "/opt/local/var/macports/build/_opt_local_var_macports_sources_rsync.macports.org_release_tarballs_ports_graphics_dvisvgm/dvisvgm/work/dvisvgm-2.3.4" && /usr/bin/make -j8 -w all
1307:info:build make: Entering directory `/opt/local/var/macports/build/_opt_local_var_macports_sources_rsync.macports.org_release_tarballs_ports_graphics_dvisvgm/dvisvgm/work/dvisvgm-2.3.4'
1308:info:build /Applications/Xcode.app/Contents/Developer/usr/bin/make  all-recursive
1309:info:build make[1]: Entering directory `/opt/local/var/macports/build/_opt_local_var_macports_sources_rsync.macports.org_release_tarballs_ports_graphics_dvisvgm/dvisvgm/work/dvisvgm-2.3.4'
1310:info:build Making all in libs
1311:info:build make[2]: Entering directory `/opt/local/var/macports/build/_opt_local_var_macports_sources_rsync.macports.org_release_tarballs_ports_graphics_dvisvgm/dvisvgm/work/dvisvgm-2.3.4/libs'
1312:info:build Making all in clipper
1313:info:build make[3]: Entering directory `/opt/local/var/macports/build/_opt_local_var_macports_sources_rsync.macports.org_release_tarballs_ports_graphics_dvisvgm/dvisvgm/work/dvisvgm-2.3.4/libs/clipper'
1314:info:build make[3]: Nothing to be done for `all'.
1315:info:build make[3]: Leaving directory `/opt/local/var/macports/build/_opt_local_var_macports_sources_rsync.macports.org_release_tarballs_ports_graphics_dvisvgm/dvisvgm/work/dvisvgm-2.3.4/libs/clipper'
1316:info:build Making all in variant
1317:info:build make[3]: Entering directory `/opt/local/var/macports/build/_opt_local_var_macports_sources_rsync.macports.org_release_tarballs_ports_graphics_dvisvgm/dvisvgm/work/dvisvgm-2.3.4/libs/variant'
1318:info:build make[3]: Nothing to be done for `all'.
1319:info:build make[3]: Leaving directory `/opt/local/var/macports/build/_opt_local_var_macports_sources_rsync.macports.org_release_tarballs_ports_graphics_dvisvgm/dvisvgm/work/dvisvgm-2.3.4/libs/variant'
1320:info:build Making all in xxHash
1321:info:build make[3]: Entering directory `/opt/local/var/macports/build/_opt_local_var_macports_sources_rsync.macports.org_release_tarballs_ports_graphics_dvisvgm/dvisvgm/work/dvisvgm-2.3.4/libs/xxHash'
1322:info:build make[3]: Nothing to be done for `all'.
1323:info:build make[3]: Leaving directory `/opt/local/var/macports/build/_opt_local_var_macports_sources_rsync.macports.org_release_tarballs_ports_graphics_dvisvgm/dvisvgm/work/dvisvgm-2.3.4/libs/xxHash'
1324:info:build Making all in brotli
1325:info:build make[3]: Entering directory `/opt/local/var/macports/build/_opt_local_var_macports_sources_rsync.macports.org_release_tarballs_ports_graphics_dvisvgm/dvisvgm/work/dvisvgm-2.3.4/libs/brotli'
1326:info:build make[3]: Nothing to be done for `all'.
1327:info:build make[3]: Leaving directory `/opt/local/var/macports/build/_opt_local_var_macports_sources_rsync.macports.org_release_tarballs_ports_graphics_dvisvgm/dvisvgm/work/dvisvgm-2.3.4/libs/brotli'
1328:info:build Making all in ff-woff
1329:info:build make[3]: Entering directory `/opt/local/var/macports/build/_opt_local_var_macports_sources_rsync.macports.org_release_tarballs_ports_graphics_dvisvgm/dvisvgm/work/dvisvgm-2.3.4/libs/ff-woff'
1330:info:build make[3]: Nothing to be done for `all'.
1331:info:build make[3]: Leaving directory `/opt/local/var/macports/build/_opt_local_var_macports_sources_rsync.macports.org_release_tarballs_ports_graphics_dvisvgm/dvisvgm/work/dvisvgm-2.3.4/libs/ff-woff'
1332:info:build Making all in woff2
1333:info:build make[3]: Entering directory `/opt/local/var/macports/build/_opt_local_var_macports_sources_rsync.macports.org_release_tarballs_ports_graphics_dvisvgm/dvisvgm/work/dvisvgm-2.3.4/libs/woff2'
1334:info:build make[3]: Nothing to be done for `all'.
1335:info:build make[3]: Leaving directory `/opt/local/var/macports/build/_opt_local_var_macports_sources_rsync.macports.org_release_tarballs_ports_graphics_dvisvgm/dvisvgm/work/dvisvgm-2.3.4/libs/woff2'
1336:info:build make[3]: Entering directory `/opt/local/var/macports/build/_opt_local_var_macports_sources_rsync.macports.org_release_tarballs_ports_graphics_dvisvgm/dvisvgm/work/dvisvgm-2.3.4/libs'
1337:info:build make[3]: Nothing to be done for `all-am'.
1338:info:build make[3]: Leaving directory `/opt/local/var/macports/build/_opt_local_var_macports_sources_rsync.macports.org_release_tarballs_ports_graphics_dvisvgm/dvisvgm/work/dvisvgm-2.3.4/libs'
1339:info:build make[2]: Leaving directory `/opt/local/var/macports/build/_opt_local_var_macports_sources_rsync.macports.org_release_tarballs_ports_graphics_dvisvgm/dvisvgm/work/dvisvgm-2.3.4/libs'
1340:info:build Making all in src
1341:info:build make[2]: Entering directory `/opt/local/var/macports/build/_opt_local_var_macports_sources_rsync.macports.org_release_tarballs_ports_graphics_dvisvgm/dvisvgm/work/dvisvgm-2.3.4/src'
1342:info:build if test -f psdefs.ps; then \
1343:info:build             ps2c PSInterpreter::PSDEFS psdefs.ps >psdefs.cpp; \
1344:info:build     fi
1345:info:build make[2]: Leaving directory `/opt/local/var/macports/build/_opt_local_var_macports_sources_rsync.macports.org_release_tarballs_ports_graphics_dvisvgm/dvisvgm/work/dvisvgm-2.3.4/src'
1346:info:build Making all in tests
1347:info:build make[2]: Entering directory `/opt/local/var/macports/build/_opt_local_var_macports_sources_rsync.macports.org_release_tarballs_ports_graphics_dvisvgm/dvisvgm/work/dvisvgm-2.3.4/tests'
1348:info:build Making all in data
1349:info:build make[3]: Entering directory `/opt/local/var/macports/build/_opt_local_var_macports_sources_rsync.macports.org_release_tarballs_ports_graphics_dvisvgm/dvisvgm/work/dvisvgm-2.3.4/tests/data'
1350:info:build make[3]: Nothing to be done for `all'.
1351:info:build make[3]: Leaving directory `/opt/local/var/macports/build/_opt_local_var_macports_sources_rsync.macports.org_release_tarballs_ports_graphics_dvisvgm/dvisvgm/work/dvisvgm-2.3.4/tests/data'
1352:info:build make[3]: Entering directory `/opt/local/var/macports/build/_opt_local_var_macports_sources_rsync.macports.org_release_tarballs_ports_graphics_dvisvgm/dvisvgm/work/dvisvgm-2.3.4/tests'
1353:info:build make[3]: Nothing to be done for `all-am'.
1354:info:build make[3]: Leaving directory `/opt/local/var/macports/build/_opt_local_var_macports_sources_rsync.macports.org_release_tarballs_ports_graphics_dvisvgm/dvisvgm/work/dvisvgm-2.3.4/tests'
1355:info:build make[2]: Leaving directory `/opt/local/var/macports/build/_opt_local_var_macports_sources_rsync.macports.org_release_tarballs_ports_graphics_dvisvgm/dvisvgm/work/dvisvgm-2.3.4/tests'
1356:info:build Making all in doc
1357:info:build make[2]: Entering directory `/opt/local/var/macports/build/_opt_local_var_macports_sources_rsync.macports.org_release_tarballs_ports_graphics_dvisvgm/dvisvgm/work/dvisvgm-2.3.4/doc'
1358:info:build if [ `type -p asciidoc` ]; then \
1359:info:build             asciidoc -a icons -a 'iconsdir=.' -a badges -a 'revnumber=2.3.4' --unsafe -bdocbook -dmanpage -o dvisvgm-man.xml.tmp dvisvgm.txt; \
1360:info:build             xsltproc -o dvisvgm-man.xml ../doc/tweak-db-refentry.xsl dvisvgm-man.xml.tmp; \
1361:info:build             rm dvisvgm-man.xml.tmp; \
1362:info:build     fi
1363:info:build if [ `type -p xmlto` ]; then \
1364:info:build             xmlto -m ../doc/conf-dblatex-man.xsl --stringparam man.endnotes.list.enabled=0 --stringparam man.endnotes.are.numbered=0 --stringparam man.authors.section.enabled=0 man dvisvgm-man.xml; \
1365:info:build     fi
1366:info:build Input file /opt/local/var/macports/build/_opt_local_var_macports_sources_rsync.macports.org_release_tarballs_ports_graphics_dvisvgm/dvisvgm/work/dvisvgm-2.3.4/doc/dvisvgm-man.xml not found
1367:info:build make[2]: *** [dvisvgm.1] Error 1
1368:info:build make[2]: Leaving directory `/opt/local/var/macports/build/_opt_local_var_macports_sources_rsync.macports.org_release_tarballs_ports_graphics_dvisvgm/dvisvgm/work/dvisvgm-2.3.4/doc'
1369:info:build make[1]: *** [all-recursive] Error 1
1370:info:build make[1]: Leaving directory `/opt/local/var/macports/build/_opt_local_var_macports_sources_rsync.macports.org_release_tarballs_ports_graphics_dvisvgm/dvisvgm/work/dvisvgm-2.3.4'
1371:info:build make: *** [all] Error 2
1372:info:build make: Leaving directory `/opt/local/var/macports/build/_opt_local_var_macports_sources_rsync.macports.org_release_tarballs_ports_graphics_dvisvgm/dvisvgm/work/dvisvgm-2.3.4'
1373:info:build Command failed:  cd "/opt/local/var/macports/build/_opt_local_var_macports_sources_rsync.macports.org_release_tarballs_ports_graphics_dvisvgm/dvisvgm/work/dvisvgm-2.3.4" && /usr/bin/make -j8 -w all
1374:info:build Exit code: 2
1375:error:build Failed to build dvisvgm: command execution failed
1376:debug:build Error code: CHILDSTATUS 14835 2
1377:debug:build Backtrace: command execution failed
1378:debug:build     while executing
1379:debug:build "system {*}$notty {*}$nice $fullcmdstring"
1380:debug:build     invoked from within
1381:debug:build "command_exec build"
1382:debug:build     (procedure "portbuild::build_main" line 8)
1383:debug:build     invoked from within
1384:debug:build "$procedure $targetname"
1385:error:build See /opt/local/var/macports/logs/_opt_local_var_macports_sources_rsync.macports.org_release_tarballs_ports_graphics_dvisvgm/dvisvgm/main.log for details.
1386version:1
1387:debug:sysinfo macOS 10.13 (darwin/17.7.0) arch i386
1388:debug:sysinfo MacPorts 2.5.3
1389:debug:sysinfo Xcode 10.0
1390:debug:sysinfo SDK 10.13
1391:debug:sysinfo MACOSX_DEPLOYMENT_TARGET: 10.13
1392:msg:main --->  Computing dependencies for dvisvgm:info:main .:debug:main dvisvgm has no conflicts
1393:debug:main Searching for dependency: pkgconfig
1394:debug:main Found Dependency: receipt exists for pkgconfig
1395:debug:main Searching for dependency: freetype
1396:debug:main Found Dependency: receipt exists for freetype
1397:debug:main Searching for dependency: ghostscript
1398:debug:main Found Dependency: receipt exists for ghostscript
1399:debug:main Searching for dependency: potrace
1400:debug:main Found Dependency: receipt exists for potrace
1401:debug:main Searching for dependency: texlive-bin
1402:debug:main Found Dependency: receipt exists for texlive-bin
1403:debug:main Searching for dependency: zlib
1404:debug:main Found Dependency: receipt exists for zlib
1405:debug:main Executing org.macports.main (dvisvgm)
1406:debug:main dropping privileges: euid changed to 502, egid changed to 501.
1407:debug:main Skipping completed org.macports.archivefetch (dvisvgm)
1408:debug:main Privilege de-escalation not attempted as not running as root.
1409:debug:main Skipping completed org.macports.fetch (dvisvgm)
1410:debug:main Privilege de-escalation not attempted as not running as root.
1411:debug:main Skipping completed org.macports.checksum (dvisvgm)
1412:debug:main Privilege de-escalation not attempted as not running as root.
1413:debug:main Skipping completed org.macports.extract (dvisvgm)
1414:debug:main Privilege de-escalation not attempted as not running as root.
1415:debug:main Skipping completed org.macports.patch (dvisvgm)
1416:debug:main Privilege de-escalation not attempted as not running as root.
1417:debug:main Skipping completed org.macports.configure (dvisvgm)
1418:debug:main Privilege de-escalation not attempted as not running as root.
1419:debug:build build phase started at Wed Sep 26 22:57:23 CEST 2018
1420:notice:build --->  Building dvisvgm
1421:debug:build Executing org.macports.build (dvisvgm)
1422:debug:build Environment:
1423:debug:build CC_PRINT_OPTIONS='YES'
1424:debug:build CC_PRINT_OPTIONS_FILE='/opt/local/var/macports/build/_opt_local_var_macports_sources_rsync.macports.org_release_tarballs_ports_graphics_dvisvgm/dvisvgm/work/.CC_PRINT_OPTIONS'
1425:debug:build CPATH='/opt/local/include'
1426:debug:build LIBRARY_PATH='/opt/local/lib'
1427:debug:build MACOSX_DEPLOYMENT_TARGET='10.13'
1428:info:build Executing:  cd "/opt/local/var/macports/build/_opt_local_var_macports_sources_rsync.macports.org_release_tarballs_ports_graphics_dvisvgm/dvisvgm/work/dvisvgm-2.3.4" && /usr/bin/make -j8 -w all
1429:debug:build system:  cd "/opt/local/var/macports/build/_opt_local_var_macports_sources_rsync.macports.org_release_tarballs_ports_graphics_dvisvgm/dvisvgm/work/dvisvgm-2.3.4" && /usr/bin/make -j8 -w all
1430:info:build make: Entering directory `/opt/local/var/macports/build/_opt_local_var_macports_sources_rsync.macports.org_release_tarballs_ports_graphics_dvisvgm/dvisvgm/work/dvisvgm-2.3.4'
1431:info:build /Applications/Xcode.app/Contents/Developer/usr/bin/make  all-recursive
1432:info:build make[1]: Entering directory `/opt/local/var/macports/build/_opt_local_var_macports_sources_rsync.macports.org_release_tarballs_ports_graphics_dvisvgm/dvisvgm/work/dvisvgm-2.3.4'
1433:info:build Making all in libs
1434:info:build make[2]: Entering directory `/opt/local/var/macports/build/_opt_local_var_macports_sources_rsync.macports.org_release_tarballs_ports_graphics_dvisvgm/dvisvgm/work/dvisvgm-2.3.4/libs'
1435:info:build Making all in clipper
1436:info:build make[3]: Entering directory `/opt/local/var/macports/build/_opt_local_var_macports_sources_rsync.macports.org_release_tarballs_ports_graphics_dvisvgm/dvisvgm/work/dvisvgm-2.3.4/libs/clipper'
1437:info:build make[3]: Nothing to be done for `all'.
1438:info:build make[3]: Leaving directory `/opt/local/var/macports/build/_opt_local_var_macports_sources_rsync.macports.org_release_tarballs_ports_graphics_dvisvgm/dvisvgm/work/dvisvgm-2.3.4/libs/clipper'
1439:info:build Making all in variant
1440:info:build make[3]: Entering directory `/opt/local/var/macports/build/_opt_local_var_macports_sources_rsync.macports.org_release_tarballs_ports_graphics_dvisvgm/dvisvgm/work/dvisvgm-2.3.4/libs/variant'
1441:info:build make[3]: Nothing to be done for `all'.
1442:info:build make[3]: Leaving directory `/opt/local/var/macports/build/_opt_local_var_macports_sources_rsync.macports.org_release_tarballs_ports_graphics_dvisvgm/dvisvgm/work/dvisvgm-2.3.4/libs/variant'
1443:info:build Making all in xxHash
1444:info:build make[3]: Entering directory `/opt/local/var/macports/build/_opt_local_var_macports_sources_rsync.macports.org_release_tarballs_ports_graphics_dvisvgm/dvisvgm/work/dvisvgm-2.3.4/libs/xxHash'
1445:info:build make[3]: Nothing to be done for `all'.
1446:info:build make[3]: Leaving directory `/opt/local/var/macports/build/_opt_local_var_macports_sources_rsync.macports.org_release_tarballs_ports_graphics_dvisvgm/dvisvgm/work/dvisvgm-2.3.4/libs/xxHash'
1447:info:build Making all in brotli
1448:info:build make[3]: Entering directory `/opt/local/var/macports/build/_opt_local_var_macports_sources_rsync.macports.org_release_tarballs_ports_graphics_dvisvgm/dvisvgm/work/dvisvgm-2.3.4/libs/brotli'
1449:info:build make[3]: Nothing to be done for `all'.
1450:info:build make[3]: Leaving directory `/opt/local/var/macports/build/_opt_local_var_macports_sources_rsync.macports.org_release_tarballs_ports_graphics_dvisvgm/dvisvgm/work/dvisvgm-2.3.4/libs/brotli'
1451:info:build Making all in ff-woff
1452:info:build make[3]: Entering directory `/opt/local/var/macports/build/_opt_local_var_macports_sources_rsync.macports.org_release_tarballs_ports_graphics_dvisvgm/dvisvgm/work/dvisvgm-2.3.4/libs/ff-woff'
1453:info:build make[3]: Nothing to be done for `all'.
1454:info:build make[3]: Leaving directory `/opt/local/var/macports/build/_opt_local_var_macports_sources_rsync.macports.org_release_tarballs_ports_graphics_dvisvgm/dvisvgm/work/dvisvgm-2.3.4/libs/ff-woff'
1455:info:build Making all in woff2
1456:info:build make[3]: Entering directory `/opt/local/var/macports/build/_opt_local_var_macports_sources_rsync.macports.org_release_tarballs_ports_graphics_dvisvgm/dvisvgm/work/dvisvgm-2.3.4/libs/woff2'
1457:info:build make[3]: Nothing to be done for `all'.
1458:info:build make[3]: Leaving directory `/opt/local/var/macports/build/_opt_local_var_macports_sources_rsync.macports.org_release_tarballs_ports_graphics_dvisvgm/dvisvgm/work/dvisvgm-2.3.4/libs/woff2'
1459:info:build make[3]: Entering directory `/opt/local/var/macports/build/_opt_local_var_macports_sources_rsync.macports.org_release_tarballs_ports_graphics_dvisvgm/dvisvgm/work/dvisvgm-2.3.4/libs'
1460:info:build make[3]: Nothing to be done for `all-am'.
1461:info:build make[3]: Leaving directory `/opt/local/var/macports/build/_opt_local_var_macports_sources_rsync.macports.org_release_tarballs_ports_graphics_dvisvgm/dvisvgm/work/dvisvgm-2.3.4/libs'
1462:info:build make[2]: Leaving directory `/opt/local/var/macports/build/_opt_local_var_macports_sources_rsync.macports.org_release_tarballs_ports_graphics_dvisvgm/dvisvgm/work/dvisvgm-2.3.4/libs'
1463:info:build Making all in src
1464:info:build make[2]: Entering directory `/opt/local/var/macports/build/_opt_local_var_macports_sources_rsync.macports.org_release_tarballs_ports_graphics_dvisvgm/dvisvgm/work/dvisvgm-2.3.4/src'
1465:info:build if test -f psdefs.ps; then \
1466:info:build             ps2c PSInterpreter::PSDEFS psdefs.ps >psdefs.cpp; \
1467:info:build     fi
1468:info:build make[2]: Leaving directory `/opt/local/var/macports/build/_opt_local_var_macports_sources_rsync.macports.org_release_tarballs_ports_graphics_dvisvgm/dvisvgm/work/dvisvgm-2.3.4/src'
1469:info:build Making all in tests
1470:info:build make[2]: Entering directory `/opt/local/var/macports/build/_opt_local_var_macports_sources_rsync.macports.org_release_tarballs_ports_graphics_dvisvgm/dvisvgm/work/dvisvgm-2.3.4/tests'
1471:info:build Making all in data
1472:info:build make[3]: Entering directory `/opt/local/var/macports/build/_opt_local_var_macports_sources_rsync.macports.org_release_tarballs_ports_graphics_dvisvgm/dvisvgm/work/dvisvgm-2.3.4/tests/data'
1473:info:build make[3]: Nothing to be done for `all'.
1474:info:build make[3]: Leaving directory `/opt/local/var/macports/build/_opt_local_var_macports_sources_rsync.macports.org_release_tarballs_ports_graphics_dvisvgm/dvisvgm/work/dvisvgm-2.3.4/tests/data'
1475:info:build make[3]: Entering directory `/opt/local/var/macports/build/_opt_local_var_macports_sources_rsync.macports.org_release_tarballs_ports_graphics_dvisvgm/dvisvgm/work/dvisvgm-2.3.4/tests'
1476:info:build make[3]: Nothing to be done for `all-am'.
1477:info:build make[3]: Leaving directory `/opt/local/var/macports/build/_opt_local_var_macports_sources_rsync.macports.org_release_tarballs_ports_graphics_dvisvgm/dvisvgm/work/dvisvgm-2.3.4/tests'
1478:info:build make[2]: Leaving directory `/opt/local/var/macports/build/_opt_local_var_macports_sources_rsync.macports.org_release_tarballs_ports_graphics_dvisvgm/dvisvgm/work/dvisvgm-2.3.4/tests'
1479:info:build Making all in doc
1480:info:build make[2]: Entering directory `/opt/local/var/macports/build/_opt_local_var_macports_sources_rsync.macports.org_release_tarballs_ports_graphics_dvisvgm/dvisvgm/work/dvisvgm-2.3.4/doc'
1481:info:build if [ `type -p asciidoc` ]; then \
1482:info:build             asciidoc -a icons -a 'iconsdir=.' -a badges -a 'revnumber=2.3.4' --unsafe -bdocbook -dmanpage -o dvisvgm-man.xml.tmp dvisvgm.txt; \
1483:info:build             xsltproc -o dvisvgm-man.xml ../doc/tweak-db-refentry.xsl dvisvgm-man.xml.tmp; \
1484:info:build             rm dvisvgm-man.xml.tmp; \
1485:info:build     fi
1486:info:build if [ `type -p xmlto` ]; then \
1487:info:build             xmlto -m ../doc/conf-dblatex-man.xsl --stringparam man.endnotes.list.enabled=0 --stringparam man.endnotes.are.numbered=0 --stringparam man.authors.section.enabled=0 man dvisvgm-man.xml; \
1488:info:build     fi
1489:info:build Input file /opt/local/var/macports/build/_opt_local_var_macports_sources_rsync.macports.org_release_tarballs_ports_graphics_dvisvgm/dvisvgm/work/dvisvgm-2.3.4/doc/dvisvgm-man.xml not found
1490:info:build make[2]: *** [dvisvgm.1] Error 1
1491:info:build make[2]: Leaving directory `/opt/local/var/macports/build/_opt_local_var_macports_sources_rsync.macports.org_release_tarballs_ports_graphics_dvisvgm/dvisvgm/work/dvisvgm-2.3.4/doc'
1492:info:build make[1]: *** [all-recursive] Error 1
1493:info:build make[1]: Leaving directory `/opt/local/var/macports/build/_opt_local_var_macports_sources_rsync.macports.org_release_tarballs_ports_graphics_dvisvgm/dvisvgm/work/dvisvgm-2.3.4'
1494:info:build make: *** [all] Error 2
1495:info:build make: Leaving directory `/opt/local/var/macports/build/_opt_local_var_macports_sources_rsync.macports.org_release_tarballs_ports_graphics_dvisvgm/dvisvgm/work/dvisvgm-2.3.4'
1496:info:build Command failed:  cd "/opt/local/var/macports/build/_opt_local_var_macports_sources_rsync.macports.org_release_tarballs_ports_graphics_dvisvgm/dvisvgm/work/dvisvgm-2.3.4" && /usr/bin/make -j8 -w all
1497:info:build Exit code: 2
1498:error:build Failed to build dvisvgm: command execution failed
1499:debug:build Error code: CHILDSTATUS 15037 2
1500:debug:build Backtrace: command execution failed
1501:debug:build     while executing
1502:debug:build "system {*}$notty {*}$nice $fullcmdstring"
1503:debug:build     invoked from within
1504:debug:build "command_exec build"
1505:debug:build     (procedure "portbuild::build_main" line 8)
1506:debug:build     invoked from within
1507:debug:build "$procedure $targetname"
1508:error:build See /opt/local/var/macports/logs/_opt_local_var_macports_sources_rsync.macports.org_release_tarballs_ports_graphics_dvisvgm/dvisvgm/main.log for details.
1509version:1
1510:debug:sysinfo macOS 10.13 (darwin/17.7.0) arch i386
1511:debug:sysinfo MacPorts 2.5.3
1512:debug:sysinfo Xcode 10.0
1513:debug:sysinfo SDK 10.13
1514:debug:sysinfo MACOSX_DEPLOYMENT_TARGET: 10.13
1515:msg:main --->  Computing dependencies for dvisvgm:info:main .:debug:main dvisvgm has no conflicts
1516:debug:main Searching for dependency: pkgconfig
1517:debug:main Found Dependency: receipt exists for pkgconfig
1518:debug:main Searching for dependency: freetype
1519:debug:main Found Dependency: receipt exists for freetype
1520:debug:main Searching for dependency: ghostscript
1521:debug:main Found Dependency: receipt exists for ghostscript
1522:debug:main Searching for dependency: potrace
1523:debug:main Found Dependency: receipt exists for potrace
1524:debug:main Searching for dependency: texlive-bin
1525:debug:main Found Dependency: receipt exists for texlive-bin
1526:debug:main Searching for dependency: zlib
1527:debug:main Found Dependency: receipt exists for zlib
1528:debug:main Executing org.macports.main (dvisvgm)
1529:debug:main dropping privileges: euid changed to 502, egid changed to 501.
1530:debug:main Skipping completed org.macports.archivefetch (dvisvgm)
1531:debug:main Privilege de-escalation not attempted as not running as root.
1532:debug:main Skipping completed org.macports.fetch (dvisvgm)
1533:debug:main Privilege de-escalation not attempted as not running as root.
1534:debug:main Skipping completed org.macports.checksum (dvisvgm)
1535:debug:main Privilege de-escalation not attempted as not running as root.
1536:debug:main Skipping completed org.macports.extract (dvisvgm)
1537:debug:main Privilege de-escalation not attempted as not running as root.
1538:debug:main Skipping completed org.macports.patch (dvisvgm)
1539:debug:main Privilege de-escalation not attempted as not running as root.
1540:debug:main Skipping completed org.macports.configure (dvisvgm)
1541:debug:main Privilege de-escalation not attempted as not running as root.
1542:debug:build build phase started at Wed Sep 26 23:09:46 CEST 2018
1543:notice:build --->  Building dvisvgm
1544:debug:build Executing org.macports.build (dvisvgm)
1545:debug:build Environment:
1546:debug:build CC_PRINT_OPTIONS='YES'
1547:debug:build CC_PRINT_OPTIONS_FILE='/opt/local/var/macports/build/_opt_local_var_macports_sources_rsync.macports.org_release_tarballs_ports_graphics_dvisvgm/dvisvgm/work/.CC_PRINT_OPTIONS'
1548:debug:build CPATH='/opt/local/include'
1549:debug:build LIBRARY_PATH='/opt/local/lib'
1550:debug:build MACOSX_DEPLOYMENT_TARGET='10.13'
1551:info:build Executing:  cd "/opt/local/var/macports/build/_opt_local_var_macports_sources_rsync.macports.org_release_tarballs_ports_graphics_dvisvgm/dvisvgm/work/dvisvgm-2.3.4" && /usr/bin/make -j8 -w all
1552:debug:build system:  cd "/opt/local/var/macports/build/_opt_local_var_macports_sources_rsync.macports.org_release_tarballs_ports_graphics_dvisvgm/dvisvgm/work/dvisvgm-2.3.4" && /usr/bin/make -j8 -w all
1553:info:build make: Entering directory `/opt/local/var/macports/build/_opt_local_var_macports_sources_rsync.macports.org_release_tarballs_ports_graphics_dvisvgm/dvisvgm/work/dvisvgm-2.3.4'
1554:info:build /Applications/Xcode.app/Contents/Developer/usr/bin/make  all-recursive
1555:info:build make[1]: Entering directory `/opt/local/var/macports/build/_opt_local_var_macports_sources_rsync.macports.org_release_tarballs_ports_graphics_dvisvgm/dvisvgm/work/dvisvgm-2.3.4'
1556:info:build Making all in libs
1557:info:build make[2]: Entering directory `/opt/local/var/macports/build/_opt_local_var_macports_sources_rsync.macports.org_release_tarballs_ports_graphics_dvisvgm/dvisvgm/work/dvisvgm-2.3.4/libs'
1558:info:build Making all in clipper
1559:info:build make[3]: Entering directory `/opt/local/var/macports/build/_opt_local_var_macports_sources_rsync.macports.org_release_tarballs_ports_graphics_dvisvgm/dvisvgm/work/dvisvgm-2.3.4/libs/clipper'
1560:info:build make[3]: Nothing to be done for `all'.
1561:info:build make[3]: Leaving directory `/opt/local/var/macports/build/_opt_local_var_macports_sources_rsync.macports.org_release_tarballs_ports_graphics_dvisvgm/dvisvgm/work/dvisvgm-2.3.4/libs/clipper'
1562:info:build Making all in variant
1563:info:build make[3]: Entering directory `/opt/local/var/macports/build/_opt_local_var_macports_sources_rsync.macports.org_release_tarballs_ports_graphics_dvisvgm/dvisvgm/work/dvisvgm-2.3.4/libs/variant'
1564:info:build make[3]: Nothing to be done for `all'.
1565:info:build make[3]: Leaving directory `/opt/local/var/macports/build/_opt_local_var_macports_sources_rsync.macports.org_release_tarballs_ports_graphics_dvisvgm/dvisvgm/work/dvisvgm-2.3.4/libs/variant'
1566:info:build Making all in xxHash
1567:info:build make[3]: Entering directory `/opt/local/var/macports/build/_opt_local_var_macports_sources_rsync.macports.org_release_tarballs_ports_graphics_dvisvgm/dvisvgm/work/dvisvgm-2.3.4/libs/xxHash'
1568:info:build make[3]: Nothing to be done for `all'.
1569:info:build make[3]: Leaving directory `/opt/local/var/macports/build/_opt_local_var_macports_sources_rsync.macports.org_release_tarballs_ports_graphics_dvisvgm/dvisvgm/work/dvisvgm-2.3.4/libs/xxHash'
1570:info:build Making all in brotli
1571:info:build make[3]: Entering directory `/opt/local/var/macports/build/_opt_local_var_macports_sources_rsync.macports.org_release_tarballs_ports_graphics_dvisvgm/dvisvgm/work/dvisvgm-2.3.4/libs/brotli'
1572:info:build make[3]: Nothing to be done for `all'.
1573:info:build make[3]: Leaving directory `/opt/local/var/macports/build/_opt_local_var_macports_sources_rsync.macports.org_release_tarballs_ports_graphics_dvisvgm/dvisvgm/work/dvisvgm-2.3.4/libs/brotli'
1574:info:build Making all in ff-woff
1575:info:build make[3]: Entering directory `/opt/local/var/macports/build/_opt_local_var_macports_sources_rsync.macports.org_release_tarballs_ports_graphics_dvisvgm/dvisvgm/work/dvisvgm-2.3.4/libs/ff-woff'
1576:info:build make[3]: Nothing to be done for `all'.
1577:info:build make[3]: Leaving directory `/opt/local/var/macports/build/_opt_local_var_macports_sources_rsync.macports.org_release_tarballs_ports_graphics_dvisvgm/dvisvgm/work/dvisvgm-2.3.4/libs/ff-woff'
1578:info:build Making all in woff2
1579:info:build make[3]: Entering directory `/opt/local/var/macports/build/_opt_local_var_macports_sources_rsync.macports.org_release_tarballs_ports_graphics_dvisvgm/dvisvgm/work/dvisvgm-2.3.4/libs/woff2'
1580:info:build make[3]: Nothing to be done for `all'.
1581:info:build make[3]: Leaving directory `/opt/local/var/macports/build/_opt_local_var_macports_sources_rsync.macports.org_release_tarballs_ports_graphics_dvisvgm/dvisvgm/work/dvisvgm-2.3.4/libs/woff2'
1582:info:build make[3]: Entering directory `/opt/local/var/macports/build/_opt_local_var_macports_sources_rsync.macports.org_release_tarballs_ports_graphics_dvisvgm/dvisvgm/work/dvisvgm-2.3.4/libs'
1583:info:build make[3]: Nothing to be done for `all-am'.
1584:info:build make[3]: Leaving directory `/opt/local/var/macports/build/_opt_local_var_macports_sources_rsync.macports.org_release_tarballs_ports_graphics_dvisvgm/dvisvgm/work/dvisvgm-2.3.4/libs'
1585:info:build make[2]: Leaving directory `/opt/local/var/macports/build/_opt_local_var_macports_sources_rsync.macports.org_release_tarballs_ports_graphics_dvisvgm/dvisvgm/work/dvisvgm-2.3.4/libs'
1586:info:build Making all in src
1587:info:build make[2]: Entering directory `/opt/local/var/macports/build/_opt_local_var_macports_sources_rsync.macports.org_release_tarballs_ports_graphics_dvisvgm/dvisvgm/work/dvisvgm-2.3.4/src'
1588:info:build if test -f psdefs.ps; then \
1589:info:build             ps2c PSInterpreter::PSDEFS psdefs.ps >psdefs.cpp; \
1590:info:build     fi
1591:info:build make[2]: Leaving directory `/opt/local/var/macports/build/_opt_local_var_macports_sources_rsync.macports.org_release_tarballs_ports_graphics_dvisvgm/dvisvgm/work/dvisvgm-2.3.4/src'
1592:info:build Making all in tests
1593:info:build make[2]: Entering directory `/opt/local/var/macports/build/_opt_local_var_macports_sources_rsync.macports.org_release_tarballs_ports_graphics_dvisvgm/dvisvgm/work/dvisvgm-2.3.4/tests'
1594:info:build Making all in data
1595:info:build make[3]: Entering directory `/opt/local/var/macports/build/_opt_local_var_macports_sources_rsync.macports.org_release_tarballs_ports_graphics_dvisvgm/dvisvgm/work/dvisvgm-2.3.4/tests/data'
1596:info:build make[3]: Nothing to be done for `all'.
1597:info:build make[3]: Leaving directory `/opt/local/var/macports/build/_opt_local_var_macports_sources_rsync.macports.org_release_tarballs_ports_graphics_dvisvgm/dvisvgm/work/dvisvgm-2.3.4/tests/data'
1598:info:build make[3]: Entering directory `/opt/local/var/macports/build/_opt_local_var_macports_sources_rsync.macports.org_release_tarballs_ports_graphics_dvisvgm/dvisvgm/work/dvisvgm-2.3.4/tests'
1599:info:build make[3]: Nothing to be done for `all-am'.
1600:info:build make[3]: Leaving directory `/opt/local/var/macports/build/_opt_local_var_macports_sources_rsync.macports.org_release_tarballs_ports_graphics_dvisvgm/dvisvgm/work/dvisvgm-2.3.4/tests'
1601:info:build make[2]: Leaving directory `/opt/local/var/macports/build/_opt_local_var_macports_sources_rsync.macports.org_release_tarballs_ports_graphics_dvisvgm/dvisvgm/work/dvisvgm-2.3.4/tests'
1602:info:build Making all in doc
1603:info:build make[2]: Entering directory `/opt/local/var/macports/build/_opt_local_var_macports_sources_rsync.macports.org_release_tarballs_ports_graphics_dvisvgm/dvisvgm/work/dvisvgm-2.3.4/doc'
1604:info:build if [ `type -p asciidoc` ]; then \
1605:info:build             asciidoc -a icons -a 'iconsdir=.' -a badges -a 'revnumber=2.3.4' --unsafe -bdocbook -dmanpage -o dvisvgm-man.xml.tmp dvisvgm.txt; \
1606:info:build             xsltproc -o dvisvgm-man.xml ../doc/tweak-db-refentry.xsl dvisvgm-man.xml.tmp; \
1607:info:build             rm dvisvgm-man.xml.tmp; \
1608:info:build     fi
1609:info:build if [ `type -p xmlto` ]; then \
1610:info:build             xmlto -m ../doc/conf-dblatex-man.xsl --stringparam man.endnotes.list.enabled=0 --stringparam man.endnotes.are.numbered=0 --stringparam man.authors.section.enabled=0 man dvisvgm-man.xml; \
1611:info:build     fi
1612:info:build Input file /opt/local/var/macports/build/_opt_local_var_macports_sources_rsync.macports.org_release_tarballs_ports_graphics_dvisvgm/dvisvgm/work/dvisvgm-2.3.4/doc/dvisvgm-man.xml not found
1613:info:build make[2]: *** [dvisvgm.1] Error 1
1614:info:build make[2]: Leaving directory `/opt/local/var/macports/build/_opt_local_var_macports_sources_rsync.macports.org_release_tarballs_ports_graphics_dvisvgm/dvisvgm/work/dvisvgm-2.3.4/doc'
1615:info:build make[1]: *** [all-recursive] Error 1
1616:info:build make[1]: Leaving directory `/opt/local/var/macports/build/_opt_local_var_macports_sources_rsync.macports.org_release_tarballs_ports_graphics_dvisvgm/dvisvgm/work/dvisvgm-2.3.4'
1617:info:build make: *** [all] Error 2
1618:info:build make: Leaving directory `/opt/local/var/macports/build/_opt_local_var_macports_sources_rsync.macports.org_release_tarballs_ports_graphics_dvisvgm/dvisvgm/work/dvisvgm-2.3.4'
1619:info:build Command failed:  cd "/opt/local/var/macports/build/_opt_local_var_macports_sources_rsync.macports.org_release_tarballs_ports_graphics_dvisvgm/dvisvgm/work/dvisvgm-2.3.4" && /usr/bin/make -j8 -w all
1620:info:build Exit code: 2
1621:error:build Failed to build dvisvgm: command execution failed
1622:debug:build Error code: CHILDSTATUS 71805 2
1623:debug:build Backtrace: command execution failed
1624:debug:build     while executing
1625:debug:build "system {*}$notty {*}$nice $fullcmdstring"
1626:debug:build     invoked from within
1627:debug:build "command_exec build"
1628:debug:build     (procedure "portbuild::build_main" line 8)
1629:debug:build     invoked from within
1630:debug:build "$procedure $targetname"
1631:error:build See /opt/local/var/macports/logs/_opt_local_var_macports_sources_rsync.macports.org_release_tarballs_ports_graphics_dvisvgm/dvisvgm/main.log for details.
1632version:1
1633:debug:sysinfo macOS 10.13 (darwin/17.7.0) arch i386
1634:debug:sysinfo MacPorts 2.5.3
1635:debug:sysinfo Xcode 10.0
1636:debug:sysinfo SDK 10.13
1637:debug:sysinfo MACOSX_DEPLOYMENT_TARGET: 10.13
1638:msg:main --->  Computing dependencies for dvisvgm:info:main .:debug:main dvisvgm has no conflicts
1639:debug:main Searching for dependency: pkgconfig
1640:debug:main Found Dependency: receipt exists for pkgconfig
1641:debug:main Searching for dependency: freetype
1642:debug:main Found Dependency: receipt exists for freetype
1643:debug:main Searching for dependency: ghostscript
1644:debug:main Found Dependency: receipt exists for ghostscript
1645:debug:main Searching for dependency: potrace
1646:debug:main Found Dependency: receipt exists for potrace
1647:debug:main Searching for dependency: texlive-bin
1648:debug:main Found Dependency: receipt exists for texlive-bin
1649:debug:main Searching for dependency: zlib
1650:debug:main Found Dependency: receipt exists for zlib
1651:debug:main Executing org.macports.main (dvisvgm)
1652:debug:main dropping privileges: euid changed to 502, egid changed to 501.
1653:debug:main Skipping completed org.macports.archivefetch (dvisvgm)
1654:debug:main Privilege de-escalation not attempted as not running as root.
1655:debug:main Skipping completed org.macports.fetch (dvisvgm)
1656:debug:main Privilege de-escalation not attempted as not running as root.
1657:debug:main Skipping completed org.macports.checksum (dvisvgm)
1658:debug:main Privilege de-escalation not attempted as not running as root.
1659:debug:main Skipping completed org.macports.extract (dvisvgm)
1660:debug:main Privilege de-escalation not attempted as not running as root.
1661:debug:main Skipping completed org.macports.patch (dvisvgm)
1662:debug:main Privilege de-escalation not attempted as not running as root.
1663:debug:main Skipping completed org.macports.configure (dvisvgm)
1664:debug:main Privilege de-escalation not attempted as not running as root.
1665:debug:build build phase started at Wed Sep 26 23:10:57 CEST 2018
1666:notice:build --->  Building dvisvgm
1667:debug:build Executing org.macports.build (dvisvgm)
1668:debug:build Environment:
1669:debug:build CC_PRINT_OPTIONS='YES'
1670:debug:build CC_PRINT_OPTIONS_FILE='/opt/local/var/macports/build/_opt_local_var_macports_sources_rsync.macports.org_release_tarballs_ports_graphics_dvisvgm/dvisvgm/work/.CC_PRINT_OPTIONS'
1671:debug:build CPATH='/opt/local/include'
1672:debug:build LIBRARY_PATH='/opt/local/lib'
1673:debug:build MACOSX_DEPLOYMENT_TARGET='10.13'
1674:info:build Executing:  cd "/opt/local/var/macports/build/_opt_local_var_macports_sources_rsync.macports.org_release_tarballs_ports_graphics_dvisvgm/dvisvgm/work/dvisvgm-2.3.4" && /usr/bin/make -j8 -w all
1675:debug:build system:  cd "/opt/local/var/macports/build/_opt_local_var_macports_sources_rsync.macports.org_release_tarballs_ports_graphics_dvisvgm/dvisvgm/work/dvisvgm-2.3.4" && /usr/bin/make -j8 -w all
1676:info:build make: Entering directory `/opt/local/var/macports/build/_opt_local_var_macports_sources_rsync.macports.org_release_tarballs_ports_graphics_dvisvgm/dvisvgm/work/dvisvgm-2.3.4'
1677:info:build /Applications/Xcode.app/Contents/Developer/usr/bin/make  all-recursive
1678:info:build make[1]: Entering directory `/opt/local/var/macports/build/_opt_local_var_macports_sources_rsync.macports.org_release_tarballs_ports_graphics_dvisvgm/dvisvgm/work/dvisvgm-2.3.4'
1679:info:build Making all in libs
1680:info:build make[2]: Entering directory `/opt/local/var/macports/build/_opt_local_var_macports_sources_rsync.macports.org_release_tarballs_ports_graphics_dvisvgm/dvisvgm/work/dvisvgm-2.3.4/libs'
1681:info:build Making all in clipper
1682:info:build make[3]: Entering directory `/opt/local/var/macports/build/_opt_local_var_macports_sources_rsync.macports.org_release_tarballs_ports_graphics_dvisvgm/dvisvgm/work/dvisvgm-2.3.4/libs/clipper'
1683:info:build make[3]: Nothing to be done for `all'.
1684:info:build make[3]: Leaving directory `/opt/local/var/macports/build/_opt_local_var_macports_sources_rsync.macports.org_release_tarballs_ports_graphics_dvisvgm/dvisvgm/work/dvisvgm-2.3.4/libs/clipper'
1685:info:build Making all in variant
1686:info:build make[3]: Entering directory `/opt/local/var/macports/build/_opt_local_var_macports_sources_rsync.macports.org_release_tarballs_ports_graphics_dvisvgm/dvisvgm/work/dvisvgm-2.3.4/libs/variant'
1687:info:build make[3]: Nothing to be done for `all'.
1688:info:build make[3]: Leaving directory `/opt/local/var/macports/build/_opt_local_var_macports_sources_rsync.macports.org_release_tarballs_ports_graphics_dvisvgm/dvisvgm/work/dvisvgm-2.3.4/libs/variant'
1689:info:build Making all in xxHash
1690:info:build make[3]: Entering directory `/opt/local/var/macports/build/_opt_local_var_macports_sources_rsync.macports.org_release_tarballs_ports_graphics_dvisvgm/dvisvgm/work/dvisvgm-2.3.4/libs/xxHash'
1691:info:build make[3]: Nothing to be done for `all'.
1692:info:build make[3]: Leaving directory `/opt/local/var/macports/build/_opt_local_var_macports_sources_rsync.macports.org_release_tarballs_ports_graphics_dvisvgm/dvisvgm/work/dvisvgm-2.3.4/libs/xxHash'
1693:info:build Making all in brotli
1694:info:build make[3]: Entering directory `/opt/local/var/macports/build/_opt_local_var_macports_sources_rsync.macports.org_release_tarballs_ports_graphics_dvisvgm/dvisvgm/work/dvisvgm-2.3.4/libs/brotli'
1695:info:build make[3]: Nothing to be done for `all'.
1696:info:build make[3]: Leaving directory `/opt/local/var/macports/build/_opt_local_var_macports_sources_rsync.macports.org_release_tarballs_ports_graphics_dvisvgm/dvisvgm/work/dvisvgm-2.3.4/libs/brotli'
1697:info:build Making all in ff-woff
1698:info:build make[3]: Entering directory `/opt/local/var/macports/build/_opt_local_var_macports_sources_rsync.macports.org_release_tarballs_ports_graphics_dvisvgm/dvisvgm/work/dvisvgm-2.3.4/libs/ff-woff'
1699:info:build make[3]: Nothing to be done for `all'.
1700:info:build make[3]: Leaving directory `/opt/local/var/macports/build/_opt_local_var_macports_sources_rsync.macports.org_release_tarballs_ports_graphics_dvisvgm/dvisvgm/work/dvisvgm-2.3.4/libs/ff-woff'
1701:info:build Making all in woff2
1702:info:build make[3]: Entering directory `/opt/local/var/macports/build/_opt_local_var_macports_sources_rsync.macports.org_release_tarballs_ports_graphics_dvisvgm/dvisvgm/work/dvisvgm-2.3.4/libs/woff2'
1703:info:build make[3]: Nothing to be done for `all'.
1704:info:build make[3]: Leaving directory `/opt/local/var/macports/build/_opt_local_var_macports_sources_rsync.macports.org_release_tarballs_ports_graphics_dvisvgm/dvisvgm/work/dvisvgm-2.3.4/libs/woff2'
1705:info:build make[3]: Entering directory `/opt/local/var/macports/build/_opt_local_var_macports_sources_rsync.macports.org_release_tarballs_ports_graphics_dvisvgm/dvisvgm/work/dvisvgm-2.3.4/libs'
1706:info:build make[3]: Nothing to be done for `all-am'.
1707:info:build make[3]: Leaving directory `/opt/local/var/macports/build/_opt_local_var_macports_sources_rsync.macports.org_release_tarballs_ports_graphics_dvisvgm/dvisvgm/work/dvisvgm-2.3.4/libs'
1708:info:build make[2]: Leaving directory `/opt/local/var/macports/build/_opt_local_var_macports_sources_rsync.macports.org_release_tarballs_ports_graphics_dvisvgm/dvisvgm/work/dvisvgm-2.3.4/libs'
1709:info:build Making all in src
1710:info:build make[2]: Entering directory `/opt/local/var/macports/build/_opt_local_var_macports_sources_rsync.macports.org_release_tarballs_ports_graphics_dvisvgm/dvisvgm/work/dvisvgm-2.3.4/src'
1711:info:build if test -f psdefs.ps; then \
1712:info:build             ps2c PSInterpreter::PSDEFS psdefs.ps >psdefs.cpp; \
1713:info:build     fi
1714:info:build make[2]: Leaving directory `/opt/local/var/macports/build/_opt_local_var_macports_sources_rsync.macports.org_release_tarballs_ports_graphics_dvisvgm/dvisvgm/work/dvisvgm-2.3.4/src'
1715:info:build Making all in tests
1716:info:build make[2]: Entering directory `/opt/local/var/macports/build/_opt_local_var_macports_sources_rsync.macports.org_release_tarballs_ports_graphics_dvisvgm/dvisvgm/work/dvisvgm-2.3.4/tests'
1717:info:build Making all in data
1718:info:build make[3]: Entering directory `/opt/local/var/macports/build/_opt_local_var_macports_sources_rsync.macports.org_release_tarballs_ports_graphics_dvisvgm/dvisvgm/work/dvisvgm-2.3.4/tests/data'
1719:info:build make[3]: Nothing to be done for `all'.
1720:info:build make[3]: Leaving directory `/opt/local/var/macports/build/_opt_local_var_macports_sources_rsync.macports.org_release_tarballs_ports_graphics_dvisvgm/dvisvgm/work/dvisvgm-2.3.4/tests/data'
1721:info:build make[3]: Entering directory `/opt/local/var/macports/build/_opt_local_var_macports_sources_rsync.macports.org_release_tarballs_ports_graphics_dvisvgm/dvisvgm/work/dvisvgm-2.3.4/tests'
1722:info:build make[3]: Nothing to be done for `all-am'.
1723:info:build make[3]: Leaving directory `/opt/local/var/macports/build/_opt_local_var_macports_sources_rsync.macports.org_release_tarballs_ports_graphics_dvisvgm/dvisvgm/work/dvisvgm-2.3.4/tests'
1724:info:build make[2]: Leaving directory `/opt/local/var/macports/build/_opt_local_var_macports_sources_rsync.macports.org_release_tarballs_ports_graphics_dvisvgm/dvisvgm/work/dvisvgm-2.3.4/tests'
1725:info:build Making all in doc
1726:info:build make[2]: Entering directory `/opt/local/var/macports/build/_opt_local_var_macports_sources_rsync.macports.org_release_tarballs_ports_graphics_dvisvgm/dvisvgm/work/dvisvgm-2.3.4/doc'
1727:info:build if [ `type -p asciidoc` ]; then \
1728:info:build             asciidoc -a icons -a 'iconsdir=.' -a badges -a 'revnumber=2.3.4' --unsafe -bdocbook -dmanpage -o dvisvgm-man.xml.tmp dvisvgm.txt; \
1729:info:build             xsltproc -o dvisvgm-man.xml ../doc/tweak-db-refentry.xsl dvisvgm-man.xml.tmp; \
1730:info:build             rm dvisvgm-man.xml.tmp; \
1731:info:build     fi
1732:info:build if [ `type -p xmlto` ]; then \
1733:info:build             xmlto -m ../doc/conf-dblatex-man.xsl --stringparam man.endnotes.list.enabled=0 --stringparam man.endnotes.are.numbered=0 --stringparam man.authors.section.enabled=0 man dvisvgm-man.xml; \
1734:info:build     fi
1735:info:build Input file /opt/local/var/macports/build/_opt_local_var_macports_sources_rsync.macports.org_release_tarballs_ports_graphics_dvisvgm/dvisvgm/work/dvisvgm-2.3.4/doc/dvisvgm-man.xml not found
1736:info:build make[2]: *** [dvisvgm.1] Error 1
1737:info:build make[2]: Leaving directory `/opt/local/var/macports/build/_opt_local_var_macports_sources_rsync.macports.org_release_tarballs_ports_graphics_dvisvgm/dvisvgm/work/dvisvgm-2.3.4/doc'
1738:info:build make[1]: *** [all-recursive] Error 1
1739:info:build make[1]: Leaving directory `/opt/local/var/macports/build/_opt_local_var_macports_sources_rsync.macports.org_release_tarballs_ports_graphics_dvisvgm/dvisvgm/work/dvisvgm-2.3.4'
1740:info:build make: *** [all] Error 2
1741:info:build make: Leaving directory `/opt/local/var/macports/build/_opt_local_var_macports_sources_rsync.macports.org_release_tarballs_ports_graphics_dvisvgm/dvisvgm/work/dvisvgm-2.3.4'
1742:info:build Command failed:  cd "/opt/local/var/macports/build/_opt_local_var_macports_sources_rsync.macports.org_release_tarballs_ports_graphics_dvisvgm/dvisvgm/work/dvisvgm-2.3.4" && /usr/bin/make -j8 -w all
1743:info:build Exit code: 2
1744:error:build Failed to build dvisvgm: command execution failed
1745:debug:build Error code: CHILDSTATUS 71910 2
1746:debug:build Backtrace: command execution failed
1747:debug:build     while executing
1748:debug:build "system {*}$notty {*}$nice $fullcmdstring"
1749:debug:build     invoked from within
1750:debug:build "command_exec build"
1751:debug:build     (procedure "portbuild::build_main" line 8)
1752:debug:build     invoked from within
1753:debug:build "$procedure $targetname"
1754:error:build See /opt/local/var/macports/logs/_opt_local_var_macports_sources_rsync.macports.org_release_tarballs_ports_graphics_dvisvgm/dvisvgm/main.log for details.
1755version:1
1756:debug:sysinfo macOS 10.13 (darwin/17.7.0) arch i386
1757:debug:sysinfo MacPorts 2.5.3
1758:debug:sysinfo Xcode 10.0
1759:debug:sysinfo SDK 10.13
1760:debug:sysinfo MACOSX_DEPLOYMENT_TARGET: 10.13
1761:msg:main --->  Computing dependencies for dvisvgm:info:main .:debug:main dvisvgm has no conflicts
1762:debug:main Searching for dependency: pkgconfig
1763:debug:main Found Dependency: receipt exists for pkgconfig
1764:debug:main Searching for dependency: freetype
1765:debug:main Found Dependency: receipt exists for freetype
1766:debug:main Searching for dependency: ghostscript
1767:debug:main Found Dependency: receipt exists for ghostscript
1768:debug:main Searching for dependency: potrace
1769:debug:main Found Dependency: receipt exists for potrace
1770:debug:main Searching for dependency: texlive-bin
1771:debug:main Found Dependency: receipt exists for texlive-bin
1772:debug:main Searching for dependency: zlib
1773:debug:main Found Dependency: receipt exists for zlib
1774:debug:main Executing org.macports.main (dvisvgm)
1775:debug:main dropping privileges: euid changed to 502, egid changed to 501.
1776:debug:main Skipping completed org.macports.archivefetch (dvisvgm)
1777:debug:main Privilege de-escalation not attempted as not running as root.
1778:debug:main Skipping completed org.macports.fetch (dvisvgm)
1779:debug:main Privilege de-escalation not attempted as not running as root.
1780:debug:main Skipping completed org.macports.checksum (dvisvgm)
1781:debug:main Privilege de-escalation not attempted as not running as root.
1782:debug:main Skipping completed org.macports.extract (dvisvgm)
1783:debug:main Privilege de-escalation not attempted as not running as root.
1784:debug:main Skipping completed org.macports.patch (dvisvgm)
1785:debug:main Privilege de-escalation not attempted as not running as root.
1786:debug:main Skipping completed org.macports.configure (dvisvgm)
1787:debug:main Privilege de-escalation not attempted as not running as root.
1788:debug:build build phase started at Wed Sep 26 23:11:14 CEST 2018
1789:notice:build --->  Building dvisvgm
1790:debug:build Executing org.macports.build (dvisvgm)
1791:debug:build Environment:
1792:debug:build CC_PRINT_OPTIONS='YES'
1793:debug:build CC_PRINT_OPTIONS_FILE='/opt/local/var/macports/build/_opt_local_var_macports_sources_rsync.macports.org_release_tarballs_ports_graphics_dvisvgm/dvisvgm/work/.CC_PRINT_OPTIONS'
1794:debug:build CPATH='/opt/local/include'
1795:debug:build LIBRARY_PATH='/opt/local/lib'
1796:debug:build MACOSX_DEPLOYMENT_TARGET='10.13'
1797:info:build Executing:  cd "/opt/local/var/macports/build/_opt_local_var_macports_sources_rsync.macports.org_release_tarballs_ports_graphics_dvisvgm/dvisvgm/work/dvisvgm-2.3.4" && /usr/bin/make -j8 -w all
1798:debug:build system:  cd "/opt/local/var/macports/build/_opt_local_var_macports_sources_rsync.macports.org_release_tarballs_ports_graphics_dvisvgm/dvisvgm/work/dvisvgm-2.3.4" && /usr/bin/make -j8 -w all
1799:info:build make: Entering directory `/opt/local/var/macports/build/_opt_local_var_macports_sources_rsync.macports.org_release_tarballs_ports_graphics_dvisvgm/dvisvgm/work/dvisvgm-2.3.4'
1800:info:build /Applications/Xcode.app/Contents/Developer/usr/bin/make  all-recursive
1801:info:build make[1]: Entering directory `/opt/local/var/macports/build/_opt_local_var_macports_sources_rsync.macports.org_release_tarballs_ports_graphics_dvisvgm/dvisvgm/work/dvisvgm-2.3.4'
1802:info:build Making all in libs
1803:info:build make[2]: Entering directory `/opt/local/var/macports/build/_opt_local_var_macports_sources_rsync.macports.org_release_tarballs_ports_graphics_dvisvgm/dvisvgm/work/dvisvgm-2.3.4/libs'
1804:info:build Making all in clipper
1805:info:build make[3]: Entering directory `/opt/local/var/macports/build/_opt_local_var_macports_sources_rsync.macports.org_release_tarballs_ports_graphics_dvisvgm/dvisvgm/work/dvisvgm-2.3.4/libs/clipper'
1806:info:build make[3]: Nothing to be done for `all'.
1807:info:build make[3]: Leaving directory `/opt/local/var/macports/build/_opt_local_var_macports_sources_rsync.macports.org_release_tarballs_ports_graphics_dvisvgm/dvisvgm/work/dvisvgm-2.3.4/libs/clipper'
1808:info:build Making all in variant
1809:info:build make[3]: Entering directory `/opt/local/var/macports/build/_opt_local_var_macports_sources_rsync.macports.org_release_tarballs_ports_graphics_dvisvgm/dvisvgm/work/dvisvgm-2.3.4/libs/variant'
1810:info:build make[3]: Nothing to be done for `all'.
1811:info:build make[3]: Leaving directory `/opt/local/var/macports/build/_opt_local_var_macports_sources_rsync.macports.org_release_tarballs_ports_graphics_dvisvgm/dvisvgm/work/dvisvgm-2.3.4/libs/variant'
1812:info:build Making all in xxHash
1813:info:build make[3]: Entering directory `/opt/local/var/macports/build/_opt_local_var_macports_sources_rsync.macports.org_release_tarballs_ports_graphics_dvisvgm/dvisvgm/work/dvisvgm-2.3.4/libs/xxHash'
1814:info:build make[3]: Nothing to be done for `all'.
1815:info:build make[3]: Leaving directory `/opt/local/var/macports/build/_opt_local_var_macports_sources_rsync.macports.org_release_tarballs_ports_graphics_dvisvgm/dvisvgm/work/dvisvgm-2.3.4/libs/xxHash'
1816:info:build Making all in brotli
1817:info:build make[3]: Entering directory `/opt/local/var/macports/build/_opt_local_var_macports_sources_rsync.macports.org_release_tarballs_ports_graphics_dvisvgm/dvisvgm/work/dvisvgm-2.3.4/libs/brotli'
1818:info:build make[3]: Nothing to be done for `all'.
1819:info:build make[3]: Leaving directory `/opt/local/var/macports/build/_opt_local_var_macports_sources_rsync.macports.org_release_tarballs_ports_graphics_dvisvgm/dvisvgm/work/dvisvgm-2.3.4/libs/brotli'
1820:info:build Making all in ff-woff
1821:info:build make[3]: Entering directory `/opt/local/var/macports/build/_opt_local_var_macports_sources_rsync.macports.org_release_tarballs_ports_graphics_dvisvgm/dvisvgm/work/dvisvgm-2.3.4/libs/ff-woff'
1822:info:build make[3]: Nothing to be done for `all'.
1823:info:build make[3]: Leaving directory `/opt/local/var/macports/build/_opt_local_var_macports_sources_rsync.macports.org_release_tarballs_ports_graphics_dvisvgm/dvisvgm/work/dvisvgm-2.3.4/libs/ff-woff'
1824:info:build Making all in woff2
1825:info:build make[3]: Entering directory `/opt/local/var/macports/build/_opt_local_var_macports_sources_rsync.macports.org_release_tarballs_ports_graphics_dvisvgm/dvisvgm/work/dvisvgm-2.3.4/libs/woff2'
1826:info:build make[3]: Nothing to be done for `all'.
1827:info:build make[3]: Leaving directory `/opt/local/var/macports/build/_opt_local_var_macports_sources_rsync.macports.org_release_tarballs_ports_graphics_dvisvgm/dvisvgm/work/dvisvgm-2.3.4/libs/woff2'
1828:info:build make[3]: Entering directory `/opt/local/var/macports/build/_opt_local_var_macports_sources_rsync.macports.org_release_tarballs_ports_graphics_dvisvgm/dvisvgm/work/dvisvgm-2.3.4/libs'
1829:info:build make[3]: Nothing to be done for `all-am'.
1830:info:build make[3]: Leaving directory `/opt/local/var/macports/build/_opt_local_var_macports_sources_rsync.macports.org_release_tarballs_ports_graphics_dvisvgm/dvisvgm/work/dvisvgm-2.3.4/libs'
1831:info:build make[2]: Leaving directory `/opt/local/var/macports/build/_opt_local_var_macports_sources_rsync.macports.org_release_tarballs_ports_graphics_dvisvgm/dvisvgm/work/dvisvgm-2.3.4/libs'
1832:info:build Making all in src
1833:info:build make[2]: Entering directory `/opt/local/var/macports/build/_opt_local_var_macports_sources_rsync.macports.org_release_tarballs_ports_graphics_dvisvgm/dvisvgm/work/dvisvgm-2.3.4/src'
1834:info:build if test -f psdefs.ps; then \
1835:info:build             ps2c PSInterpreter::PSDEFS psdefs.ps >psdefs.cpp; \
1836:info:build     fi
1837:info:build make[2]: Leaving directory `/opt/local/var/macports/build/_opt_local_var_macports_sources_rsync.macports.org_release_tarballs_ports_graphics_dvisvgm/dvisvgm/work/dvisvgm-2.3.4/src'
1838:info:build Making all in tests
1839:info:build make[2]: Entering directory `/opt/local/var/macports/build/_opt_local_var_macports_sources_rsync.macports.org_release_tarballs_ports_graphics_dvisvgm/dvisvgm/work/dvisvgm-2.3.4/tests'
1840:info:build Making all in data
1841:info:build make[3]: Entering directory `/opt/local/var/macports/build/_opt_local_var_macports_sources_rsync.macports.org_release_tarballs_ports_graphics_dvisvgm/dvisvgm/work/dvisvgm-2.3.4/tests/data'
1842:info:build make[3]: Nothing to be done for `all'.
1843:info:build make[3]: Leaving directory `/opt/local/var/macports/build/_opt_local_var_macports_sources_rsync.macports.org_release_tarballs_ports_graphics_dvisvgm/dvisvgm/work/dvisvgm-2.3.4/tests/data'
1844:info:build make[3]: Entering directory `/opt/local/var/macports/build/_opt_local_var_macports_sources_rsync.macports.org_release_tarballs_ports_graphics_dvisvgm/dvisvgm/work/dvisvgm-2.3.4/tests'
1845:info:build make[3]: Nothing to be done for `all-am'.
1846:info:build make[3]: Leaving directory `/opt/local/var/macports/build/_opt_local_var_macports_sources_rsync.macports.org_release_tarballs_ports_graphics_dvisvgm/dvisvgm/work/dvisvgm-2.3.4/tests'
1847:info:build make[2]: Leaving directory `/opt/local/var/macports/build/_opt_local_var_macports_sources_rsync.macports.org_release_tarballs_ports_graphics_dvisvgm/dvisvgm/work/dvisvgm-2.3.4/tests'
1848:info:build Making all in doc
1849:info:build make[2]: Entering directory `/opt/local/var/macports/build/_opt_local_var_macports_sources_rsync.macports.org_release_tarballs_ports_graphics_dvisvgm/dvisvgm/work/dvisvgm-2.3.4/doc'
1850:info:build if [ `type -p asciidoc` ]; then \
1851:info:build             asciidoc -a icons -a 'iconsdir=.' -a badges -a 'revnumber=2.3.4' --unsafe -bdocbook -dmanpage -o dvisvgm-man.xml.tmp dvisvgm.txt; \
1852:info:build             xsltproc -o dvisvgm-man.xml ../doc/tweak-db-refentry.xsl dvisvgm-man.xml.tmp; \
1853:info:build             rm dvisvgm-man.xml.tmp; \
1854:info:build     fi
1855:info:build if [ `type -p xmlto` ]; then \
1856:info:build             xmlto -m ../doc/conf-dblatex-man.xsl --stringparam man.endnotes.list.enabled=0 --stringparam man.endnotes.are.numbered=0 --stringparam man.authors.section.enabled=0 man dvisvgm-man.xml; \
1857:info:build     fi
1858:info:build Input file /opt/local/var/macports/build/_opt_local_var_macports_sources_rsync.macports.org_release_tarballs_ports_graphics_dvisvgm/dvisvgm/work/dvisvgm-2.3.4/doc/dvisvgm-man.xml not found
1859:info:build make[2]: *** [dvisvgm.1] Error 1
1860:info:build make[2]: Leaving directory `/opt/local/var/macports/build/_opt_local_var_macports_sources_rsync.macports.org_release_tarballs_ports_graphics_dvisvgm/dvisvgm/work/dvisvgm-2.3.4/doc'
1861:info:build make[1]: *** [all-recursive] Error 1
1862:info:build make[1]: Leaving directory `/opt/local/var/macports/build/_opt_local_var_macports_sources_rsync.macports.org_release_tarballs_ports_graphics_dvisvgm/dvisvgm/work/dvisvgm-2.3.4'
1863:info:build make: *** [all] Error 2
1864:info:build make: Leaving directory `/opt/local/var/macports/build/_opt_local_var_macports_sources_rsync.macports.org_release_tarballs_ports_graphics_dvisvgm/dvisvgm/work/dvisvgm-2.3.4'
1865:info:build Command failed:  cd "/opt/local/var/macports/build/_opt_local_var_macports_sources_rsync.macports.org_release_tarballs_ports_graphics_dvisvgm/dvisvgm/work/dvisvgm-2.3.4" && /usr/bin/make -j8 -w all
1866:info:build Exit code: 2
1867:error:build Failed to build dvisvgm: command execution failed
1868:debug:build Error code: CHILDSTATUS 72007 2
1869:debug:build Backtrace: command execution failed
1870:debug:build     while executing
1871:debug:build "system {*}$notty {*}$nice $fullcmdstring"
1872:debug:build     invoked from within
1873:debug:build "command_exec build"
1874:debug:build     (procedure "portbuild::build_main" line 8)
1875:debug:build     invoked from within
1876:debug:build "$procedure $targetname"
1877:error:build See /opt/local/var/macports/logs/_opt_local_var_macports_sources_rsync.macports.org_release_tarballs_ports_graphics_dvisvgm/dvisvgm/main.log for details.
1878version:1
1879:debug:sysinfo macOS 10.13 (darwin/17.7.0) arch i386
1880:debug:sysinfo MacPorts 2.5.3
1881:debug:sysinfo Xcode 10.0
1882:debug:sysinfo SDK 10.13
1883:debug:sysinfo MACOSX_DEPLOYMENT_TARGET: 10.13
1884:debug:clean Attempting ln -sf /opt/local/var/macports/build/_opt_local_var_macports_sources_rsync.macports.org_release_tarballs_ports_graphics_dvisvgm/dvisvgm/work /opt/local/var/macports/sources/rsync.macports.org/release/tarballs/ports/graphics/dvisvgm/work
1885:debug:clean dropping privileges: euid changed to 502, egid changed to 501.
1886:debug:main Executing org.macports.main (dvisvgm)
1887:debug:main Privilege de-escalation not attempted as not running as root.
1888:debug:main Skipping completed org.macports.archivefetch (dvisvgm)
1889:debug:main Privilege de-escalation not attempted as not running as root.
1890:debug:main Skipping completed org.macports.fetch (dvisvgm)
1891:debug:main Privilege de-escalation not attempted as not running as root.
1892:debug:main Skipping completed org.macports.checksum (dvisvgm)
1893:debug:main Privilege de-escalation not attempted as not running as root.
1894:debug:main Skipping completed org.macports.extract (dvisvgm)
1895:debug:main Privilege de-escalation not attempted as not running as root.
1896:debug:main Skipping completed org.macports.patch (dvisvgm)
1897:debug:main Privilege de-escalation not attempted as not running as root.
1898:debug:main Skipping completed org.macports.configure (dvisvgm)
1899:debug:main Privilege de-escalation not attempted as not running as root.
1900:debug:build build phase started at Fri Sep 28 09:35:18 CEST 2018
1901:notice:build --->  Building dvisvgm
1902:debug:build Executing org.macports.build (dvisvgm)
1903:debug:build Environment:
1904:debug:build CC_PRINT_OPTIONS='YES'
1905:debug:build CC_PRINT_OPTIONS_FILE='/opt/local/var/macports/build/_opt_local_var_macports_sources_rsync.macports.org_release_tarballs_ports_graphics_dvisvgm/dvisvgm/work/.CC_PRINT_OPTIONS'
1906:debug:build CPATH='/opt/local/include'
1907:debug:build LIBRARY_PATH='/opt/local/lib'
1908:debug:build MACOSX_DEPLOYMENT_TARGET='10.13'
1909:info:build Executing:  cd "/opt/local/var/macports/build/_opt_local_var_macports_sources_rsync.macports.org_release_tarballs_ports_graphics_dvisvgm/dvisvgm/work/dvisvgm-2.3.4" && /usr/bin/make -j8 -w all
1910:debug:build system:  cd "/opt/local/var/macports/build/_opt_local_var_macports_sources_rsync.macports.org_release_tarballs_ports_graphics_dvisvgm/dvisvgm/work/dvisvgm-2.3.4" && /usr/bin/make -j8 -w all
1911:info:build make: Entering directory `/opt/local/var/macports/build/_opt_local_var_macports_sources_rsync.macports.org_release_tarballs_ports_graphics_dvisvgm/dvisvgm/work/dvisvgm-2.3.4'
1912:info:build /Applications/Xcode.app/Contents/Developer/usr/bin/make  all-recursive
1913:info:build make[1]: Entering directory `/opt/local/var/macports/build/_opt_local_var_macports_sources_rsync.macports.org_release_tarballs_ports_graphics_dvisvgm/dvisvgm/work/dvisvgm-2.3.4'
1914:info:build Making all in libs
1915:info:build make[2]: Entering directory `/opt/local/var/macports/build/_opt_local_var_macports_sources_rsync.macports.org_release_tarballs_ports_graphics_dvisvgm/dvisvgm/work/dvisvgm-2.3.4/libs'
1916:info:build Making all in clipper
1917:info:build make[3]: Entering directory `/opt/local/var/macports/build/_opt_local_var_macports_sources_rsync.macports.org_release_tarballs_ports_graphics_dvisvgm/dvisvgm/work/dvisvgm-2.3.4/libs/clipper'
1918:info:build make[3]: Nothing to be done for `all'.
1919:info:build make[3]: Leaving directory `/opt/local/var/macports/build/_opt_local_var_macports_sources_rsync.macports.org_release_tarballs_ports_graphics_dvisvgm/dvisvgm/work/dvisvgm-2.3.4/libs/clipper'
1920:info:build Making all in variant
1921:info:build make[3]: Entering directory `/opt/local/var/macports/build/_opt_local_var_macports_sources_rsync.macports.org_release_tarballs_ports_graphics_dvisvgm/dvisvgm/work/dvisvgm-2.3.4/libs/variant'
1922:info:build make[3]: Nothing to be done for `all'.
1923:info:build make[3]: Leaving directory `/opt/local/var/macports/build/_opt_local_var_macports_sources_rsync.macports.org_release_tarballs_ports_graphics_dvisvgm/dvisvgm/work/dvisvgm-2.3.4/libs/variant'
1924:info:build Making all in xxHash
1925:info:build make[3]: Entering directory `/opt/local/var/macports/build/_opt_local_var_macports_sources_rsync.macports.org_release_tarballs_ports_graphics_dvisvgm/dvisvgm/work/dvisvgm-2.3.4/libs/xxHash'
1926:info:build make[3]: Nothing to be done for `all'.
1927:info:build make[3]: Leaving directory `/opt/local/var/macports/build/_opt_local_var_macports_sources_rsync.macports.org_release_tarballs_ports_graphics_dvisvgm/dvisvgm/work/dvisvgm-2.3.4/libs/xxHash'
1928:info:build Making all in brotli
1929:info:build make[3]: Entering directory `/opt/local/var/macports/build/_opt_local_var_macports_sources_rsync.macports.org_release_tarballs_ports_graphics_dvisvgm/dvisvgm/work/dvisvgm-2.3.4/libs/brotli'
1930:info:build make[3]: Nothing to be done for `all'.
1931:info:build make[3]: Leaving directory `/opt/local/var/macports/build/_opt_local_var_macports_sources_rsync.macports.org_release_tarballs_ports_graphics_dvisvgm/dvisvgm/work/dvisvgm-2.3.4/libs/brotli'
1932:info:build Making all in ff-woff
1933:info:build make[3]: Entering directory `/opt/local/var/macports/build/_opt_local_var_macports_sources_rsync.macports.org_release_tarballs_ports_graphics_dvisvgm/dvisvgm/work/dvisvgm-2.3.4/libs/ff-woff'
1934:info:build make[3]: Nothing to be done for `all'.
1935:info:build make[3]: Leaving directory `/opt/local/var/macports/build/_opt_local_var_macports_sources_rsync.macports.org_release_tarballs_ports_graphics_dvisvgm/dvisvgm/work/dvisvgm-2.3.4/libs/ff-woff'
1936:info:build Making all in woff2
1937:info:build make[3]: Entering directory `/opt/local/var/macports/build/_opt_local_var_macports_sources_rsync.macports.org_release_tarballs_ports_graphics_dvisvgm/dvisvgm/work/dvisvgm-2.3.4/libs/woff2'
1938:info:build make[3]: Nothing to be done for `all'.
1939:info:build make[3]: Leaving directory `/opt/local/var/macports/build/_opt_local_var_macports_sources_rsync.macports.org_release_tarballs_ports_graphics_dvisvgm/dvisvgm/work/dvisvgm-2.3.4/libs/woff2'
1940:info:build make[3]: Entering directory `/opt/local/var/macports/build/_opt_local_var_macports_sources_rsync.macports.org_release_tarballs_ports_graphics_dvisvgm/dvisvgm/work/dvisvgm-2.3.4/libs'
1941:info:build make[3]: Nothing to be done for `all-am'.
1942:info:build make[3]: Leaving directory `/opt/local/var/macports/build/_opt_local_var_macports_sources_rsync.macports.org_release_tarballs_ports_graphics_dvisvgm/dvisvgm/work/dvisvgm-2.3.4/libs'
1943:info:build make[2]: Leaving directory `/opt/local/var/macports/build/_opt_local_var_macports_sources_rsync.macports.org_release_tarballs_ports_graphics_dvisvgm/dvisvgm/work/dvisvgm-2.3.4/libs'
1944:info:build Making all in src
1945:info:build make[2]: Entering directory `/opt/local/var/macports/build/_opt_local_var_macports_sources_rsync.macports.org_release_tarballs_ports_graphics_dvisvgm/dvisvgm/work/dvisvgm-2.3.4/src'
1946:info:build depbase=`echo FileFinder.o | sed 's|[^/]*$|.deps/&|;s|\.o$||'`;\
1947:info:build     /usr/bin/clang++ -std=gnu++11 -DHAVE_CONFIG_H -I. -I..   -I/opt/local/include -Wall -Wnon-virtual-dtor -Wno-mismatched-tags -I../libs/clipper -I../libs/variant/include -I../libs/xxHash  -I/opt/local/include/freetype2 -I/opt/local/include/libpng16    -I../libs/brotli/include -I../libs/woff2/include -pipe -Os -stdlib=libc++ -arch x86_64 -MT FileFinder.o -MD -MP -MF $depbase.Tpo -c -o FileFinder.o FileFinder.cpp &&\
1948:info:build     mv -f $depbase.Tpo $depbase.Po
1949:info:build if test -f psdefs.ps; then \
1950:info:build             ps2c PSInterpreter::PSDEFS psdefs.ps >psdefs.cpp; \
1951:info:build     fi
1952:info:build rm -f libdvisvgm.a
1953:info:build ar cru libdvisvgm.a BasicDVIReader.o Bezier.o BgColorSpecialHandler.o Bitmap.o BoundingBox.o Calculator.o CharMapID.o CLCommandLine.o CMap.o CMapManager.o CMapReader.o Color.o ColorSpecialHandler.o CRC32.o Directory.o DLLoader.o DVIReader.o DvisvgmSpecialHandler.o DVIToSVG.o DVIToSVGActions.o EmSpecialHandler.o EncFile.o EPSFile.o EPSToSVG.o FileFinder.o FilePath.o FileSystem.o Font.o FontCache.o FontEncoding.o FontEngine.o FontManager.o FontMap.o FontMetrics.o FontWriter.o GFGlyphTracer.o GFReader.o GFTracer.o Ghostscript.o HtmlSpecialHandler.o HyperlinkManager.o InputBuffer.o InputReader.o JFM.o Length.o MapLine.o Matrix.o Message.o MetafontWrapper.o NoPsSpecialHandler.o PageRanges.o PageSize.o PapersizeSpecialHandler.o PathClipper.o PDFParser.o PdfSpecialHandler.o PreScanDVIReader.o Process.o psdefs.o PSInterpreter.o PSPattern.o PSPreviewFilter.o PsSpecialHandler.o RangeMap.o ShadingPatch.o SignalHandler.o SpecialManager.o StreamReader.o StreamWriter.o Subfont.o SVGCharHandler.o SVGCharHandlerFactory.o SVGCharPathHandler.o SVGCharTspanTextHandler.o SVGOutput.o SVGSingleCharTextHandler.o SVGTree.o System.o TensorProductPatch.o Terminal.o TFM.o ToUnicodeMap.o TpicSpecialHandler.o TriangularPatch.o TrueTypeFont.o TTFAutohint.o Unicode.o utility.o VFReader.o XMLDocument.o XMLNode.o XMLString.o ffwrapper.o
1954:info:build ranlib libdvisvgm.a
1955:info:build /bin/sh ../libtool  --tag=CXX   --mode=link /usr/bin/clang++ -std=gnu++11 -Wall -Wnon-virtual-dtor -Wno-mismatched-tags -I../libs/clipper -I../libs/variant/include -I../libs/xxHash  -I/opt/local/include/freetype2 -I/opt/local/include/libpng16    -I../libs/brotli/include -I../libs/woff2/include -pipe -Os -stdlib=libc++ -arch x86_64    -L/opt/local/lib -Wl,-headerpad_max_install_names -arch x86_64 -o dvisvgm dvisvgm.o libdvisvgm.a ../libs/clipper/libclipper.a ../libs/xxHash/libxxhash.a -L/opt/local/lib -lfreetype   ../libs/ff-woff/libfontforge.a ../libs/woff2/libwoff2.a ../libs/brotli/libbrotli.a -lz -lgs -lpotrace -lm -lkpathsea
1956:info:build libtool: link: /usr/bin/clang++ -std=gnu++11 -Wall -Wnon-virtual-dtor -Wno-mismatched-tags -I../libs/clipper -I../libs/variant/include -I../libs/xxHash -I/opt/local/include/freetype2 -I/opt/local/include/libpng16 -I../libs/brotli/include -I../libs/woff2/include -pipe -Os -stdlib=libc++ -arch x86_64 -Wl,-headerpad_max_install_names -arch x86_64 -o dvisvgm dvisvgm.o  -L/opt/local/lib libdvisvgm.a ../libs/clipper/libclipper.a ../libs/xxHash/libxxhash.a -lfreetype ../libs/ff-woff/libfontforge.a ../libs/woff2/libwoff2.a ../libs/brotli/libbrotli.a -lz -lgs -lpotrace -lm -lkpathsea
1957:info:build make[2]: Leaving directory `/opt/local/var/macports/build/_opt_local_var_macports_sources_rsync.macports.org_release_tarballs_ports_graphics_dvisvgm/dvisvgm/work/dvisvgm-2.3.4/src'
1958:info:build Making all in tests
1959:info:build make[2]: Entering directory `/opt/local/var/macports/build/_opt_local_var_macports_sources_rsync.macports.org_release_tarballs_ports_graphics_dvisvgm/dvisvgm/work/dvisvgm-2.3.4/tests'
1960:info:build Making all in data
1961:info:build make[3]: Entering directory `/opt/local/var/macports/build/_opt_local_var_macports_sources_rsync.macports.org_release_tarballs_ports_graphics_dvisvgm/dvisvgm/work/dvisvgm-2.3.4/tests/data'
1962:info:build make[3]: Nothing to be done for `all'.
1963:info:build make[3]: Leaving directory `/opt/local/var/macports/build/_opt_local_var_macports_sources_rsync.macports.org_release_tarballs_ports_graphics_dvisvgm/dvisvgm/work/dvisvgm-2.3.4/tests/data'
1964:info:build make[3]: Entering directory `/opt/local/var/macports/build/_opt_local_var_macports_sources_rsync.macports.org_release_tarballs_ports_graphics_dvisvgm/dvisvgm/work/dvisvgm-2.3.4/tests'
1965:info:build make[3]: Nothing to be done for `all-am'.
1966:info:build make[3]: Leaving directory `/opt/local/var/macports/build/_opt_local_var_macports_sources_rsync.macports.org_release_tarballs_ports_graphics_dvisvgm/dvisvgm/work/dvisvgm-2.3.4/tests'
1967:info:build make[2]: Leaving directory `/opt/local/var/macports/build/_opt_local_var_macports_sources_rsync.macports.org_release_tarballs_ports_graphics_dvisvgm/dvisvgm/work/dvisvgm-2.3.4/tests'
1968:info:build Making all in doc
1969:info:build make[2]: Entering directory `/opt/local/var/macports/build/_opt_local_var_macports_sources_rsync.macports.org_release_tarballs_ports_graphics_dvisvgm/dvisvgm/work/dvisvgm-2.3.4/doc'
1970:info:build if [ `type -p asciidoc` ]; then \
1971:info:build             asciidoc -a icons -a 'iconsdir=.' -a badges -a 'revnumber=2.3.4' --unsafe -bdocbook -dmanpage -o dvisvgm-man.xml.tmp dvisvgm.txt; \
1972:info:build             xsltproc -o dvisvgm-man.xml ../doc/tweak-db-refentry.xsl dvisvgm-man.xml.tmp; \
1973:info:build             rm dvisvgm-man.xml.tmp; \
1974:info:build     fi
1975:info:build if [ `type -p xmlto` ]; then \
1976:info:build             xmlto -m ../doc/conf-dblatex-man.xsl --stringparam man.endnotes.list.enabled=0 --stringparam man.endnotes.are.numbered=0 --stringparam man.authors.section.enabled=0 man dvisvgm-man.xml; \
1977:info:build     fi
1978:info:build Input file /opt/local/var/macports/build/_opt_local_var_macports_sources_rsync.macports.org_release_tarballs_ports_graphics_dvisvgm/dvisvgm/work/dvisvgm-2.3.4/doc/dvisvgm-man.xml not found
1979:info:build make[2]: *** [dvisvgm.1] Error 1
1980:info:build make[2]: Leaving directory `/opt/local/var/macports/build/_opt_local_var_macports_sources_rsync.macports.org_release_tarballs_ports_graphics_dvisvgm/dvisvgm/work/dvisvgm-2.3.4/doc'
1981:info:build make[1]: *** [all-recursive] Error 1
1982:info:build make[1]: Leaving directory `/opt/local/var/macports/build/_opt_local_var_macports_sources_rsync.macports.org_release_tarballs_ports_graphics_dvisvgm/dvisvgm/work/dvisvgm-2.3.4'
1983:info:build make: *** [all] Error 2
1984:info:build make: Leaving directory `/opt/local/var/macports/build/_opt_local_var_macports_sources_rsync.macports.org_release_tarballs_ports_graphics_dvisvgm/dvisvgm/work/dvisvgm-2.3.4'
1985:info:build Command failed:  cd "/opt/local/var/macports/build/_opt_local_var_macports_sources_rsync.macports.org_release_tarballs_ports_graphics_dvisvgm/dvisvgm/work/dvisvgm-2.3.4" && /usr/bin/make -j8 -w all
1986:info:build Exit code: 2
1987:error:build Failed to build dvisvgm: command execution failed
1988:debug:build Error code: CHILDSTATUS 9965 2
1989:debug:build Backtrace: command execution failed
1990:debug:build     while executing
1991:debug:build "system {*}$notty {*}$nice $fullcmdstring"
1992:debug:build     invoked from within
1993:debug:build "command_exec build"
1994:debug:build     (procedure "portbuild::build_main" line 8)
1995:debug:build     invoked from within
1996:debug:build "$procedure $targetname"
1997:error:build See /opt/local/var/macports/logs/_opt_local_var_macports_sources_rsync.macports.org_release_tarballs_ports_graphics_dvisvgm/dvisvgm/main.log for details.