Ticket #59282: main.log

File main.log, 133.6 KB (added by tiperiu, 2 years ago)
Line 
1version:1
2:debug:sysinfo macOS 10.15 (darwin/19.0.0) arch i386
3:debug:sysinfo MacPorts 2.6.1
4:debug:sysinfo Xcode 11.0
5:debug:sysinfo SDK 10.15
6:debug:sysinfo MACOSX_DEPLOYMENT_TARGET: 10.15
7:debug:main epoch: in tree: 0 installed: 0
8:debug:main py37-future 0.17.1_0 exists in the ports tree
9:debug:main py37-future 0.17.1_0  is the latest installed
10:debug:main py37-future 0.17.1_0  is active
11:debug:main Merging existing variants '' into variants
12:debug:main new fully merged portvariants:
13:debug:main Changing to port directory: /opt/local/var/macports/sources/rsync.macports.org/macports/release/tarballs/ports/python/py-future
14:debug:main OS darwin/19.0.0 (macOS 10.15) arch i386
15:debug:main Re-registering default for build.cmd
16:debug:main Re-registering default for destroot.cmd
17:debug:main Re-registering default for destroot.destdir
18:debug:main Sourcing PortGroup python 1.0 from /opt/local/var/macports/sources/rsync.macports.org/macports/release/tarballs/ports/_resources/port1.0/group/python-1.0.tcl
19:debug:main only one arch supported, so not adding the default universal variant
20:debug:main Running callback portconfigure::add_automatic_compiler_dependencies
21:debug:main Finished running callback portconfigure::add_automatic_compiler_dependencies
22:debug:main Running callback portbuild::add_automatic_buildsystem_dependencies
23:debug:main Finished running callback portbuild::add_automatic_buildsystem_dependencies
24:debug:main Running callback portstartupitem::add_notes
25:debug:main Finished running callback portstartupitem::add_notes
26:debug:main No need to upgrade! py37-future 0.17.1_0 >= py37-future 0.17.1_0
27:debug:main epoch: in tree: 0 installed: 0
28:debug:main python37 3.7.4_1 exists in the ports tree
29:debug:main python37 3.7.4_1  is the latest installed
30:debug:main python37 3.7.4_1  is active
31:debug:main Merging existing variants '' into variants
32:debug:main new fully merged portvariants:
33:debug:main Changing to port directory: /opt/local/var/macports/sources/rsync.macports.org/macports/release/tarballs/ports/lang/python37
34:debug:main OS darwin/19.0.0 (macOS 10.15) arch i386
35:debug:main Sourcing PortGroup select 1.0 from /opt/local/var/macports/sources/rsync.macports.org/macports/release/tarballs/ports/_resources/port1.0/group/select-1.0.tcl
36:debug:main Sourcing PortGroup clang_dependency 1.0 from /opt/local/var/macports/sources/rsync.macports.org/macports/release/tarballs/ports/_resources/port1.0/group/clang_dependency-1.0.tcl
37:debug:main Reading variant descriptions from /opt/local/var/macports/sources/rsync.macports.org/macports/release/tarballs/ports/_resources/port1.0/variant_descriptions.conf
38:debug:main universal variant already exists, so not adding the default one
39:debug:main Running callback portconfigure::add_automatic_compiler_dependencies
40:debug:main Finished running callback portconfigure::add_automatic_compiler_dependencies
41:debug:main Running callback portbuild::add_automatic_buildsystem_dependencies
42:debug:main Finished running callback portbuild::add_automatic_buildsystem_dependencies
43:debug:main Running callback portstartupitem::add_notes
44:debug:main Finished running callback portstartupitem::add_notes
45:debug:main No need to upgrade! python37 3.7.4_1 >= python37 3.7.4_1
46:debug:main epoch: in tree: 0 installed: 0
47:debug:main bzip2 1.0.8_0 exists in the ports tree
48:debug:main bzip2 1.0.8_0  is the latest installed
49:debug:main bzip2 1.0.8_0  is active
50:debug:main Merging existing variants '' into variants
51:debug:main new fully merged portvariants:
52:debug:main Changing to port directory: /opt/local/var/macports/sources/rsync.macports.org/macports/release/tarballs/ports/archivers/bzip2
53:debug:main OS darwin/19.0.0 (macOS 10.15) arch i386
54:debug:main Reading variant descriptions from /opt/local/var/macports/sources/rsync.macports.org/macports/release/tarballs/ports/_resources/port1.0/variant_descriptions.conf
55:debug:main universal variant already exists, so not adding the default one
56:debug:main Running callback portconfigure::add_automatic_compiler_dependencies
57:debug:main Finished running callback portconfigure::add_automatic_compiler_dependencies
58:debug:main Running callback portbuild::add_automatic_buildsystem_dependencies
59:debug:main Finished running callback portbuild::add_automatic_buildsystem_dependencies
60:debug:main Running callback portstartupitem::add_notes
61:debug:main Finished running callback portstartupitem::add_notes
62:debug:main No need to upgrade! bzip2 1.0.8_0 >= bzip2 1.0.8_0
63:debug:main epoch: in tree: 0 installed: 0
64:debug:main expat 2.2.9_0 exists in the ports tree
65:debug:main expat 2.2.9_0  is the latest installed
66:debug:main expat 2.2.9_0  is active
67:debug:main Merging existing variants '' into variants
68:debug:main new fully merged portvariants:
69:debug:main Changing to port directory: /opt/local/var/macports/sources/rsync.macports.org/macports/release/tarballs/ports/textproc/expat
70:debug:main OS darwin/19.0.0 (macOS 10.15) arch i386
71:debug:main Reading variant descriptions from /opt/local/var/macports/sources/rsync.macports.org/macports/release/tarballs/ports/_resources/port1.0/variant_descriptions.conf
72:debug:main Sourcing PortGroup muniversal 1.0 from /opt/local/var/macports/sources/rsync.macports.org/macports/release/tarballs/ports/_resources/port1.0/group/muniversal-1.0.tcl
73:debug:main universal variant already exists, so not adding the default one
74:debug:main Running callback portconfigure::add_automatic_compiler_dependencies
75:debug:main Finished running callback portconfigure::add_automatic_compiler_dependencies
76:debug:main Running callback portbuild::add_automatic_buildsystem_dependencies
77:debug:main Finished running callback portbuild::add_automatic_buildsystem_dependencies
78:debug:main Running callback portstartupitem::add_notes
79:debug:main Finished running callback portstartupitem::add_notes
80:debug:main No need to upgrade! expat 2.2.9_0 >= expat 2.2.9_0
81:debug:main epoch: in tree: 2 installed: 2
82:debug:main gettext 0.19.8.1_2 exists in the ports tree
83:debug:main gettext 0.19.8.1_2  is the latest installed
84:debug:main gettext 0.19.8.1_2  is active
85:debug:main Merging existing variants '' into variants
86:debug:main new fully merged portvariants:
87:debug:main Changing to port directory: /opt/local/var/macports/sources/rsync.macports.org/macports/release/tarballs/ports/devel/gettext
88:debug:main OS darwin/19.0.0 (macOS 10.15) arch i386
89:debug:main Sourcing PortGroup compiler_blacklist_versions 1.0 from /opt/local/var/macports/sources/rsync.macports.org/macports/release/tarballs/ports/_resources/port1.0/group/compiler_blacklist_versions-1.0.tcl
90:debug:main Reading variant descriptions from /opt/local/var/macports/sources/rsync.macports.org/macports/release/tarballs/ports/_resources/port1.0/variant_descriptions.conf
91:debug:main Sourcing PortGroup muniversal 1.0 from /opt/local/var/macports/sources/rsync.macports.org/macports/release/tarballs/ports/_resources/port1.0/group/muniversal-1.0.tcl
92:debug:main Sourcing PortGroup clang_dependency 1.0 from /opt/local/var/macports/sources/rsync.macports.org/macports/release/tarballs/ports/_resources/port1.0/group/clang_dependency-1.0.tcl
93:debug:main compiler clang 1100.0.33.8 not blacklisted because it doesn't match {clang < 211.10.1}
94:debug:main universal variant already exists, so not adding the default one
95:debug:main Running callback portconfigure::add_automatic_compiler_dependencies
96:debug:main Finished running callback portconfigure::add_automatic_compiler_dependencies
97:debug:main Running callback portbuild::add_automatic_buildsystem_dependencies
98:debug:main Finished running callback portbuild::add_automatic_buildsystem_dependencies
99:debug:main Running callback portstartupitem::add_notes
100:debug:main Finished running callback portstartupitem::add_notes
101:debug:main No need to upgrade! gettext 0.19.8.1_2 >= gettext 0.19.8.1_2
102:debug:main epoch: in tree: 0 installed: 0
103:debug:main libiconv 1.16_0 exists in the ports tree
104:debug:main libiconv 1.16_0  is the latest installed
105:debug:main libiconv 1.16_0  is active
106:debug:main Merging existing variants '' into variants
107:debug:main new fully merged portvariants:
108:debug:main Changing to port directory: /opt/local/var/macports/sources/rsync.macports.org/macports/release/tarballs/ports/textproc/libiconv
109:debug:main OS darwin/19.0.0 (macOS 10.15) arch i386
110:debug:main Reading variant descriptions from /opt/local/var/macports/sources/rsync.macports.org/macports/release/tarballs/ports/_resources/port1.0/variant_descriptions.conf
111:debug:main Sourcing PortGroup muniversal 1.0 from /opt/local/var/macports/sources/rsync.macports.org/macports/release/tarballs/ports/_resources/port1.0/group/muniversal-1.0.tcl
112:debug:main Sourcing PortGroup clang_dependency 1.0 from /opt/local/var/macports/sources/rsync.macports.org/macports/release/tarballs/ports/_resources/port1.0/group/clang_dependency-1.0.tcl
113:debug:main universal variant already exists, so not adding the default one
114:debug:main Running callback portconfigure::add_automatic_compiler_dependencies
115:debug:main Finished running callback portconfigure::add_automatic_compiler_dependencies
116:debug:main Running callback portbuild::add_automatic_buildsystem_dependencies
117:debug:main Finished running callback portbuild::add_automatic_buildsystem_dependencies
118:debug:main Running callback portstartupitem::add_notes
119:debug:main Finished running callback portstartupitem::add_notes
120:debug:main No need to upgrade! libiconv 1.16_0 >= libiconv 1.16_0
121:debug:main epoch: in tree: 0 installed: 0
122:debug:main ncurses 6.1_0 exists in the ports tree
123:debug:main ncurses 6.1_0  is the latest installed
124:debug:main ncurses 6.1_0  is active
125:debug:main Merging existing variants '' into variants
126:debug:main new fully merged portvariants:
127:debug:main Changing to port directory: /opt/local/var/macports/sources/rsync.macports.org/macports/release/tarballs/ports/devel/ncurses
128:debug:main OS darwin/19.0.0 (macOS 10.15) arch i386
129:debug:main Sourcing PortGroup clang_dependency 1.0 from /opt/local/var/macports/sources/rsync.macports.org/macports/release/tarballs/ports/_resources/port1.0/group/clang_dependency-1.0.tcl
130:debug:main adding the default universal variant
131:debug:main Reading variant descriptions from /opt/local/var/macports/sources/rsync.macports.org/macports/release/tarballs/ports/_resources/port1.0/variant_descriptions.conf
132:debug:main Running callback portconfigure::add_automatic_compiler_dependencies
133:debug:main Finished running callback portconfigure::add_automatic_compiler_dependencies
134:debug:main Running callback portbuild::add_automatic_buildsystem_dependencies
135:debug:main Finished running callback portbuild::add_automatic_buildsystem_dependencies
136:debug:main Running callback portstartupitem::add_notes
137:debug:main Finished running callback portstartupitem::add_notes
138:debug:main No need to upgrade! ncurses 6.1_0 >= ncurses 6.1_0
139:debug:main epoch: in tree: 20090923 installed: 20090923
140:debug:main libedit 20190324-3.1_0 exists in the ports tree
141:debug:main libedit 20190324-3.1_0  is the latest installed
142:debug:main libedit 20190324-3.1_0  is active
143:debug:main Merging existing variants '' into variants
144:debug:main new fully merged portvariants:
145:debug:main Changing to port directory: /opt/local/var/macports/sources/rsync.macports.org/macports/release/tarballs/ports/devel/libedit
146:debug:main OS darwin/19.0.0 (macOS 10.15) arch i386
147:debug:main Reading variant descriptions from /opt/local/var/macports/sources/rsync.macports.org/macports/release/tarballs/ports/_resources/port1.0/variant_descriptions.conf
148:debug:main Sourcing PortGroup muniversal 1.0 from /opt/local/var/macports/sources/rsync.macports.org/macports/release/tarballs/ports/_resources/port1.0/group/muniversal-1.0.tcl
149:debug:main Sourcing PortGroup clang_dependency 1.0 from /opt/local/var/macports/sources/rsync.macports.org/macports/release/tarballs/ports/_resources/port1.0/group/clang_dependency-1.0.tcl
150:debug:main universal variant already exists, so not adding the default one
151:debug:main Running callback portconfigure::add_automatic_compiler_dependencies
152:debug:main Finished running callback portconfigure::add_automatic_compiler_dependencies
153:debug:main Running callback portbuild::add_automatic_buildsystem_dependencies
154:debug:main Finished running callback portbuild::add_automatic_buildsystem_dependencies
155:debug:main Running callback portstartupitem::add_notes
156:debug:main Finished running callback portstartupitem::add_notes
157:debug:main No need to upgrade! libedit 20190324-3.1_0 >= libedit 20190324-3.1_0
158:debug:main epoch: in tree: 0 installed: 0
159:debug:main libffi 3.2.1_0 exists in the ports tree
160:debug:main libffi 3.2.1_0  is the latest installed
161:debug:main libffi 3.2.1_0  is active
162:debug:main Merging existing variants '' into variants
163:debug:main new fully merged portvariants:
164:debug:main Changing to port directory: /opt/local/var/macports/sources/rsync.macports.org/macports/release/tarballs/ports/devel/libffi
165:debug:main OS darwin/19.0.0 (macOS 10.15) arch i386
166:debug:main Reading variant descriptions from /opt/local/var/macports/sources/rsync.macports.org/macports/release/tarballs/ports/_resources/port1.0/variant_descriptions.conf
167:debug:main Sourcing PortGroup muniversal 1.0 from /opt/local/var/macports/sources/rsync.macports.org/macports/release/tarballs/ports/_resources/port1.0/group/muniversal-1.0.tcl
168:debug:main universal variant already exists, so not adding the default one
169:debug:main Running callback portconfigure::add_automatic_compiler_dependencies
170:debug:main Finished running callback portconfigure::add_automatic_compiler_dependencies
171:debug:main Running callback portbuild::add_automatic_buildsystem_dependencies
172:debug:main Finished running callback portbuild::add_automatic_buildsystem_dependencies
173:debug:main Running callback portstartupitem::add_notes
174:debug:main Finished running callback portstartupitem::add_notes
175:debug:main No need to upgrade! libffi 3.2.1_0 >= libffi 3.2.1_0
176:debug:main epoch: in tree: 1 installed: 1
177:debug:main openssl 1.1.1d_0 exists in the ports tree
178:debug:main openssl 1.1.1d_0  is the latest installed
179:debug:main openssl 1.1.1d_0  is active
180:debug:main Merging existing variants '' into variants
181:debug:main new fully merged portvariants:
182:debug:main Changing to port directory: /opt/local/var/macports/sources/rsync.macports.org/macports/release/tarballs/ports/devel/openssl
183:debug:main OS darwin/19.0.0 (macOS 10.15) arch i386
184:debug:main Reading variant descriptions from /opt/local/var/macports/sources/rsync.macports.org/macports/release/tarballs/ports/_resources/port1.0/variant_descriptions.conf
185:debug:main Sourcing PortGroup muniversal 1.0 from /opt/local/var/macports/sources/rsync.macports.org/macports/release/tarballs/ports/_resources/port1.0/group/muniversal-1.0.tcl
186:debug:main universal variant already exists, so not adding the default one
187:debug:main Running callback portconfigure::add_automatic_compiler_dependencies
188:debug:main Finished running callback portconfigure::add_automatic_compiler_dependencies
189:debug:main Running callback portbuild::add_automatic_buildsystem_dependencies
190:debug:main Finished running callback portbuild::add_automatic_buildsystem_dependencies
191:debug:main Running callback portstartupitem::add_notes
192:debug:main Finished running callback portstartupitem::add_notes
193:debug:main No need to upgrade! openssl 1.1.1d_0 >= openssl 1.1.1d_0
194:debug:main epoch: in tree: 0 installed: 0
195:debug:main zlib 1.2.11_0 exists in the ports tree
196:debug:main zlib 1.2.11_0  is the latest installed
197:debug:main zlib 1.2.11_0  is active
198:debug:main Merging existing variants '' into variants
199:debug:main new fully merged portvariants:
200:debug:main Changing to port directory: /opt/local/var/macports/sources/rsync.macports.org/macports/release/tarballs/ports/archivers/zlib
201:debug:main OS darwin/19.0.0 (macOS 10.15) arch i386
202:debug:main Sourcing PortGroup xcodeversion 1.0 from /opt/local/var/macports/sources/rsync.macports.org/macports/release/tarballs/ports/_resources/port1.0/group/xcodeversion-1.0.tcl
203:debug:main adding the default universal variant
204:debug:main Reading variant descriptions from /opt/local/var/macports/sources/rsync.macports.org/macports/release/tarballs/ports/_resources/port1.0/variant_descriptions.conf
205:debug:main Running callback portconfigure::add_automatic_compiler_dependencies
206:debug:main Finished running callback portconfigure::add_automatic_compiler_dependencies
207:debug:main Running callback portbuild::add_automatic_buildsystem_dependencies
208:debug:main Finished running callback portbuild::add_automatic_buildsystem_dependencies
209:debug:main Running callback portstartupitem::add_notes
210:debug:main Finished running callback portstartupitem::add_notes
211:debug:main No need to upgrade! zlib 1.2.11_0 >= zlib 1.2.11_0
212:debug:main epoch: in tree: 0 installed: 0
213:debug:main sqlite3 3.30.1_0 exists in the ports tree
214:debug:main sqlite3 3.30.1_0  is the latest installed
215:debug:main sqlite3 3.30.1_0  is active
216:debug:main Merging existing variants '' into variants
217:debug:main new fully merged portvariants:
218:debug:main Changing to port directory: /opt/local/var/macports/sources/rsync.macports.org/macports/release/tarballs/ports/databases/sqlite3
219:debug:main OS darwin/19.0.0 (macOS 10.15) arch i386
220:debug:main Sourcing PortGroup clang_dependency 1.0 from /opt/local/var/macports/sources/rsync.macports.org/macports/release/tarballs/ports/_resources/port1.0/group/clang_dependency-1.0.tcl
221:debug:main adding the default universal variant
222:debug:main Reading variant descriptions from /opt/local/var/macports/sources/rsync.macports.org/macports/release/tarballs/ports/_resources/port1.0/variant_descriptions.conf
223:debug:main Running callback portconfigure::add_automatic_compiler_dependencies
224:debug:main Finished running callback portconfigure::add_automatic_compiler_dependencies
225:debug:main Running callback portbuild::add_automatic_buildsystem_dependencies
226:debug:main Finished running callback portbuild::add_automatic_buildsystem_dependencies
227:debug:main Running callback portstartupitem::add_notes
228:debug:main Finished running callback portstartupitem::add_notes
229:debug:main No need to upgrade! sqlite3 3.30.1_0 >= sqlite3 3.30.1_0
230:debug:main epoch: in tree: 0 installed: 0
231:debug:main xz 5.2.4_0 exists in the ports tree
232:debug:main xz 5.2.4_0  is the latest installed
233:debug:main xz 5.2.4_0  is active
234:debug:main Merging existing variants '' into variants
235:debug:main new fully merged portvariants:
236:debug:main Changing to port directory: /opt/local/var/macports/sources/rsync.macports.org/macports/release/tarballs/ports/archivers/xz
237:debug:main OS darwin/19.0.0 (macOS 10.15) arch i386
238:debug:main Sourcing PortGroup clang_dependency 1.0 from /opt/local/var/macports/sources/rsync.macports.org/macports/release/tarballs/ports/_resources/port1.0/group/clang_dependency-1.0.tcl
239:debug:main adding the default universal variant
240:debug:main Reading variant descriptions from /opt/local/var/macports/sources/rsync.macports.org/macports/release/tarballs/ports/_resources/port1.0/variant_descriptions.conf
241:debug:main Running callback portconfigure::add_automatic_compiler_dependencies
242:debug:main Finished running callback portconfigure::add_automatic_compiler_dependencies
243:debug:main Running callback portbuild::add_automatic_buildsystem_dependencies
244:debug:main Finished running callback portbuild::add_automatic_buildsystem_dependencies
245:debug:main Running callback portstartupitem::add_notes
246:debug:main Finished running callback portstartupitem::add_notes
247:debug:main No need to upgrade! xz 5.2.4_0 >= xz 5.2.4_0
248:debug:main epoch: in tree: 0 installed: 0
249:debug:main python_select 0.3_8 exists in the ports tree
250:debug:main python_select 0.3_8  is the latest installed
251:debug:main python_select 0.3_8  is active
252:debug:main Merging existing variants '' into variants
253:debug:main new fully merged portvariants:
254:debug:main Changing to port directory: /opt/local/var/macports/sources/rsync.macports.org/macports/release/tarballs/ports/sysutils/python_select
255:debug:main OS darwin/19.0.0 (macOS 10.15) arch i386
256:debug:main Sourcing PortGroup select 1.0 from /opt/local/var/macports/sources/rsync.macports.org/macports/release/tarballs/ports/_resources/port1.0/group/select-1.0.tcl
257:debug:main universal_variant is false, so not adding the default universal variant
258:debug:main Running callback portconfigure::add_automatic_compiler_dependencies
259:debug:main Finished running callback portconfigure::add_automatic_compiler_dependencies
260:debug:main Running callback portbuild::add_automatic_buildsystem_dependencies
261:debug:main Finished running callback portbuild::add_automatic_buildsystem_dependencies
262:debug:main Running callback portstartupitem::add_notes
263:debug:main Finished running callback portstartupitem::add_notes
264:debug:main No need to upgrade! python_select 0.3_8 >= python_select 0.3_8
265:debug:main epoch: in tree: 0 installed: 0
266:debug:main python3_select 0.0_1 exists in the ports tree
267:debug:main python3_select 0.0_1  is the latest installed
268:debug:main python3_select 0.0_1  is active
269:debug:main Merging existing variants '' into variants
270:debug:main new fully merged portvariants:
271:debug:main Changing to port directory: /opt/local/var/macports/sources/rsync.macports.org/macports/release/tarballs/ports/sysutils/python3_select
272:debug:main OS darwin/19.0.0 (macOS 10.15) arch i386
273:debug:main Sourcing PortGroup select 1.0 from /opt/local/var/macports/sources/rsync.macports.org/macports/release/tarballs/ports/_resources/port1.0/group/select-1.0.tcl
274:debug:main universal_variant is false, so not adding the default universal variant
275:debug:main Running callback portconfigure::add_automatic_compiler_dependencies
276:debug:main Finished running callback portconfigure::add_automatic_compiler_dependencies
277:debug:main Running callback portbuild::add_automatic_buildsystem_dependencies
278:debug:main Finished running callback portbuild::add_automatic_buildsystem_dependencies
279:debug:main Running callback portstartupitem::add_notes
280:debug:main Finished running callback portstartupitem::add_notes
281:debug:main No need to upgrade! python3_select 0.0_1 >= python3_select 0.0_1
282:debug:main epoch: in tree: 0 installed: 0
283:debug:main py37-setuptools 41.4.0_0 exists in the ports tree
284:debug:main py37-setuptools 41.4.0_0  is the latest installed
285:debug:main py37-setuptools 41.4.0_0  is active
286:debug:main Merging existing variants '' into variants
287:debug:main new fully merged portvariants:
288:debug:main Changing to port directory: /opt/local/var/macports/sources/rsync.macports.org/macports/release/tarballs/ports/python/py-setuptools
289:debug:main OS darwin/19.0.0 (macOS 10.15) arch i386
290:debug:main Re-registering default for build.cmd
291:debug:main Re-registering default for destroot.cmd
292:debug:main Re-registering default for destroot.destdir
293:debug:main Sourcing PortGroup python 1.0 from /opt/local/var/macports/sources/rsync.macports.org/macports/release/tarballs/ports/_resources/port1.0/group/python-1.0.tcl
294:debug:main only one arch supported, so not adding the default universal variant
295:debug:main Running callback portconfigure::add_automatic_compiler_dependencies
296:debug:main Finished running callback portconfigure::add_automatic_compiler_dependencies
297:debug:main Running callback portbuild::add_automatic_buildsystem_dependencies
298:debug:main Finished running callback portbuild::add_automatic_buildsystem_dependencies
299:debug:main Running callback portstartupitem::add_notes
300:debug:main Finished running callback portstartupitem::add_notes
301:debug:main No need to upgrade! py37-setuptools 41.4.0_0 >= py37-setuptools 41.4.0_0
302:debug:main epoch: in tree: 0 installed: 0
303:debug:main py37-pip 19.2.3_0 exists in the ports tree
304:debug:main py37-pip 19.2.3_0  is the latest installed
305:debug:main py37-pip 19.2.3_0  is active
306:debug:main Merging existing variants '' into variants
307:debug:main new fully merged portvariants:
308:debug:main Changing to port directory: /opt/local/var/macports/sources/rsync.macports.org/macports/release/tarballs/ports/python/py-pip
309:debug:main OS darwin/19.0.0 (macOS 10.15) arch i386
310:debug:main Re-registering default for build.cmd
311:debug:main Re-registering default for destroot.cmd
312:debug:main Re-registering default for destroot.destdir
313:debug:main Sourcing PortGroup python 1.0 from /opt/local/var/macports/sources/rsync.macports.org/macports/release/tarballs/ports/_resources/port1.0/group/python-1.0.tcl
314:debug:main Sourcing PortGroup select 1.0 from /opt/local/var/macports/sources/rsync.macports.org/macports/release/tarballs/ports/_resources/port1.0/group/select-1.0.tcl
315:debug:main only one arch supported, so not adding the default universal variant
316:debug:main Running callback portconfigure::add_automatic_compiler_dependencies
317:debug:main Finished running callback portconfigure::add_automatic_compiler_dependencies
318:debug:main Running callback portbuild::add_automatic_buildsystem_dependencies
319:debug:main Finished running callback portbuild::add_automatic_buildsystem_dependencies
320:debug:main Running callback portstartupitem::add_notes
321:debug:main Finished running callback portstartupitem::add_notes
322:debug:main No need to upgrade! py37-pip 19.2.3_0 >= py37-pip 19.2.3_0
323:debug:main epoch: in tree: 0 installed: 0
324:debug:main pip_select 0.1_1 exists in the ports tree
325:debug:main pip_select 0.1_1  is the latest installed
326:debug:main pip_select 0.1_1  is active
327:debug:main Merging existing variants '' into variants
328:debug:main new fully merged portvariants:
329:debug:main Changing to port directory: /opt/local/var/macports/sources/rsync.macports.org/macports/release/tarballs/ports/python/pip_select
330:debug:main OS darwin/19.0.0 (macOS 10.15) arch i386
331:debug:main Sourcing PortGroup select 1.0 from /opt/local/var/macports/sources/rsync.macports.org/macports/release/tarballs/ports/_resources/port1.0/group/select-1.0.tcl
332:debug:main universal_variant is false, so not adding the default universal variant
333:debug:main Running callback portconfigure::add_automatic_compiler_dependencies
334:debug:main Finished running callback portconfigure::add_automatic_compiler_dependencies
335:debug:main Running callback portbuild::add_automatic_buildsystem_dependencies
336:debug:main Finished running callback portbuild::add_automatic_buildsystem_dependencies
337:debug:main Running callback portstartupitem::add_notes
338:debug:main Finished running callback portstartupitem::add_notes
339:debug:main No need to upgrade! pip_select 0.1_1 >= pip_select 0.1_1
340:debug:main epoch: in tree: 0 installed: 0
341:debug:main py37-mock 3.0.5_0 exists in the ports tree
342:debug:main py37-mock 3.0.5_0  is the latest installed
343:debug:main py37-mock 3.0.5_0  is active
344:debug:main Merging existing variants '' into variants
345:debug:main new fully merged portvariants:
346:debug:main Changing to port directory: /opt/local/var/macports/sources/rsync.macports.org/macports/release/tarballs/ports/python/py-mock
347:debug:main OS darwin/19.0.0 (macOS 10.15) arch i386
348:debug:main Re-registering default for build.cmd
349:debug:main Re-registering default for destroot.cmd
350:debug:main Re-registering default for destroot.destdir
351:debug:main Sourcing PortGroup python 1.0 from /opt/local/var/macports/sources/rsync.macports.org/macports/release/tarballs/ports/_resources/port1.0/group/python-1.0.tcl
352:debug:main only one arch supported, so not adding the default universal variant
353:debug:main Running callback portconfigure::add_automatic_compiler_dependencies
354:debug:main Finished running callback portconfigure::add_automatic_compiler_dependencies
355:debug:main Running callback portbuild::add_automatic_buildsystem_dependencies
356:debug:main Finished running callback portbuild::add_automatic_buildsystem_dependencies
357:debug:main Running callback portstartupitem::add_notes
358:debug:main Finished running callback portstartupitem::add_notes
359:debug:main No need to upgrade! py37-mock 3.0.5_0 >= py37-mock 3.0.5_0
360:debug:main epoch: in tree: 0 installed: 0
361:debug:main py37-six 1.12.0_0 exists in the ports tree
362:debug:main py37-six 1.12.0_0  is the latest installed
363:debug:main py37-six 1.12.0_0  is active
364:debug:main Merging existing variants '' into variants
365:debug:main new fully merged portvariants:
366:debug:main Changing to port directory: /opt/local/var/macports/sources/rsync.macports.org/macports/release/tarballs/ports/python/py-six
367:debug:main OS darwin/19.0.0 (macOS 10.15) arch i386
368:debug:main Re-registering default for build.cmd
369:debug:main Re-registering default for destroot.cmd
370:debug:main Re-registering default for destroot.destdir
371:debug:main Sourcing PortGroup python 1.0 from /opt/local/var/macports/sources/rsync.macports.org/macports/release/tarballs/ports/_resources/port1.0/group/python-1.0.tcl
372:debug:main only one arch supported, so not adding the default universal variant
373:debug:main Running callback portconfigure::add_automatic_compiler_dependencies
374:debug:main Finished running callback portconfigure::add_automatic_compiler_dependencies
375:debug:main Running callback portbuild::add_automatic_buildsystem_dependencies
376:debug:main Finished running callback portbuild::add_automatic_buildsystem_dependencies
377:debug:main Running callback portstartupitem::add_notes
378:debug:main Finished running callback portstartupitem::add_notes
379:debug:main No need to upgrade! py37-six 1.12.0_0 >= py37-six 1.12.0_0
380:debug:main epoch: in tree: 1 installed: 1
381:debug:main bazel26 0.26.1_0 exists in the ports tree
382:debug:main bazel26 0.26.1_0  is the latest installed
383:debug:main bazel26 0.26.1_0  is active
384:debug:main Merging existing variants '' into variants
385:debug:main new fully merged portvariants:
386:debug:main Changing to port directory: /opt/local/var/macports/sources/rsync.macports.org/macports/release/tarballs/ports/devel/bazel
387:debug:main OS darwin/19.0.0 (macOS 10.15) arch i386
388:debug:main Sourcing PortGroup github 1.0 from /opt/local/var/macports/sources/rsync.macports.org/macports/release/tarballs/ports/_resources/port1.0/group/github-1.0.tcl
389:debug:main Sourcing PortGroup java 1.0 from /opt/local/var/macports/sources/rsync.macports.org/macports/release/tarballs/ports/_resources/port1.0/group/java-1.0.tcl
390:debug:main Sourcing PortGroup active_variants 1.1 from /opt/local/var/macports/sources/rsync.macports.org/macports/release/tarballs/ports/_resources/port1.0/group/active_variants-1.1.tcl
391:debug:main Sourcing PortGroup compilers 1.0 from /opt/local/var/macports/sources/rsync.macports.org/macports/release/tarballs/ports/_resources/port1.0/group/compilers-1.0.tcl
392:debug:main Sourcing PortGroup xcodeversion 1.0 from /opt/local/var/macports/sources/rsync.macports.org/macports/release/tarballs/ports/_resources/port1.0/group/xcodeversion-1.0.tcl
393:debug:main Sourcing PortGroup compiler_blacklist_versions 1.0 from /opt/local/var/macports/sources/rsync.macports.org/macports/release/tarballs/ports/_resources/port1.0/group/compiler_blacklist_versions-1.0.tcl
394:debug:main Re-registering default for livecheck.regex
395:debug:main compiler clang 1100.0.33.8 not blacklisted because it doesn't match {clang < 710}
396:debug:main Reading variant descriptions from /opt/local/var/macports/sources/rsync.macports.org/macports/release/tarballs/ports/_resources/port1.0/variant_descriptions.conf
397:debug:main universal_variant is false, so not adding the default universal variant
398:debug:main Running callback portconfigure::add_automatic_compiler_dependencies
399:debug:main Finished running callback portconfigure::add_automatic_compiler_dependencies
400:debug:main Running callback portbuild::add_automatic_buildsystem_dependencies
401:debug:main Finished running callback portbuild::add_automatic_buildsystem_dependencies
402:debug:main Running callback portstartupitem::add_notes
403:debug:main Finished running callback portstartupitem::add_notes
404:debug:main Running callback java_set_env
405:debug:main Discovered JAVA_HOME via /usr/libexec/java_home: /Library/Java/JavaVirtualMachines/openjdk12/Contents/Home
406:debug:main Finished running callback java_set_env
407:debug:main No need to upgrade! bazel26 0.26.1_0 >= bazel26 0.26.1_0
408:debug:main epoch: in tree: 0 installed: 0
409:debug:main cctools 921_4 exists in the ports tree
410:debug:main cctools 921_4 +llvm80 is the latest installed
411:debug:main cctools 921_4 +llvm80 is active
412:debug:main Merging existing variants '+llvm80' into variants
413:debug:main new fully merged portvariants: llvm80 +
414:debug:main Changing to port directory: /opt/local/var/macports/sources/rsync.macports.org/macports/release/tarballs/ports/devel/cctools
415:debug:main OS darwin/19.0.0 (macOS 10.15) arch i386
416:debug:main Reading variant descriptions from /opt/local/var/macports/sources/rsync.macports.org/macports/release/tarballs/ports/_resources/port1.0/variant_descriptions.conf
417:debug:main universal variant already exists, so not adding the default one
418:debug:main Executing variant llvm80 provides llvm80
419:debug:main Running callback portconfigure::add_automatic_compiler_dependencies
420:debug:main Finished running callback portconfigure::add_automatic_compiler_dependencies
421:debug:main Running callback portbuild::add_automatic_buildsystem_dependencies
422:debug:main Finished running callback portbuild::add_automatic_buildsystem_dependencies
423:debug:main Running callback portstartupitem::add_notes
424:debug:main Finished running callback portstartupitem::add_notes
425:debug:main No need to upgrade! cctools 921_4 >= cctools 921_4
426:debug:main epoch: in tree: 1 installed: 1
427:debug:main llvm-8.0 8.0.1_0 exists in the ports tree
428:debug:main llvm-8.0 8.0.1_0  is the latest installed
429:debug:main llvm-8.0 8.0.1_0  is active
430:debug:main Merging existing variants '' into variants
431:debug:main new fully merged portvariants:
432:debug:main Changing to port directory: /opt/local/var/macports/sources/rsync.macports.org/macports/release/tarballs/ports/lang/llvm-8.0
433:debug:main OS darwin/19.0.0 (macOS 10.15) arch i386
434:debug:main Sourcing PortGroup select 1.0 from /opt/local/var/macports/sources/rsync.macports.org/macports/release/tarballs/ports/_resources/port1.0/group/select-1.0.tcl
435:debug:main Sourcing PortGroup compiler_blacklist_versions 1.0 from /opt/local/var/macports/sources/rsync.macports.org/macports/release/tarballs/ports/_resources/port1.0/group/compiler_blacklist_versions-1.0.tcl
436:debug:main Sourcing PortGroup active_variants 1.1 from /opt/local/var/macports/sources/rsync.macports.org/macports/release/tarballs/ports/_resources/port1.0/group/active_variants-1.1.tcl
437:debug:main Re-registering default for configure.dir
438:debug:main Re-registering default for configure.pre_args
439:debug:main Re-registering default for build.dir
440:debug:main Re-registering default for destroot.target
441:debug:main Sourcing PortGroup cmake 1.0 from /opt/local/var/macports/sources/rsync.macports.org/macports/release/tarballs/ports/_resources/port1.0/group/cmake-1.0.tcl
442:debug:main Re-registering default for configure.dir
443:debug:main Re-registering default for build.dir
444:debug:main compiler clang 1100.0.33.8 not blacklisted because it doesn't match {clang < 602}
445:debug:main Reading variant descriptions from /opt/local/var/macports/sources/rsync.macports.org/macports/release/tarballs/ports/_resources/port1.0/variant_descriptions.conf
446:debug:main universal variant already exists, so not adding the default one
447:debug:main Running callback portconfigure::add_automatic_compiler_dependencies
448:debug:main Finished running callback portconfigure::add_automatic_compiler_dependencies
449:debug:main Running callback portbuild::add_automatic_buildsystem_dependencies
450:debug:main Finished running callback portbuild::add_automatic_buildsystem_dependencies
451:debug:main Running callback portstartupitem::add_notes
452:debug:main Finished running callback portstartupitem::add_notes
453:debug:main No need to upgrade! llvm-8.0 8.0.1_0 >= llvm-8.0 8.0.1_0
454:debug:main epoch: in tree: 0 installed: 0
455:debug:main xar 1.6.1_1 exists in the ports tree
456:debug:main xar 1.6.1_1  is the latest installed
457:debug:main xar 1.6.1_1  is active
458:debug:main Merging existing variants '' into variants
459:debug:main new fully merged portvariants:
460:debug:main Changing to port directory: /opt/local/var/macports/sources/rsync.macports.org/macports/release/tarballs/ports/archivers/xar
461:debug:main OS darwin/19.0.0 (macOS 10.15) arch i386
462:debug:main Sourcing PortGroup github 1.0 from /opt/local/var/macports/sources/rsync.macports.org/macports/release/tarballs/ports/_resources/port1.0/group/github-1.0.tcl
463:debug:main Sourcing PortGroup clang_dependency 1.0 from /opt/local/var/macports/sources/rsync.macports.org/macports/release/tarballs/ports/_resources/port1.0/group/clang_dependency-1.0.tcl
464:debug:main Re-registering default for livecheck.regex
465:debug:main adding the default universal variant
466:debug:main Reading variant descriptions from /opt/local/var/macports/sources/rsync.macports.org/macports/release/tarballs/ports/_resources/port1.0/variant_descriptions.conf
467:debug:main Running callback portconfigure::add_automatic_compiler_dependencies
468:debug:main Finished running callback portconfigure::add_automatic_compiler_dependencies
469:debug:main Running callback portbuild::add_automatic_buildsystem_dependencies
470:debug:main Finished running callback portbuild::add_automatic_buildsystem_dependencies
471:debug:main Running callback portstartupitem::add_notes
472:debug:main Finished running callback portstartupitem::add_notes
473:debug:main No need to upgrade! xar 1.6.1_1 >= xar 1.6.1_1
474:debug:main epoch: in tree: 0 installed: 0
475:debug:main libxml2 2.9.9_2 exists in the ports tree
476:debug:main libxml2 2.9.9_2  is the latest installed
477:debug:main libxml2 2.9.9_2  is active
478:debug:main Merging existing variants '' into variants
479:debug:main new fully merged portvariants:
480:debug:main Changing to port directory: /opt/local/var/macports/sources/rsync.macports.org/macports/release/tarballs/ports/textproc/libxml2
481:debug:main OS darwin/19.0.0 (macOS 10.15) arch i386
482:debug:main Sourcing PortGroup clang_dependency 1.0 from /opt/local/var/macports/sources/rsync.macports.org/macports/release/tarballs/ports/_resources/port1.0/group/clang_dependency-1.0.tcl
483:debug:main adding the default universal variant
484:debug:main Reading variant descriptions from /opt/local/var/macports/sources/rsync.macports.org/macports/release/tarballs/ports/_resources/port1.0/variant_descriptions.conf
485:debug:main Running callback portconfigure::add_automatic_compiler_dependencies
486:debug:main Finished running callback portconfigure::add_automatic_compiler_dependencies
487:debug:main Running callback portbuild::add_automatic_buildsystem_dependencies
488:debug:main Finished running callback portbuild::add_automatic_buildsystem_dependencies
489:debug:main Running callback portstartupitem::add_notes
490:debug:main Finished running callback portstartupitem::add_notes
491:debug:main No need to upgrade! libxml2 2.9.9_2 >= libxml2 2.9.9_2
492:debug:main epoch: in tree: 0 installed: 0
493:debug:main icu 58.2_2 exists in the ports tree
494:debug:main icu 58.2_2  is the latest installed
495:debug:main icu 58.2_2  is active
496:debug:main Merging existing variants '' into variants
497:debug:main new fully merged portvariants:
498:debug:main Changing to port directory: /opt/local/var/macports/sources/rsync.macports.org/macports/release/tarballs/ports/devel/icu
499:debug:main OS darwin/19.0.0 (macOS 10.15) arch i386
500:debug:main Sourcing PortGroup clang_dependency 1.0 from /opt/local/var/macports/sources/rsync.macports.org/macports/release/tarballs/ports/_resources/port1.0/group/clang_dependency-1.0.tcl
501:debug:main Reading variant descriptions from /opt/local/var/macports/sources/rsync.macports.org/macports/release/tarballs/ports/_resources/port1.0/variant_descriptions.conf
502:debug:main Sourcing PortGroup muniversal 1.0 from /opt/local/var/macports/sources/rsync.macports.org/macports/release/tarballs/ports/_resources/port1.0/group/muniversal-1.0.tcl
503:debug:main universal variant already exists, so not adding the default one
504:debug:main Running callback portconfigure::add_automatic_compiler_dependencies
505:debug:main Finished running callback portconfigure::add_automatic_compiler_dependencies
506:debug:main Running callback portbuild::add_automatic_buildsystem_dependencies
507:debug:main Finished running callback portbuild::add_automatic_buildsystem_dependencies
508:debug:main Running callback portstartupitem::add_notes
509:debug:main Finished running callback portstartupitem::add_notes
510:debug:main No need to upgrade! icu 58.2_2 >= icu 58.2_2
511:debug:main epoch: in tree: 1 installed: 1
512:debug:main libcxx 5.0.1_4 exists in the ports tree
513:debug:main libcxx 5.0.1_4  is the latest installed
514:debug:main libcxx 5.0.1_4  is active
515:debug:main Merging existing variants '' into variants
516:debug:main new fully merged portvariants:
517:debug:main Changing to port directory: /opt/local/var/macports/sources/rsync.macports.org/macports/release/tarballs/ports/lang/libcxx
518:debug:main OS darwin/19.0.0 (macOS 10.15) arch i386
519:debug:main Sourcing PortGroup compiler_blacklist_versions 1.0 from /opt/local/var/macports/sources/rsync.macports.org/macports/release/tarballs/ports/_resources/port1.0/group/compiler_blacklist_versions-1.0.tcl
520:debug:main Sourcing PortGroup active_variants 1.1 from /opt/local/var/macports/sources/rsync.macports.org/macports/release/tarballs/ports/_resources/port1.0/group/active_variants-1.1.tcl
521:debug:main universal_variant is false, so not adding the default universal variant
522:debug:main Running callback portconfigure::add_automatic_compiler_dependencies
523:debug:main Finished running callback portconfigure::add_automatic_compiler_dependencies
524:debug:main Running callback portbuild::add_automatic_buildsystem_dependencies
525:debug:main Finished running callback portbuild::add_automatic_buildsystem_dependencies
526:debug:main Running callback portstartupitem::add_notes
527:debug:main Finished running callback portstartupitem::add_notes
528:debug:main No need to upgrade! libcxx 5.0.1_4 >= libcxx 5.0.1_4
529:debug:main epoch: in tree: 0 installed: 0
530:debug:main perl5 5.26.1_0 exists in the ports tree
531:debug:main perl5 5.26.1_0 +perl5_28 is the latest installed
532:debug:main perl5 5.26.1_0 +perl5_28 is active
533:debug:main Merging existing variants '+perl5_28' into variants
534:debug:main new fully merged portvariants: perl5_28 +
535:debug:main Changing to port directory: /opt/local/var/macports/sources/rsync.macports.org/macports/release/tarballs/ports/lang/perl5
536:debug:main OS darwin/19.0.0 (macOS 10.15) arch i386
537:debug:main Re-registering default for configure.universal_args
538:debug:main Sourcing PortGroup perl5 1.0 from /opt/local/var/macports/sources/rsync.macports.org/macports/release/tarballs/ports/_resources/port1.0/group/perl5-1.0.tcl
539:debug:main Sourcing PortGroup clang_dependency 1.0 from /opt/local/var/macports/sources/rsync.macports.org/macports/release/tarballs/ports/_resources/port1.0/group/clang_dependency-1.0.tcl
540:debug:main universal_variant is false, so not adding the default universal variant
541:debug:main Executing variant perl5_28 provides perl5_28
542:debug:main Running callback portconfigure::add_automatic_compiler_dependencies
543:debug:main Finished running callback portconfigure::add_automatic_compiler_dependencies
544:debug:main Running callback portbuild::add_automatic_buildsystem_dependencies
545:debug:main Finished running callback portbuild::add_automatic_buildsystem_dependencies
546:debug:main Running callback portstartupitem::add_notes
547:debug:main Finished running callback portstartupitem::add_notes
548:debug:main No need to upgrade! perl5 5.26.1_0 >= perl5 5.26.1_0
549:debug:main epoch: in tree: 0 installed: 0
550:debug:main perl5.28 5.28.2_0 exists in the ports tree
551:debug:main perl5.28 5.28.2_0  is the latest installed
552:debug:main perl5.28 5.28.2_0  is active
553:debug:main Merging existing variants '' into variants
554:debug:main new fully merged portvariants:
555:debug:main Changing to port directory: /opt/local/var/macports/sources/rsync.macports.org/macports/release/tarballs/ports/lang/perl5
556:debug:main OS darwin/19.0.0 (macOS 10.15) arch i386
557:debug:main Re-registering default for configure.universal_args
558:debug:main Sourcing PortGroup perl5 1.0 from /opt/local/var/macports/sources/rsync.macports.org/macports/release/tarballs/ports/_resources/port1.0/group/perl5-1.0.tcl
559:debug:main Sourcing PortGroup clang_dependency 1.0 from /opt/local/var/macports/sources/rsync.macports.org/macports/release/tarballs/ports/_resources/port1.0/group/clang_dependency-1.0.tcl
560:debug:main adding the default universal variant
561:debug:main Reading variant descriptions from /opt/local/var/macports/sources/rsync.macports.org/macports/release/tarballs/ports/_resources/port1.0/variant_descriptions.conf
562:debug:main Running callback portconfigure::add_automatic_compiler_dependencies
563:debug:main Finished running callback portconfigure::add_automatic_compiler_dependencies
564:debug:main Running callback portbuild::add_automatic_buildsystem_dependencies
565:debug:main Finished running callback portbuild::add_automatic_buildsystem_dependencies
566:debug:main Running callback portstartupitem::add_notes
567:debug:main Finished running callback portstartupitem::add_notes
568:debug:main No need to upgrade! perl5.28 5.28.2_0 >= perl5.28 5.28.2_0
569:debug:main epoch: in tree: 0 installed: 0
570:debug:main db48 4.8.30_4 exists in the ports tree
571:debug:main db48 4.8.30_4  is the latest installed
572:debug:main db48 4.8.30_4  is active
573:debug:main Merging existing variants '' into variants
574:debug:main new fully merged portvariants:
575:debug:main Changing to port directory: /opt/local/var/macports/sources/rsync.macports.org/macports/release/tarballs/ports/databases/db48
576:debug:main OS darwin/19.0.0 (macOS 10.15) arch i386
577:debug:main Reading variant descriptions from /opt/local/var/macports/sources/rsync.macports.org/macports/release/tarballs/ports/_resources/port1.0/variant_descriptions.conf
578:debug:main Sourcing PortGroup muniversal 1.0 from /opt/local/var/macports/sources/rsync.macports.org/macports/release/tarballs/ports/_resources/port1.0/group/muniversal-1.0.tcl
579:debug:main Sourcing PortGroup clang_dependency 1.0 from /opt/local/var/macports/sources/rsync.macports.org/macports/release/tarballs/ports/_resources/port1.0/group/clang_dependency-1.0.tcl
580:debug:main universal variant already exists, so not adding the default one
581:debug:main Running callback portconfigure::add_automatic_compiler_dependencies
582:debug:main Finished running callback portconfigure::add_automatic_compiler_dependencies
583:debug:main Running callback portbuild::add_automatic_buildsystem_dependencies
584:debug:main Finished running callback portbuild::add_automatic_buildsystem_dependencies
585:debug:main Running callback portstartupitem::add_notes
586:debug:main Finished running callback portstartupitem::add_notes
587:debug:main No need to upgrade! db48 4.8.30_4 >= db48 4.8.30_4
588:debug:main epoch: in tree: 0 installed: 0
589:debug:main gdbm 1.18.1_1 exists in the ports tree
590:debug:main gdbm 1.18.1_1  is the latest installed
591:debug:main gdbm 1.18.1_1  is active
592:debug:main Merging existing variants '' into variants
593:debug:main new fully merged portvariants:
594:debug:main Changing to port directory: /opt/local/var/macports/sources/rsync.macports.org/macports/release/tarballs/ports/databases/gdbm
595:debug:main OS darwin/19.0.0 (macOS 10.15) arch i386
596:debug:main Sourcing PortGroup clang_dependency 1.0 from /opt/local/var/macports/sources/rsync.macports.org/macports/release/tarballs/ports/_resources/port1.0/group/clang_dependency-1.0.tcl
597:debug:main adding the default universal variant
598:debug:main Reading variant descriptions from /opt/local/var/macports/sources/rsync.macports.org/macports/release/tarballs/ports/_resources/port1.0/variant_descriptions.conf
599:debug:main Running callback portconfigure::add_automatic_compiler_dependencies
600:debug:main Finished running callback portconfigure::add_automatic_compiler_dependencies
601:debug:main Running callback portbuild::add_automatic_buildsystem_dependencies
602:debug:main Finished running callback portbuild::add_automatic_buildsystem_dependencies
603:debug:main Running callback portstartupitem::add_notes
604:debug:main Finished running callback portstartupitem::add_notes
605:debug:main No need to upgrade! gdbm 1.18.1_1 >= gdbm 1.18.1_1
606:debug:main epoch: in tree: 0 installed: 0
607:debug:main readline 8.0.000_0 exists in the ports tree
608:debug:main readline 8.0.000_0  is the latest installed
609:debug:main readline 8.0.000_0  is active
610:debug:main Merging existing variants '' into variants
611:debug:main new fully merged portvariants:
612:debug:main Changing to port directory: /opt/local/var/macports/sources/rsync.macports.org/macports/release/tarballs/ports/devel/readline
613:debug:main OS darwin/19.0.0 (macOS 10.15) arch i386
614:debug:main Reading variant descriptions from /opt/local/var/macports/sources/rsync.macports.org/macports/release/tarballs/ports/_resources/port1.0/variant_descriptions.conf
615:debug:main Sourcing PortGroup muniversal 1.0 from /opt/local/var/macports/sources/rsync.macports.org/macports/release/tarballs/ports/_resources/port1.0/group/muniversal-1.0.tcl
616:debug:main Sourcing PortGroup clang_dependency 1.0 from /opt/local/var/macports/sources/rsync.macports.org/macports/release/tarballs/ports/_resources/port1.0/group/clang_dependency-1.0.tcl
617:debug:main universal variant already exists, so not adding the default one
618:debug:main Running callback portconfigure::add_automatic_compiler_dependencies
619:debug:main Finished running callback portconfigure::add_automatic_compiler_dependencies
620:debug:main Running callback portbuild::add_automatic_buildsystem_dependencies
621:debug:main Finished running callback portbuild::add_automatic_buildsystem_dependencies
622:debug:main Running callback portstartupitem::add_notes
623:debug:main Finished running callback portstartupitem::add_notes
624:debug:main No need to upgrade! readline 8.0.000_0 >= readline 8.0.000_0
625:debug:main epoch: in tree: 0 installed: 0
626:debug:main llvm_select 2_0 exists in the ports tree
627:debug:main llvm_select 2_0  is the latest installed
628:debug:main llvm_select 2_0  is active
629:debug:main Merging existing variants '' into variants
630:debug:main new fully merged portvariants:
631:debug:main Changing to port directory: /opt/local/var/macports/sources/rsync.macports.org/macports/release/tarballs/ports/sysutils/llvm_select
632:debug:main OS darwin/19.0.0 (macOS 10.15) arch i386
633:debug:main Sourcing PortGroup select 1.0 from /opt/local/var/macports/sources/rsync.macports.org/macports/release/tarballs/ports/_resources/port1.0/group/select-1.0.tcl
634:debug:main universal_variant is false, so not adding the default universal variant
635:debug:main Running callback portconfigure::add_automatic_compiler_dependencies
636:debug:main Finished running callback portconfigure::add_automatic_compiler_dependencies
637:debug:main Running callback portbuild::add_automatic_buildsystem_dependencies
638:debug:main Finished running callback portbuild::add_automatic_buildsystem_dependencies
639:debug:main Running callback portstartupitem::add_notes
640:debug:main Finished running callback portstartupitem::add_notes
641:debug:main No need to upgrade! llvm_select 2_0 >= llvm_select 2_0
642:debug:main epoch: in tree: 0 installed: 0
643:debug:main py37-absl 0.7.1_0 exists in the ports tree
644:debug:main py37-absl 0.7.1_0  is the latest installed
645:debug:main py37-absl 0.7.1_0  is active
646:debug:main Merging existing variants '' into variants
647:debug:main new fully merged portvariants:
648:debug:main Changing to port directory: /opt/local/var/macports/sources/rsync.macports.org/macports/release/tarballs/ports/python/py-absl
649:debug:main OS darwin/19.0.0 (macOS 10.15) arch i386
650:debug:main Re-registering default for build.cmd
651:debug:main Re-registering default for destroot.cmd
652:debug:main Re-registering default for destroot.destdir
653:debug:main Sourcing PortGroup python 1.0 from /opt/local/var/macports/sources/rsync.macports.org/macports/release/tarballs/ports/_resources/port1.0/group/python-1.0.tcl
654:debug:main only one arch supported, so not adding the default universal variant
655:debug:main Running callback portconfigure::add_automatic_compiler_dependencies
656:debug:main Finished running callback portconfigure::add_automatic_compiler_dependencies
657:debug:main Running callback portbuild::add_automatic_buildsystem_dependencies
658:debug:main Finished running callback portbuild::add_automatic_buildsystem_dependencies
659:debug:main Running callback portstartupitem::add_notes
660:debug:main Finished running callback portstartupitem::add_notes
661:debug:main No need to upgrade! py37-absl 0.7.1_0 >= py37-absl 0.7.1_0
662:debug:main epoch: in tree: 0 installed: 0
663:debug:main py37-astor 0.7.1_0 exists in the ports tree
664:debug:main py37-astor 0.7.1_0  is the latest installed
665:debug:main py37-astor 0.7.1_0  is active
666:debug:main Merging existing variants '' into variants
667:debug:main new fully merged portvariants:
668:debug:main Changing to port directory: /opt/local/var/macports/sources/rsync.macports.org/macports/release/tarballs/ports/python/py-astor
669:debug:main OS darwin/19.0.0 (macOS 10.15) arch i386
670:debug:main Re-registering default for build.cmd
671:debug:main Re-registering default for destroot.cmd
672:debug:main Re-registering default for destroot.destdir
673:debug:main Sourcing PortGroup python 1.0 from /opt/local/var/macports/sources/rsync.macports.org/macports/release/tarballs/ports/_resources/port1.0/group/python-1.0.tcl
674:debug:main adding the default universal variant
675:debug:main Reading variant descriptions from /opt/local/var/macports/sources/rsync.macports.org/macports/release/tarballs/ports/_resources/port1.0/variant_descriptions.conf
676:debug:main Running callback portconfigure::add_automatic_compiler_dependencies
677:debug:main Finished running callback portconfigure::add_automatic_compiler_dependencies
678:debug:main Running callback portbuild::add_automatic_buildsystem_dependencies
679:debug:main Finished running callback portbuild::add_automatic_buildsystem_dependencies
680:debug:main Running callback portstartupitem::add_notes
681:debug:main Finished running callback portstartupitem::add_notes
682:debug:main No need to upgrade! py37-astor 0.7.1_0 >= py37-astor 0.7.1_0
683:debug:main epoch: in tree: 0 installed: 0
684:debug:main py37-gast 0.2.2_0 exists in the ports tree
685:debug:main py37-gast 0.2.2_0  is the latest installed
686:debug:main py37-gast 0.2.2_0  is active
687:debug:main Merging existing variants '' into variants
688:debug:main new fully merged portvariants:
689:debug:main Changing to port directory: /opt/local/var/macports/sources/rsync.macports.org/macports/release/tarballs/ports/python/py-gast
690:debug:main OS darwin/19.0.0 (macOS 10.15) arch i386
691:debug:main Re-registering default for build.cmd
692:debug:main Re-registering default for destroot.cmd
693:debug:main Re-registering default for destroot.destdir
694:debug:main Sourcing PortGroup python 1.0 from /opt/local/var/macports/sources/rsync.macports.org/macports/release/tarballs/ports/_resources/port1.0/group/python-1.0.tcl
695:debug:main adding the default universal variant
696:debug:main Reading variant descriptions from /opt/local/var/macports/sources/rsync.macports.org/macports/release/tarballs/ports/_resources/port1.0/variant_descriptions.conf
697:debug:main Running callback portconfigure::add_automatic_compiler_dependencies
698:debug:main Finished running callback portconfigure::add_automatic_compiler_dependencies
699:debug:main Running callback portbuild::add_automatic_buildsystem_dependencies
700:debug:main Finished running callback portbuild::add_automatic_buildsystem_dependencies
701:debug:main Running callback portstartupitem::add_notes
702:debug:main Finished running callback portstartupitem::add_notes
703:debug:main No need to upgrade! py37-gast 0.2.2_0 >= py37-gast 0.2.2_0
704:debug:main epoch: in tree: 0 installed: 0
705:debug:main py37-google-pasta 0.1.7_0 exists in the ports tree
706:debug:main py37-google-pasta 0.1.7_0  is the latest installed
707:debug:main py37-google-pasta 0.1.7_0  is active
708:debug:main Merging existing variants '' into variants
709:debug:main new fully merged portvariants:
710:debug:main Changing to port directory: /opt/local/var/macports/sources/rsync.macports.org/macports/release/tarballs/ports/python/py-google-pasta
711:debug:main OS darwin/19.0.0 (macOS 10.15) arch i386
712:debug:main Sourcing PortGroup github 1.0 from /opt/local/var/macports/sources/rsync.macports.org/macports/release/tarballs/ports/_resources/port1.0/group/github-1.0.tcl
713:debug:main Re-registering default for build.cmd
714:debug:main Re-registering default for destroot.cmd
715:debug:main Re-registering default for destroot.destdir
716:debug:main Sourcing PortGroup python 1.0 from /opt/local/var/macports/sources/rsync.macports.org/macports/release/tarballs/ports/_resources/port1.0/group/python-1.0.tcl
717:debug:main Re-registering default for livecheck.regex
718:debug:main only one arch supported, so not adding the default universal variant
719:debug:main Running callback portconfigure::add_automatic_compiler_dependencies
720:debug:main Finished running callback portconfigure::add_automatic_compiler_dependencies
721:debug:main Running callback portbuild::add_automatic_buildsystem_dependencies
722:debug:main Finished running callback portbuild::add_automatic_buildsystem_dependencies
723:debug:main Running callback portstartupitem::add_notes
724:debug:main Finished running callback portstartupitem::add_notes
725:debug:main No need to upgrade! py37-google-pasta 0.1.7_0 >= py37-google-pasta 0.1.7_0
726:debug:main epoch: in tree: 0 installed: 0
727:debug:main py37-grpcio 1.23.0_1 exists in the ports tree
728:debug:main py37-grpcio 1.23.0_1  is the latest installed
729:debug:main py37-grpcio 1.23.0_1  is active
730:debug:main Merging existing variants '' into variants
731:debug:main new fully merged portvariants:
732:debug:main Changing to port directory: /opt/local/var/macports/sources/rsync.macports.org/macports/release/tarballs/ports/python/py-grpcio
733:debug:main OS darwin/19.0.0 (macOS 10.15) arch i386
734:debug:main Re-registering default for build.cmd
735:debug:main Re-registering default for destroot.cmd
736:debug:main Re-registering default for destroot.destdir
737:debug:main Sourcing PortGroup python 1.0 from /opt/local/var/macports/sources/rsync.macports.org/macports/release/tarballs/ports/_resources/port1.0/group/python-1.0.tcl
738:debug:main adding the default universal variant
739:debug:main Reading variant descriptions from /opt/local/var/macports/sources/rsync.macports.org/macports/release/tarballs/ports/_resources/port1.0/variant_descriptions.conf
740:debug:main Running callback portconfigure::add_automatic_compiler_dependencies
741:debug:main Finished running callback portconfigure::add_automatic_compiler_dependencies
742:debug:main Running callback portbuild::add_automatic_buildsystem_dependencies
743:debug:main Finished running callback portbuild::add_automatic_buildsystem_dependencies
744:debug:main Running callback portstartupitem::add_notes
745:debug:main Finished running callback portstartupitem::add_notes
746:debug:main No need to upgrade! py37-grpcio 1.23.0_1 >= py37-grpcio 1.23.0_1
747:debug:main epoch: in tree: 0 installed: 0
748:debug:main c-ares 1.15.0_0 exists in the ports tree
749:debug:main c-ares 1.15.0_0  is the latest installed
750:debug:main c-ares 1.15.0_0  is active
751:debug:main Merging existing variants '' into variants
752:debug:main new fully merged portvariants:
753:debug:main Changing to port directory: /opt/local/var/macports/sources/rsync.macports.org/macports/release/tarballs/ports/net/c-ares
754:debug:main OS darwin/19.0.0 (macOS 10.15) arch i386
755:debug:main adding the default universal variant
756:debug:main Reading variant descriptions from /opt/local/var/macports/sources/rsync.macports.org/macports/release/tarballs/ports/_resources/port1.0/variant_descriptions.conf
757:debug:main Running callback portconfigure::add_automatic_compiler_dependencies
758:debug:main Finished running callback portconfigure::add_automatic_compiler_dependencies
759:debug:main Running callback portbuild::add_automatic_buildsystem_dependencies
760:debug:main Finished running callback portbuild::add_automatic_buildsystem_dependencies
761:debug:main Running callback portstartupitem::add_notes
762:debug:main Finished running callback portstartupitem::add_notes
763:debug:main No need to upgrade! c-ares 1.15.0_0 >= c-ares 1.15.0_0
764:debug:main epoch: in tree: 0 installed: 0
765:debug:main py37-protobuf3 3.10.0_0 exists in the ports tree
766:debug:main py37-protobuf3 3.10.0_0  is the latest installed
767:debug:main py37-protobuf3 3.10.0_0  is active
768:debug:main Merging existing variants '' into variants
769:debug:main new fully merged portvariants:
770:debug:main Changing to port directory: /opt/local/var/macports/sources/rsync.macports.org/macports/release/tarballs/ports/python/py-protobuf3
771:debug:main OS darwin/19.0.0 (macOS 10.15) arch i386
772:debug:main Re-registering default for build.cmd
773:debug:main Re-registering default for destroot.cmd
774:debug:main Re-registering default for destroot.destdir
775:debug:main Sourcing PortGroup python 1.0 from /opt/local/var/macports/sources/rsync.macports.org/macports/release/tarballs/ports/_resources/port1.0/group/python-1.0.tcl
776:debug:main Sourcing PortGroup github 1.0 from /opt/local/var/macports/sources/rsync.macports.org/macports/release/tarballs/ports/_resources/port1.0/group/github-1.0.tcl
777:debug:main Sourcing PortGroup compiler_blacklist_versions 1.0 from /opt/local/var/macports/sources/rsync.macports.org/macports/release/tarballs/ports/_resources/port1.0/group/compiler_blacklist_versions-1.0.tcl
778:debug:main compiler clang 1100.0.33.8 not blacklisted because it doesn't match {clang < 700}
779:debug:main Sourcing PortGroup cxx11 1.1 from /opt/local/var/macports/sources/rsync.macports.org/macports/release/tarballs/ports/_resources/port1.0/group/cxx11-1.1.tcl
780:debug:main Re-registering default for livecheck.regex
781:debug:main adding the default universal variant
782:debug:main Reading variant descriptions from /opt/local/var/macports/sources/rsync.macports.org/macports/release/tarballs/ports/_resources/port1.0/variant_descriptions.conf
783:debug:main Running callback portconfigure::add_automatic_compiler_dependencies
784:debug:main Finished running callback portconfigure::add_automatic_compiler_dependencies
785:debug:main Running callback portbuild::add_automatic_buildsystem_dependencies
786:debug:main Finished running callback portbuild::add_automatic_buildsystem_dependencies
787:debug:main Running callback portstartupitem::add_notes
788:debug:main Finished running callback portstartupitem::add_notes
789:debug:main No need to upgrade! py37-protobuf3 3.10.0_0 >= py37-protobuf3 3.10.0_0
790:debug:main epoch: in tree: 0 installed: 0
791:debug:main protobuf3-cpp 3.10.0_0 exists in the ports tree
792:debug:main protobuf3-cpp 3.10.0_0  is the latest installed
793:debug:main protobuf3-cpp 3.10.0_0  is active
794:debug:main Merging existing variants '' into variants
795:debug:main new fully merged portvariants:
796:debug:main Changing to port directory: /opt/local/var/macports/sources/rsync.macports.org/macports/release/tarballs/ports/devel/protobuf3-cpp
797:debug:main OS darwin/19.0.0 (macOS 10.15) arch i386
798:debug:main Sourcing PortGroup github 1.0 from /opt/local/var/macports/sources/rsync.macports.org/macports/release/tarballs/ports/_resources/port1.0/group/github-1.0.tcl
799:debug:main Re-registering default for livecheck.regex
800:debug:main adding the default universal variant
801:debug:main Reading variant descriptions from /opt/local/var/macports/sources/rsync.macports.org/macports/release/tarballs/ports/_resources/port1.0/variant_descriptions.conf
802:debug:main Running callback portconfigure::add_automatic_compiler_dependencies
803:debug:main Finished running callback portconfigure::add_automatic_compiler_dependencies
804:debug:main Running callback portbuild::add_automatic_buildsystem_dependencies
805:debug:main Finished running callback portbuild::add_automatic_buildsystem_dependencies
806:debug:main Running callback portstartupitem::add_notes
807:debug:main Finished running callback portstartupitem::add_notes
808:debug:main No need to upgrade! protobuf3-cpp 3.10.0_0 >= protobuf3-cpp 3.10.0_0
809:debug:main epoch: in tree: 0 installed: 0
810:debug:main py37-keras 2.2.5_0 exists in the ports tree
811:debug:main py37-keras 2.2.5_0  is the latest installed
812:debug:main py37-keras 2.2.5_0  is active
813:debug:main Merging existing variants '' into variants
814:debug:main new fully merged portvariants:
815:debug:main Changing to port directory: /opt/local/var/macports/sources/rsync.macports.org/macports/release/tarballs/ports/python/py-keras
816:debug:main OS darwin/19.0.0 (macOS 10.15) arch i386
817:debug:main Re-registering default for build.cmd
818:debug:main Re-registering default for destroot.cmd
819:debug:main Re-registering default for destroot.destdir
820:debug:main Sourcing PortGroup python 1.0 from /opt/local/var/macports/sources/rsync.macports.org/macports/release/tarballs/ports/_resources/port1.0/group/python-1.0.tcl
821:debug:main only one arch supported, so not adding the default universal variant
822:debug:main Running callback portconfigure::add_automatic_compiler_dependencies
823:debug:main Finished running callback portconfigure::add_automatic_compiler_dependencies
824:debug:main Running callback portbuild::add_automatic_buildsystem_dependencies
825:debug:main Finished running callback portbuild::add_automatic_buildsystem_dependencies
826:debug:main Running callback portstartupitem::add_notes
827:debug:main Finished running callback portstartupitem::add_notes
828:debug:main No need to upgrade! py37-keras 2.2.5_0 >= py37-keras 2.2.5_0
829:debug:main epoch: in tree: 0 installed: 0
830:debug:main py37-numpy 1.17.2_0 exists in the ports tree
831:debug:main py37-numpy 1.17.2_0 +gfortran+openblas is the latest installed
832:debug:main py37-numpy 1.17.2_0 +gfortran+openblas is active
833:debug:main Merging existing variants '+gfortran+openblas' into variants
834:debug:main new fully merged portvariants: openblas + gfortran +
835:debug:main Changing to port directory: /opt/local/var/macports/sources/rsync.macports.org/macports/release/tarballs/ports/python/py-numpy
836:debug:main OS darwin/19.0.0 (macOS 10.15) arch i386
837:debug:main Re-registering default for build.cmd
838:debug:main Re-registering default for destroot.cmd
839:debug:main Re-registering default for destroot.destdir
840:debug:main Sourcing PortGroup python 1.0 from /opt/local/var/macports/sources/rsync.macports.org/macports/release/tarballs/ports/_resources/port1.0/group/python-1.0.tcl
841:debug:main Sourcing PortGroup github 1.0 from /opt/local/var/macports/sources/rsync.macports.org/macports/release/tarballs/ports/_resources/port1.0/group/github-1.0.tcl
842:debug:main Sourcing PortGroup active_variants 1.1 from /opt/local/var/macports/sources/rsync.macports.org/macports/release/tarballs/ports/_resources/port1.0/group/active_variants-1.1.tcl
843:debug:main Sourcing PortGroup compilers 1.0 from /opt/local/var/macports/sources/rsync.macports.org/macports/release/tarballs/ports/_resources/port1.0/group/compilers-1.0.tcl
844:debug:main Re-registering default for livecheck.regex
845:debug:main adding the default universal variant
846:debug:main Reading variant descriptions from /opt/local/var/macports/sources/rsync.macports.org/macports/release/tarballs/ports/_resources/port1.0/variant_descriptions.conf
847:debug:main Executing variant gfortran provides gfortran
848:debug:main Executing variant openblas provides openblas
849:debug:main Running callback portconfigure::add_automatic_compiler_dependencies
850:debug:main Finished running callback portconfigure::add_automatic_compiler_dependencies
851:debug:main Running callback portbuild::add_automatic_buildsystem_dependencies
852:debug:main Finished running callback portbuild::add_automatic_buildsystem_dependencies
853:debug:main Running callback portstartupitem::add_notes
854:debug:main Finished running callback portstartupitem::add_notes
855:debug:main No need to upgrade! py37-numpy 1.17.2_0 >= py37-numpy 1.17.2_0
856:debug:main epoch: in tree: 0 installed: 0
857:debug:main fftw-3 3.3.8_0 exists in the ports tree
858:debug:main fftw-3 3.3.8_0  is the latest installed
859:debug:main fftw-3 3.3.8_0  is active
860:debug:main Merging existing variants '' into variants
861:debug:main new fully merged portvariants:
862:debug:main Changing to port directory: /opt/local/var/macports/sources/rsync.macports.org/macports/release/tarballs/ports/math/fftw-3
863:debug:main OS darwin/19.0.0 (macOS 10.15) arch i386
864:debug:main Reading variant descriptions from /opt/local/var/macports/sources/rsync.macports.org/macports/release/tarballs/ports/_resources/port1.0/variant_descriptions.conf
865:debug:main Sourcing PortGroup muniversal 1.0 from /opt/local/var/macports/sources/rsync.macports.org/macports/release/tarballs/ports/_resources/port1.0/group/muniversal-1.0.tcl
866:debug:main Sourcing PortGroup compiler_blacklist_versions 1.0 from /opt/local/var/macports/sources/rsync.macports.org/macports/release/tarballs/ports/_resources/port1.0/group/compiler_blacklist_versions-1.0.tcl
867:debug:main Sourcing PortGroup active_variants 1.1 from /opt/local/var/macports/sources/rsync.macports.org/macports/release/tarballs/ports/_resources/port1.0/group/active_variants-1.1.tcl
868:debug:main Sourcing PortGroup compilers 1.0 from /opt/local/var/macports/sources/rsync.macports.org/macports/release/tarballs/ports/_resources/port1.0/group/compilers-1.0.tcl
869:debug:main Sourcing PortGroup mpi 1.0 from /opt/local/var/macports/sources/rsync.macports.org/macports/release/tarballs/ports/_resources/port1.0/group/mpi-1.0.tcl
870:debug:main compiler clang 1100.0.33.8 not blacklisted because it doesn't match {clang <= 211.10.1}
871:debug:main universal variant already exists, so not adding the default one
872:debug:main Running callback portconfigure::add_automatic_compiler_dependencies
873:debug:main Finished running callback portconfigure::add_automatic_compiler_dependencies
874:debug:main Running callback portbuild::add_automatic_buildsystem_dependencies
875:debug:main Finished running callback portbuild::add_automatic_buildsystem_dependencies
876:debug:main Running callback portstartupitem::add_notes
877:debug:main Finished running callback portstartupitem::add_notes
878:debug:main No need to upgrade! fftw-3 3.3.8_0 >= fftw-3 3.3.8_0
879:debug:main epoch: in tree: 0 installed: 0
880:debug:main py37-nose 1.3.7_1 exists in the ports tree
881:debug:main py37-nose 1.3.7_1  is the latest installed
882:debug:main py37-nose 1.3.7_1  is active
883:debug:main Merging existing variants '' into variants
884:debug:main new fully merged portvariants:
885:debug:main Changing to port directory: /opt/local/var/macports/sources/rsync.macports.org/macports/release/tarballs/ports/python/py-nose
886:debug:main OS darwin/19.0.0 (macOS 10.15) arch i386
887:debug:main Re-registering default for build.cmd
888:debug:main Re-registering default for destroot.cmd
889:debug:main Re-registering default for destroot.destdir
890:debug:main Sourcing PortGroup python 1.0 from /opt/local/var/macports/sources/rsync.macports.org/macports/release/tarballs/ports/_resources/port1.0/group/python-1.0.tcl
891:debug:main Sourcing PortGroup select 1.0 from /opt/local/var/macports/sources/rsync.macports.org/macports/release/tarballs/ports/_resources/port1.0/group/select-1.0.tcl
892:debug:main only one arch supported, so not adding the default universal variant
893:debug:main Running callback portconfigure::add_automatic_compiler_dependencies
894:debug:main Finished running callback portconfigure::add_automatic_compiler_dependencies
895:debug:main Running callback portbuild::add_automatic_buildsystem_dependencies
896:debug:main Finished running callback portbuild::add_automatic_buildsystem_dependencies
897:debug:main Running callback portstartupitem::add_notes
898:debug:main Finished running callback portstartupitem::add_notes
899:debug:main No need to upgrade! py37-nose 1.3.7_1 >= py37-nose 1.3.7_1
900:debug:main epoch: in tree: 0 installed: 0
901:debug:main nosetests_select 0.1_0 exists in the ports tree
902:debug:main nosetests_select 0.1_0  is the latest installed
903:debug:main nosetests_select 0.1_0  is active
904:debug:main Merging existing variants '' into variants
905:debug:main new fully merged portvariants:
906:debug:main Changing to port directory: /opt/local/var/macports/sources/rsync.macports.org/macports/release/tarballs/ports/python/nosetests_select
907:debug:main OS darwin/19.0.0 (macOS 10.15) arch i386
908:debug:main Sourcing PortGroup select 1.0 from /opt/local/var/macports/sources/rsync.macports.org/macports/release/tarballs/ports/_resources/port1.0/group/select-1.0.tcl
909:debug:main universal_variant is false, so not adding the default universal variant
910:debug:main Running callback portconfigure::add_automatic_compiler_dependencies
911:debug:main Finished running callback portconfigure::add_automatic_compiler_dependencies
912:debug:main Running callback portbuild::add_automatic_buildsystem_dependencies
913:debug:main Finished running callback portbuild::add_automatic_buildsystem_dependencies
914:debug:main Running callback portstartupitem::add_notes
915:debug:main Finished running callback portstartupitem::add_notes
916:debug:main No need to upgrade! nosetests_select 0.1_0 >= nosetests_select 0.1_0
917:debug:main epoch: in tree: 0 installed: 0
918:debug:main py37-cython 0.29.13_0 exists in the ports tree
919:debug:main py37-cython 0.29.13_0  is the latest installed
920:debug:main py37-cython 0.29.13_0  is active
921:debug:main Merging existing variants '' into variants
922:debug:main new fully merged portvariants:
923:debug:main Changing to port directory: /opt/local/var/macports/sources/rsync.macports.org/macports/release/tarballs/ports/python/py-cython
924:debug:main OS darwin/19.0.0 (macOS 10.15) arch i386
925:debug:main Re-registering default for build.cmd
926:debug:main Re-registering default for destroot.cmd
927:debug:main Re-registering default for destroot.destdir
928:debug:main Sourcing PortGroup python 1.0 from /opt/local/var/macports/sources/rsync.macports.org/macports/release/tarballs/ports/_resources/port1.0/group/python-1.0.tcl
929:debug:main Sourcing PortGroup select 1.0 from /opt/local/var/macports/sources/rsync.macports.org/macports/release/tarballs/ports/_resources/port1.0/group/select-1.0.tcl
930:debug:main adding the default universal variant
931:debug:main Reading variant descriptions from /opt/local/var/macports/sources/rsync.macports.org/macports/release/tarballs/ports/_resources/port1.0/variant_descriptions.conf
932:debug:main Running callback portconfigure::add_automatic_compiler_dependencies
933:debug:main Finished running callback portconfigure::add_automatic_compiler_dependencies
934:debug:main Running callback portbuild::add_automatic_buildsystem_dependencies
935:debug:main Finished running callback portbuild::add_automatic_buildsystem_dependencies
936:debug:main Running callback portstartupitem::add_notes
937:debug:main Finished running callback portstartupitem::add_notes
938:debug:main No need to upgrade! py37-cython 0.29.13_0 >= py37-cython 0.29.13_0
939:debug:main epoch: in tree: 0 installed: 0
940:debug:main cython_select 0.1_1 exists in the ports tree
941:debug:main cython_select 0.1_1  is the latest installed
942:debug:main cython_select 0.1_1  is active
943:debug:main Merging existing variants '' into variants
944:debug:main new fully merged portvariants:
945:debug:main Changing to port directory: /opt/local/var/macports/sources/rsync.macports.org/macports/release/tarballs/ports/python/cython_select
946:debug:main OS darwin/19.0.0 (macOS 10.15) arch i386
947:debug:main Sourcing PortGroup select 1.0 from /opt/local/var/macports/sources/rsync.macports.org/macports/release/tarballs/ports/_resources/port1.0/group/select-1.0.tcl
948:debug:main universal_variant is false, so not adding the default universal variant
949:debug:main Running callback portconfigure::add_automatic_compiler_dependencies
950:debug:main Finished running callback portconfigure::add_automatic_compiler_dependencies
951:debug:main Running callback portbuild::add_automatic_buildsystem_dependencies
952:debug:main Finished running callback portbuild::add_automatic_buildsystem_dependencies
953:debug:main Running callback portstartupitem::add_notes
954:debug:main Finished running callback portstartupitem::add_notes
955:debug:main No need to upgrade! cython_select 0.1_1 >= cython_select 0.1_1
956:debug:main epoch: in tree: 3 installed: 3
957:debug:main libgcc 2.0_2 exists in the ports tree
958:debug:main libgcc 2.0_2  is the latest installed
959:debug:main libgcc 2.0_2  is active
960:debug:main Merging existing variants '' into variants
961:debug:main new fully merged portvariants:
962:debug:main Changing to port directory: /opt/local/var/macports/sources/rsync.macports.org/macports/release/tarballs/ports/lang/libgcc
963:debug:main OS darwin/19.0.0 (macOS 10.15) arch i386
964:debug:main Sourcing PortGroup select 1.0 from /opt/local/var/macports/sources/rsync.macports.org/macports/release/tarballs/ports/_resources/port1.0/group/select-1.0.tcl
965:debug:main Reading variant descriptions from /opt/local/var/macports/sources/rsync.macports.org/macports/release/tarballs/ports/_resources/port1.0/variant_descriptions.conf
966:debug:main universal variant already exists, so not adding the default one
967:debug:main Running callback portconfigure::add_automatic_compiler_dependencies
968:debug:main Finished running callback portconfigure::add_automatic_compiler_dependencies
969:debug:main Running callback portbuild::add_automatic_buildsystem_dependencies
970:debug:main Finished running callback portbuild::add_automatic_buildsystem_dependencies
971:debug:main Running callback portstartupitem::add_notes
972:debug:main Finished running callback portstartupitem::add_notes
973:debug:main No need to upgrade! libgcc 2.0_2 >= libgcc 2.0_2
974:debug:main epoch: in tree: 2 installed: 2
975:debug:main libgcc9 9.2.0_0 exists in the ports tree
976:debug:main libgcc9 9.2.0_0  is the latest installed
977:debug:main libgcc9 9.2.0_0  is active
978:debug:main Merging existing variants '' into variants
979:debug:main new fully merged portvariants:
980:debug:main Changing to port directory: /opt/local/var/macports/sources/rsync.macports.org/macports/release/tarballs/ports/lang/gcc9
981:debug:main OS darwin/19.0.0 (macOS 10.15) arch i386
982:debug:main Sourcing PortGroup select 1.0 from /opt/local/var/macports/sources/rsync.macports.org/macports/release/tarballs/ports/_resources/port1.0/group/select-1.0.tcl
983:debug:main Sourcing PortGroup compiler_blacklist_versions 1.0 from /opt/local/var/macports/sources/rsync.macports.org/macports/release/tarballs/ports/_resources/port1.0/group/compiler_blacklist_versions-1.0.tcl
984:debug:main Sourcing PortGroup active_variants 1.1 from /opt/local/var/macports/sources/rsync.macports.org/macports/release/tarballs/ports/_resources/port1.0/group/active_variants-1.1.tcl
985:debug:main Sourcing PortGroup conflicts_build 1.0 from /opt/local/var/macports/sources/rsync.macports.org/macports/release/tarballs/ports/_resources/port1.0/group/conflicts_build-1.0.tcl
986:debug:main compiler llvm-gcc-4.2 blacklisted because it's not installed or it doesn't work
987:debug:main compiler clang 1100.0.33.8 not blacklisted because it doesn't match {clang < 300}
988:debug:main compiler clang 1100.0.33.8 not blacklisted because it doesn't match {clang < 800}
989:debug:main Reading variant descriptions from /opt/local/var/macports/sources/rsync.macports.org/macports/release/tarballs/ports/_resources/port1.0/variant_descriptions.conf
990:debug:main universal variant already exists, so not adding the default one
991:debug:main Running callback portconfigure::add_automatic_compiler_dependencies
992:debug:main Finished running callback portconfigure::add_automatic_compiler_dependencies
993:debug:main Running callback portbuild::add_automatic_buildsystem_dependencies
994:debug:main Finished running callback portbuild::add_automatic_buildsystem_dependencies
995:debug:main Running callback portstartupitem::add_notes
996:debug:main Finished running callback portstartupitem::add_notes
997:debug:main No need to upgrade! libgcc9 9.2.0_0 >= libgcc9 9.2.0_0
998:debug:main epoch: in tree: 0 installed: 0
999:debug:main OpenBLAS 0.3.7_0 exists in the ports tree
1000:debug:main OpenBLAS 0.3.7_0 +gcc9+lapack is the latest installed
1001:debug:main OpenBLAS 0.3.7_0 +gcc9+lapack is active
1002:debug:main Merging existing variants '+gcc9+lapack' into variants
1003:debug:main new fully merged portvariants: lapack + gcc9 +
1004:debug:main Changing to port directory: /opt/local/var/macports/sources/rsync.macports.org/macports/release/tarballs/ports/math/OpenBLAS
1005:debug:main OS darwin/19.0.0 (macOS 10.15) arch i386
1006:debug:main Sourcing PortGroup github 1.0 from /opt/local/var/macports/sources/rsync.macports.org/macports/release/tarballs/ports/_resources/port1.0/group/github-1.0.tcl
1007:debug:main Reading variant descriptions from /opt/local/var/macports/sources/rsync.macports.org/macports/release/tarballs/ports/_resources/port1.0/variant_descriptions.conf
1008:debug:main Sourcing PortGroup muniversal 1.0 from /opt/local/var/macports/sources/rsync.macports.org/macports/release/tarballs/ports/_resources/port1.0/group/muniversal-1.0.tcl
1009:debug:main Sourcing PortGroup active_variants 1.1 from /opt/local/var/macports/sources/rsync.macports.org/macports/release/tarballs/ports/_resources/port1.0/group/active_variants-1.1.tcl
1010:debug:main Sourcing PortGroup compilers 1.0 from /opt/local/var/macports/sources/rsync.macports.org/macports/release/tarballs/ports/_resources/port1.0/group/compilers-1.0.tcl
1011:debug:main Sourcing PortGroup xcodeversion 1.0 from /opt/local/var/macports/sources/rsync.macports.org/macports/release/tarballs/ports/_resources/port1.0/group/xcodeversion-1.0.tcl
1012:debug:main Sourcing PortGroup compiler_blacklist_versions 1.0 from /opt/local/var/macports/sources/rsync.macports.org/macports/release/tarballs/ports/_resources/port1.0/group/compiler_blacklist_versions-1.0.tcl
1013:debug:main compiler clang 1100.0.33.8 not blacklisted because it doesn't match {clang < 800.0.38}
1014:debug:main Re-registering default for livecheck.regex
1015:debug:main Unmatched blacklisted compiler: cc
1016:debug:main Unmatched blacklisted compiler: *gcc-3*
1017:debug:main universal variant already exists, so not adding the default one
1018:debug:main Executing variant gcc9 provides gcc9
1019:debug:main Executing variant lapack provides lapack
1020:debug:main Running callback portconfigure::add_automatic_compiler_dependencies
1021:debug:main Finished running callback portconfigure::add_automatic_compiler_dependencies
1022:debug:main Running callback portbuild::add_automatic_buildsystem_dependencies
1023:debug:main Finished running callback portbuild::add_automatic_buildsystem_dependencies
1024:debug:main Running callback portstartupitem::add_notes
1025:debug:main Finished running callback portstartupitem::add_notes
1026:debug:main No need to upgrade! OpenBLAS 0.3.7_0 >= OpenBLAS 0.3.7_0
1027:debug:main epoch: in tree: 0 installed: 0
1028:debug:main py37-scipy 1.3.1_1 exists in the ports tree
1029:debug:main py37-scipy 1.3.1_1 +gfortran+openblas is the latest installed
1030:debug:main py37-scipy 1.3.1_1 +gfortran+openblas is active
1031:debug:main Merging existing variants '+gfortran+openblas' into variants
1032:debug:main new fully merged portvariants: openblas + gfortran +
1033:debug:main Changing to port directory: /opt/local/var/macports/sources/rsync.macports.org/macports/release/tarballs/ports/python/py-scipy
1034:debug:main OS darwin/19.0.0 (macOS 10.15) arch i386
1035:debug:main Re-registering default for build.cmd
1036:debug:main Re-registering default for destroot.cmd
1037:debug:main Re-registering default for destroot.destdir
1038:debug:main Sourcing PortGroup python 1.0 from /opt/local/var/macports/sources/rsync.macports.org/macports/release/tarballs/ports/_resources/port1.0/group/python-1.0.tcl
1039:debug:main Sourcing PortGroup active_variants 1.1 from /opt/local/var/macports/sources/rsync.macports.org/macports/release/tarballs/ports/_resources/port1.0/group/active_variants-1.1.tcl
1040:debug:main Sourcing PortGroup github 1.0 from /opt/local/var/macports/sources/rsync.macports.org/macports/release/tarballs/ports/_resources/port1.0/group/github-1.0.tcl
1041:debug:main Sourcing PortGroup active_variants 1.1 from /opt/local/var/macports/sources/rsync.macports.org/macports/release/tarballs/ports/_resources/port1.0/group/active_variants-1.1.tcl
1042:debug:main Sourcing PortGroup compilers 1.0 from /opt/local/var/macports/sources/rsync.macports.org/macports/release/tarballs/ports/_resources/port1.0/group/compilers-1.0.tcl
1043:debug:main Re-registering default for livecheck.regex
1044:debug:main universal_variant is false, so not adding the default universal variant
1045:debug:main Executing variant gfortran provides gfortran
1046:debug:main Executing variant openblas provides openblas
1047:debug:main Running callback portconfigure::add_automatic_compiler_dependencies
1048:debug:main Finished running callback portconfigure::add_automatic_compiler_dependencies
1049:debug:main Running callback portbuild::add_automatic_buildsystem_dependencies
1050:debug:main Finished running callback portbuild::add_automatic_buildsystem_dependencies
1051:debug:main Running callback portstartupitem::add_notes
1052:debug:main Finished running callback portstartupitem::add_notes
1053:debug:main No need to upgrade! py37-scipy 1.3.1_1 >= py37-scipy 1.3.1_1
1054:debug:main epoch: in tree: 0 installed: 0
1055:debug:main py37-yaml 3.13_0 exists in the ports tree
1056:debug:main py37-yaml 3.13_0  is the latest installed
1057:debug:main py37-yaml 3.13_0  is active
1058:debug:main Merging existing variants '' into variants
1059:debug:main new fully merged portvariants:
1060:debug:main Changing to port directory: /opt/local/var/macports/sources/rsync.macports.org/macports/release/tarballs/ports/python/py-yaml
1061:debug:main OS darwin/19.0.0 (macOS 10.15) arch i386
1062:debug:main Re-registering default for build.cmd
1063:debug:main Re-registering default for destroot.cmd
1064:debug:main Re-registering default for destroot.destdir
1065:debug:main Sourcing PortGroup python 1.0 from /opt/local/var/macports/sources/rsync.macports.org/macports/release/tarballs/ports/_resources/port1.0/group/python-1.0.tcl
1066:debug:main adding the default universal variant
1067:debug:main Reading variant descriptions from /opt/local/var/macports/sources/rsync.macports.org/macports/release/tarballs/ports/_resources/port1.0/variant_descriptions.conf
1068:debug:main Running callback portconfigure::add_automatic_compiler_dependencies
1069:debug:main Finished running callback portconfigure::add_automatic_compiler_dependencies
1070:debug:main Running callback portbuild::add_automatic_buildsystem_dependencies
1071:debug:main Finished running callback portbuild::add_automatic_buildsystem_dependencies
1072:debug:main Running callback portstartupitem::add_notes
1073:debug:main Finished running callback portstartupitem::add_notes
1074:debug:main No need to upgrade! py37-yaml 3.13_0 >= py37-yaml 3.13_0
1075:debug:main epoch: in tree: 0 installed: 0
1076:debug:main libyaml 0.2.2_1 exists in the ports tree
1077:debug:main libyaml 0.2.2_1  is the latest installed
1078:debug:main libyaml 0.2.2_1  is active
1079:debug:main Merging existing variants '' into variants
1080:debug:main new fully merged portvariants:
1081:debug:main Changing to port directory: /opt/local/var/macports/sources/rsync.macports.org/macports/release/tarballs/ports/devel/libyaml
1082:debug:main OS darwin/19.0.0 (macOS 10.15) arch i386
1083:debug:main adding the default universal variant
1084:debug:main Reading variant descriptions from /opt/local/var/macports/sources/rsync.macports.org/macports/release/tarballs/ports/_resources/port1.0/variant_descriptions.conf
1085:debug:main Running callback portconfigure::add_automatic_compiler_dependencies
1086:debug:main Finished running callback portconfigure::add_automatic_compiler_dependencies
1087:debug:main Running callback portbuild::add_automatic_buildsystem_dependencies
1088:debug:main Finished running callback portbuild::add_automatic_buildsystem_dependencies
1089:debug:main Running callback portstartupitem::add_notes
1090:debug:main Finished running callback portstartupitem::add_notes
1091:debug:main No need to upgrade! libyaml 0.2.2_1 >= libyaml 0.2.2_1
1092:debug:main epoch: in tree: 0 installed: 0
1093:debug:main py37-h5py 2.10.0_0 exists in the ports tree
1094:debug:main py37-h5py 2.10.0_0  is the latest installed
1095:debug:main py37-h5py 2.10.0_0  is active
1096:debug:main Merging existing variants '' into variants
1097:debug:main new fully merged portvariants:
1098:debug:main Changing to port directory: /opt/local/var/macports/sources/rsync.macports.org/macports/release/tarballs/ports/python/py-h5py
1099:debug:main OS darwin/19.0.0 (macOS 10.15) arch i386
1100:debug:main Sourcing PortGroup github 1.0 from /opt/local/var/macports/sources/rsync.macports.org/macports/release/tarballs/ports/_resources/port1.0/group/github-1.0.tcl
1101:debug:main Re-registering default for build.cmd
1102:debug:main Re-registering default for destroot.cmd
1103:debug:main Re-registering default for destroot.destdir
1104:debug:main Sourcing PortGroup python 1.0 from /opt/local/var/macports/sources/rsync.macports.org/macports/release/tarballs/ports/_resources/port1.0/group/python-1.0.tcl
1105:debug:main Sourcing PortGroup active_variants 1.1 from /opt/local/var/macports/sources/rsync.macports.org/macports/release/tarballs/ports/_resources/port1.0/group/active_variants-1.1.tcl
1106:debug:main Sourcing PortGroup compilers 1.0 from /opt/local/var/macports/sources/rsync.macports.org/macports/release/tarballs/ports/_resources/port1.0/group/compilers-1.0.tcl
1107:debug:main Sourcing PortGroup mpi 1.0 from /opt/local/var/macports/sources/rsync.macports.org/macports/release/tarballs/ports/_resources/port1.0/group/mpi-1.0.tcl
1108:debug:main Re-registering default for livecheck.regex
1109:debug:main adding the default universal variant
1110:debug:main Reading variant descriptions from /opt/local/var/macports/sources/rsync.macports.org/macports/release/tarballs/ports/_resources/port1.0/variant_descriptions.conf
1111:debug:main Running callback portconfigure::add_automatic_compiler_dependencies
1112:debug:main Finished running callback portconfigure::add_automatic_compiler_dependencies
1113:debug:main Running callback portbuild::add_automatic_buildsystem_dependencies
1114:debug:main Finished running callback portbuild::add_automatic_buildsystem_dependencies
1115:debug:main Running callback portstartupitem::add_notes
1116:debug:main Finished running callback portstartupitem::add_notes
1117:debug:main No need to upgrade! py37-h5py 2.10.0_0 >= py37-h5py 2.10.0_0
1118:debug:main epoch: in tree: 0 installed: 0
1119:debug:main py37-pkgconfig 1.5.1_0 exists in the ports tree
1120:debug:main py37-pkgconfig 1.5.1_0  is the latest installed
1121:debug:main py37-pkgconfig 1.5.1_0  is active
1122:debug:main Merging existing variants '' into variants
1123:debug:main new fully merged portvariants:
1124:debug:main Changing to port directory: /opt/local/var/macports/sources/rsync.macports.org/macports/release/tarballs/ports/python/py-pkgconfig
1125:debug:main OS darwin/19.0.0 (macOS 10.15) arch i386
1126:debug:main Re-registering default for build.cmd
1127:debug:main Re-registering default for destroot.cmd
1128:debug:main Re-registering default for destroot.destdir
1129:debug:main Sourcing PortGroup python 1.0 from /opt/local/var/macports/sources/rsync.macports.org/macports/release/tarballs/ports/_resources/port1.0/group/python-1.0.tcl
1130:debug:main only one arch supported, so not adding the default universal variant
1131:debug:main Running callback portconfigure::add_automatic_compiler_dependencies
1132:debug:main Finished running callback portconfigure::add_automatic_compiler_dependencies
1133:debug:main Running callback portbuild::add_automatic_buildsystem_dependencies
1134:debug:main Finished running callback portbuild::add_automatic_buildsystem_dependencies
1135:debug:main Running callback portstartupitem::add_notes
1136:debug:main Finished running callback portstartupitem::add_notes
1137:debug:main No need to upgrade! py37-pkgconfig 1.5.1_0 >= py37-pkgconfig 1.5.1_0
1138:debug:main epoch: in tree: 0 installed: 0
1139:debug:main pkgconfig 0.29.2_0 exists in the ports tree
1140:debug:main pkgconfig 0.29.2_0  is the latest installed
1141:debug:main pkgconfig 0.29.2_0  is active
1142:debug:main Merging existing variants '' into variants
1143:debug:main new fully merged portvariants:
1144:debug:main Changing to port directory: /opt/local/var/macports/sources/rsync.macports.org/macports/release/tarballs/ports/devel/pkgconfig
1145:debug:main OS darwin/19.0.0 (macOS 10.15) arch i386
1146:debug:main Sourcing PortGroup clang_dependency 1.0 from /opt/local/var/macports/sources/rsync.macports.org/macports/release/tarballs/ports/_resources/port1.0/group/clang_dependency-1.0.tcl
1147:debug:main adding the default universal variant
1148:debug:main Reading variant descriptions from /opt/local/var/macports/sources/rsync.macports.org/macports/release/tarballs/ports/_resources/port1.0/variant_descriptions.conf
1149:debug:main Running callback portconfigure::add_automatic_compiler_dependencies
1150:debug:main Finished running callback portconfigure::add_automatic_compiler_dependencies
1151:debug:main Running callback portbuild::add_automatic_buildsystem_dependencies
1152:debug:main Finished running callback portbuild::add_automatic_buildsystem_dependencies
1153:debug:main Running callback portstartupitem::add_notes
1154:debug:main Finished running callback portstartupitem::add_notes
1155:debug:main No need to upgrade! pkgconfig 0.29.2_0 >= pkgconfig 0.29.2_0
1156:debug:main epoch: in tree: 0 installed: 0
1157:debug:main hdf5 1.10.5_0 exists in the ports tree
1158:debug:main hdf5 1.10.5_0 +cxx+hl is the latest installed
1159:debug:main hdf5 1.10.5_0 +cxx+hl is active
1160:debug:main Merging existing variants '+cxx+hl' into variants
1161:debug:main new fully merged portvariants: hl + cxx +
1162:debug:main Changing to port directory: /opt/local/var/macports/sources/rsync.macports.org/macports/release/tarballs/ports/science/hdf5
1163:debug:main OS darwin/19.0.0 (macOS 10.15) arch i386
1164:debug:main Reading variant descriptions from /opt/local/var/macports/sources/rsync.macports.org/macports/release/tarballs/ports/_resources/port1.0/variant_descriptions.conf
1165:debug:main Sourcing PortGroup muniversal 1.0 from /opt/local/var/macports/sources/rsync.macports.org/macports/release/tarballs/ports/_resources/port1.0/group/muniversal-1.0.tcl
1166:debug:main Sourcing PortGroup active_variants 1.1 from /opt/local/var/macports/sources/rsync.macports.org/macports/release/tarballs/ports/_resources/port1.0/group/active_variants-1.1.tcl
1167:debug:main Sourcing PortGroup compilers 1.0 from /opt/local/var/macports/sources/rsync.macports.org/macports/release/tarballs/ports/_resources/port1.0/group/compilers-1.0.tcl
1168:debug:main Sourcing PortGroup mpi 1.0 from /opt/local/var/macports/sources/rsync.macports.org/macports/release/tarballs/ports/_resources/port1.0/group/mpi-1.0.tcl
1169:debug:main universal variant already exists, so not adding the default one
1170:debug:main Executing variant hl provides hl
1171:debug:main Executing variant cxx provides cxx
1172:debug:main Running callback portconfigure::add_automatic_compiler_dependencies
1173:debug:main Finished running callback portconfigure::add_automatic_compiler_dependencies
1174:debug:main Running callback portbuild::add_automatic_buildsystem_dependencies
1175:debug:main Finished running callback portbuild::add_automatic_buildsystem_dependencies
1176:debug:main Running callback portstartupitem::add_notes
1177:debug:main Finished running callback portstartupitem::add_notes
1178:debug:main No need to upgrade! hdf5 1.10.5_0 >= hdf5 1.10.5_0
1179:debug:main epoch: in tree: 0 installed: 0
1180:debug:main py37-keras_applications 1.0.8_0 exists in the ports tree
1181:debug:main py37-keras_applications 1.0.8_0  is the latest installed
1182:debug:main py37-keras_applications 1.0.8_0  is active
1183:debug:main Merging existing variants '' into variants
1184:debug:main new fully merged portvariants:
1185:debug:main Changing to port directory: /opt/local/var/macports/sources/rsync.macports.org/macports/release/tarballs/ports/python/py-keras_applications
1186:debug:main OS darwin/19.0.0 (macOS 10.15) arch i386
1187:debug:main Re-registering default for build.cmd
1188:debug:main Re-registering default for destroot.cmd
1189:debug:main Re-registering default for destroot.destdir
1190:debug:main Sourcing PortGroup python 1.0 from /opt/local/var/macports/sources/rsync.macports.org/macports/release/tarballs/ports/_resources/port1.0/group/python-1.0.tcl
1191:debug:main only one arch supported, so not adding the default universal variant
1192:debug:main Running callback portconfigure::add_automatic_compiler_dependencies
1193:debug:main Finished running callback portconfigure::add_automatic_compiler_dependencies
1194:debug:main Running callback portbuild::add_automatic_buildsystem_dependencies
1195:debug:main Finished running callback portbuild::add_automatic_buildsystem_dependencies
1196:debug:main Running callback portstartupitem::add_notes
1197:debug:main Finished running callback portstartupitem::add_notes
1198:debug:main No need to upgrade! py37-keras_applications 1.0.8_0 >= py37-keras_applications 1.0.8_0
1199:debug:main epoch: in tree: 0 installed: 0
1200:debug:main py37-keras_preprocessing 1.1.0_0 exists in the ports tree
1201:debug:main py37-keras_preprocessing 1.1.0_0  is the latest installed
1202:debug:main py37-keras_preprocessing 1.1.0_0  is active
1203:debug:main Merging existing variants '' into variants
1204:debug:main new fully merged portvariants:
1205:debug:main Changing to port directory: /opt/local/var/macports/sources/rsync.macports.org/macports/release/tarballs/ports/python/py-keras_preprocessing
1206:debug:main OS darwin/19.0.0 (macOS 10.15) arch i386
1207:debug:main Re-registering default for build.cmd
1208:debug:main Re-registering default for destroot.cmd
1209:debug:main Re-registering default for destroot.destdir
1210:debug:main Sourcing PortGroup python 1.0 from /opt/local/var/macports/sources/rsync.macports.org/macports/release/tarballs/ports/_resources/port1.0/group/python-1.0.tcl
1211:debug:main only one arch supported, so not adding the default universal variant
1212:debug:main Running callback portconfigure::add_automatic_compiler_dependencies
1213:debug:main Finished running callback portconfigure::add_automatic_compiler_dependencies
1214:debug:main Running callback portbuild::add_automatic_buildsystem_dependencies
1215:debug:main Finished running callback portbuild::add_automatic_buildsystem_dependencies
1216:debug:main Running callback portstartupitem::add_notes
1217:debug:main Finished running callback portstartupitem::add_notes
1218:debug:main No need to upgrade! py37-keras_preprocessing 1.1.0_0 >= py37-keras_preprocessing 1.1.0_0
1219:debug:main epoch: in tree: 0 installed: 0
1220:debug:main py37-tensorboard 2.0.0_0 exists in the ports tree
1221:debug:main py37-tensorboard 2.0.0_0  is the latest installed
1222:debug:main py37-tensorboard 2.0.0_0  is active
1223:debug:main Merging existing variants '' into variants
1224:debug:main new fully merged portvariants:
1225:debug:main Changing to port directory: /opt/local/var/macports/sources/rsync.macports.org/macports/release/tarballs/ports/python/py-tensorboard
1226:debug:main OS darwin/19.0.0 (macOS 10.15) arch i386
1227:debug:main Re-registering default for build.cmd
1228:debug:main Re-registering default for destroot.cmd
1229:debug:main Re-registering default for destroot.destdir
1230:debug:main Sourcing PortGroup python 1.0 from /opt/local/var/macports/sources/rsync.macports.org/macports/release/tarballs/ports/_resources/port1.0/group/python-1.0.tcl
1231:debug:main only one arch supported, so not adding the default universal variant
1232:debug:main Running callback portconfigure::add_automatic_compiler_dependencies
1233:debug:main Finished running callback portconfigure::add_automatic_compiler_dependencies
1234:debug:main Running callback portbuild::add_automatic_buildsystem_dependencies
1235:debug:main Finished running callback portbuild::add_automatic_buildsystem_dependencies
1236:debug:main Running callback portstartupitem::add_notes
1237:debug:main Finished running callback portstartupitem::add_notes
1238:debug:main No need to upgrade! py37-tensorboard 2.0.0_0 >= py37-tensorboard 2.0.0_0
1239:debug:main epoch: in tree: 0 installed: 0
1240:debug:main py37-markdown 3.1.1_0 exists in the ports tree
1241:debug:main py37-markdown 3.1.1_0  is the latest installed
1242:debug:main py37-markdown 3.1.1_0  is active
1243:debug:main Merging existing variants '' into variants
1244:debug:main new fully merged portvariants:
1245:debug:main Changing to port directory: /opt/local/var/macports/sources/rsync.macports.org/macports/release/tarballs/ports/python/py-markdown
1246:debug:main OS darwin/19.0.0 (macOS 10.15) arch i386
1247:debug:main Re-registering default for build.cmd
1248:debug:main Re-registering default for destroot.cmd
1249:debug:main Re-registering default for destroot.destdir
1250:debug:main Sourcing PortGroup python 1.0 from /opt/local/var/macports/sources/rsync.macports.org/macports/release/tarballs/ports/_resources/port1.0/group/python-1.0.tcl
1251:debug:main only one arch supported, so not adding the default universal variant
1252:debug:main Running callback portconfigure::add_automatic_compiler_dependencies
1253:debug:main Finished running callback portconfigure::add_automatic_compiler_dependencies
1254:debug:main Running callback portbuild::add_automatic_buildsystem_dependencies
1255:debug:main Finished running callback portbuild::add_automatic_buildsystem_dependencies
1256:debug:main Running callback portstartupitem::add_notes
1257:debug:main Finished running callback portstartupitem::add_notes
1258:debug:main No need to upgrade! py37-markdown 3.1.1_0 >= py37-markdown 3.1.1_0
1259:debug:main epoch: in tree: 0 installed: 0
1260:debug:main py37-werkzeug 0.16.0_0 exists in the ports tree
1261:debug:main py37-werkzeug 0.16.0_0  is the latest installed
1262:debug:main py37-werkzeug 0.16.0_0  is active
1263:debug:main Merging existing variants '' into variants
1264:debug:main new fully merged portvariants:
1265:debug:main Changing to port directory: /opt/local/var/macports/sources/rsync.macports.org/macports/release/tarballs/ports/python/py-werkzeug
1266:debug:main OS darwin/19.0.0 (macOS 10.15) arch i386
1267:debug:main Re-registering default for build.cmd
1268:debug:main Re-registering default for destroot.cmd
1269:debug:main Re-registering default for destroot.destdir
1270:debug:main Sourcing PortGroup python 1.0 from /opt/local/var/macports/sources/rsync.macports.org/macports/release/tarballs/ports/_resources/port1.0/group/python-1.0.tcl
1271:debug:main only one arch supported, so not adding the default universal variant
1272:debug:main Running callback portconfigure::add_automatic_compiler_dependencies
1273:debug:main Finished running callback portconfigure::add_automatic_compiler_dependencies
1274:debug:main Running callback portbuild::add_automatic_buildsystem_dependencies
1275:debug:main Finished running callback portbuild::add_automatic_buildsystem_dependencies
1276:debug:main Running callback portstartupitem::add_notes
1277:debug:main Finished running callback portstartupitem::add_notes
1278:debug:main No need to upgrade! py37-werkzeug 0.16.0_0 >= py37-werkzeug 0.16.0_0
1279:debug:main epoch: in tree: 0 installed: 0
1280:debug:main py37-wheel 0.33.6_0 exists in the ports tree
1281:debug:main py37-wheel 0.33.6_0  is the latest installed
1282:debug:main py37-wheel 0.33.6_0  is active
1283:debug:main Merging existing variants '' into variants
1284:debug:main new fully merged portvariants:
1285:debug:main Changing to port directory: /opt/local/var/macports/sources/rsync.macports.org/macports/release/tarballs/ports/python/py-wheel
1286:debug:main OS darwin/19.0.0 (macOS 10.15) arch i386
1287:debug:main Re-registering default for build.cmd
1288:debug:main Re-registering default for destroot.cmd
1289:debug:main Re-registering default for destroot.destdir
1290:debug:main Sourcing PortGroup python 1.0 from /opt/local/var/macports/sources/rsync.macports.org/macports/release/tarballs/ports/_resources/port1.0/group/python-1.0.tcl
1291:debug:main adding the default universal variant
1292:debug:main Reading variant descriptions from /opt/local/var/macports/sources/rsync.macports.org/macports/release/tarballs/ports/_resources/port1.0/variant_descriptions.conf
1293:debug:main Running callback portconfigure::add_automatic_compiler_dependencies
1294:debug:main Finished running callback portconfigure::add_automatic_compiler_dependencies
1295:debug:main Running callback portbuild::add_automatic_buildsystem_dependencies
1296:debug:main Finished running callback portbuild::add_automatic_buildsystem_dependencies
1297:debug:main Running callback portstartupitem::add_notes
1298:debug:main Finished running callback portstartupitem::add_notes
1299:debug:main No need to upgrade! py37-wheel 0.33.6_0 >= py37-wheel 0.33.6_0
1300:debug:main epoch: in tree: 0 installed: 0
1301:debug:main py37-tensorflow_estimator 2.0.0_0 exists in the ports tree
1302:debug:main py37-tensorflow_estimator 2.0.0_0  is the latest installed
1303:debug:main py37-tensorflow_estimator 2.0.0_0  is active
1304:debug:main Merging existing variants '' into variants
1305:debug:main new fully merged portvariants:
1306:debug:main Changing to port directory: /opt/local/var/macports/sources/rsync.macports.org/macports/release/tarballs/ports/python/py-tensorflow_estimator
1307:debug:main OS darwin/19.0.0 (macOS 10.15) arch i386
1308:debug:main Re-registering default for build.cmd
1309:debug:main Re-registering default for destroot.cmd
1310:debug:main Re-registering default for destroot.destdir
1311:debug:main Sourcing PortGroup python 1.0 from /opt/local/var/macports/sources/rsync.macports.org/macports/release/tarballs/ports/_resources/port1.0/group/python-1.0.tcl
1312:debug:main only one arch supported, so not adding the default universal variant
1313:debug:main Running callback portconfigure::add_automatic_compiler_dependencies
1314:debug:main Finished running callback portconfigure::add_automatic_compiler_dependencies
1315:debug:main Running callback portbuild::add_automatic_buildsystem_dependencies
1316:debug:main Finished running callback portbuild::add_automatic_buildsystem_dependencies
1317:debug:main Running callback portstartupitem::add_notes
1318:debug:main Finished running callback portstartupitem::add_notes
1319:debug:main No need to upgrade! py37-tensorflow_estimator 2.0.0_0 >= py37-tensorflow_estimator 2.0.0_0
1320:debug:main epoch: in tree: 0 installed: 0
1321:debug:main py37-termcolor 1.1.0_0 exists in the ports tree
1322:debug:main py37-termcolor 1.1.0_0  is the latest installed
1323:debug:main py37-termcolor 1.1.0_0  is active
1324:debug:main Merging existing variants '' into variants
1325:debug:main new fully merged portvariants:
1326:debug:main Changing to port directory: /opt/local/var/macports/sources/rsync.macports.org/macports/release/tarballs/ports/python/py-termcolor
1327:debug:main OS darwin/19.0.0 (macOS 10.15) arch i386
1328:debug:main Re-registering default for build.cmd
1329:debug:main Re-registering default for destroot.cmd
1330:debug:main Re-registering default for destroot.destdir
1331:debug:main Sourcing PortGroup python 1.0 from /opt/local/var/macports/sources/rsync.macports.org/macports/release/tarballs/ports/_resources/port1.0/group/python-1.0.tcl
1332:debug:main only one arch supported, so not adding the default universal variant
1333:debug:main Running callback portconfigure::add_automatic_compiler_dependencies
1334:debug:main Finished running callback portconfigure::add_automatic_compiler_dependencies
1335:debug:main Running callback portbuild::add_automatic_buildsystem_dependencies
1336:debug:main Finished running callback portbuild::add_automatic_buildsystem_dependencies
1337:debug:main Running callback portstartupitem::add_notes
1338:debug:main Finished running callback portstartupitem::add_notes
1339:debug:main No need to upgrade! py37-termcolor 1.1.0_0 >= py37-termcolor 1.1.0_0
1340:debug:main epoch: in tree: 0 installed: 0
1341:debug:main py37-wrapt 1.11.2_0 exists in the ports tree
1342:debug:main py37-wrapt 1.11.2_0  is the latest installed
1343:debug:main py37-wrapt 1.11.2_0  is active
1344:debug:main Merging existing variants '' into variants
1345:debug:main new fully merged portvariants:
1346:debug:main Changing to port directory: /opt/local/var/macports/sources/rsync.macports.org/macports/release/tarballs/ports/python/py-wrapt
1347:debug:main OS darwin/19.0.0 (macOS 10.15) arch i386
1348:debug:main Re-registering default for build.cmd
1349:debug:main Re-registering default for destroot.cmd
1350:debug:main Re-registering default for destroot.destdir
1351:debug:main Sourcing PortGroup python 1.0 from /opt/local/var/macports/sources/rsync.macports.org/macports/release/tarballs/ports/_resources/port1.0/group/python-1.0.tcl
1352:debug:main adding the default universal variant
1353:debug:main Reading variant descriptions from /opt/local/var/macports/sources/rsync.macports.org/macports/release/tarballs/ports/_resources/port1.0/variant_descriptions.conf
1354:debug:main Running callback portconfigure::add_automatic_compiler_dependencies
1355:debug:main Finished running callback portconfigure::add_automatic_compiler_dependencies
1356:debug:main Running callback portbuild::add_automatic_buildsystem_dependencies
1357:debug:main Finished running callback portbuild::add_automatic_buildsystem_dependencies
1358:debug:main Running callback portstartupitem::add_notes
1359:debug:main Finished running callback portstartupitem::add_notes
1360:debug:main No need to upgrade! py37-wrapt 1.11.2_0 >= py37-wrapt 1.11.2_0
1361:msg:main --->  Computing dependencies for py37-tensorflow:info:main .:debug:main Checking for conflicts against py37-tensorflow
1362:debug:main Searching for dependency: py37-tensorflow1
1363:debug:main Didn't find receipt, going to depspec regex for: py37-tensorflow1
1364:debug:main Searching for dependency: py37-future
1365:debug:main Found Dependency: receipt exists for py37-future
1366:debug:main Searching for dependency: py37-pip
1367:debug:main Found Dependency: receipt exists for py37-pip
1368:debug:main Searching for dependency: py37-mock
1369:debug:main Found Dependency: receipt exists for py37-mock
1370:debug:main Searching for dependency: bazel26
1371:debug:main Found Dependency: receipt exists for bazel26
1372:debug:main Searching for dependency: cctools
1373:debug:main Found Dependency: receipt exists for cctools
1374:debug:main Searching for dependency: python37
1375:debug:main Found Dependency: receipt exists for python37
1376:debug:main Searching for dependency: py37-absl
1377:debug:main Found Dependency: receipt exists for py37-absl
1378:debug:main Searching for dependency: py37-astor
1379:debug:main Found Dependency: receipt exists for py37-astor
1380:debug:main Searching for dependency: py37-gast
1381:debug:main Found Dependency: receipt exists for py37-gast
1382:debug:main Searching for dependency: py37-google-pasta
1383:debug:main Found Dependency: receipt exists for py37-google-pasta
1384:debug:main Searching for dependency: py37-grpcio
1385:debug:main Found Dependency: receipt exists for py37-grpcio
1386:debug:main Searching for dependency: py37-keras
1387:debug:main Found Dependency: receipt exists for py37-keras
1388:debug:main Searching for dependency: py37-numpy
1389:debug:main Found Dependency: receipt exists for py37-numpy
1390:debug:main Searching for dependency: py37-protobuf3
1391:debug:main Found Dependency: receipt exists for py37-protobuf3
1392:debug:main Searching for dependency: py37-six
1393:debug:main Found Dependency: receipt exists for py37-six
1394:debug:main Searching for dependency: py37-tensorboard
1395:debug:main Found Dependency: receipt exists for py37-tensorboard
1396:debug:main Searching for dependency: py37-tensorflow_estimator
1397:debug:main Found Dependency: receipt exists for py37-tensorflow_estimator
1398:debug:main Searching for dependency: py37-termcolor
1399:debug:main Found Dependency: receipt exists for py37-termcolor
1400:debug:main Searching for dependency: py37-wheel
1401:debug:main Found Dependency: receipt exists for py37-wheel
1402:debug:main Searching for dependency: py37-wrapt
1403:debug:main Found Dependency: receipt exists for py37-wrapt
1404:debug:main Executing org.macports.main (py37-tensorflow)
1405:debug:main dropping privileges: euid changed to 502, egid changed to 501.
1406:debug:archivefetch archivefetch phase started at Sat Oct 12 11:47:55 EDT 2019
1407:msg:archivefetch --->  Fetching archive for py37-tensorflow
1408:debug:archivefetch Executing proc-pre-org.macports.archivefetch-archivefetch-0
1409:debug:archivefetch Executing org.macports.archivefetch (py37-tensorflow)
1410:debug:archivefetch euid/egid changed to: 0/0
1411:debug:archivefetch chowned /opt/local/var/macports/incoming to macports
1412:debug:archivefetch euid/egid changed to: 502/501
1413:info:archivefetch --->  py37-tensorflow-2.0.0_0+mkl.darwin_19.x86_64.tbz2 doesn't seem to exist in /opt/local/var/macports/incoming/verified
1414:msg:archivefetch --->  Attempting to fetch py37-tensorflow-2.0.0_0+mkl.darwin_19.x86_64.tbz2 from http://ywg.ca.packages.macports.org/mirror/macports/packages/py37-tensorflow
1415:debug:archivefetch Fetching archive failed: The requested URL returned error: 404 Not Found
1416:msg:archivefetch --->  Attempting to fetch py37-tensorflow-2.0.0_0+mkl.darwin_19.x86_64.tbz2 from http://aus.us.packages.macports.org/macports/packages/py37-tensorflow
1417:debug:archivefetch Fetching archive failed: The requested URL returned error: 404 Not Found
1418:msg:archivefetch --->  Attempting to fetch py37-tensorflow-2.0.0_0+mkl.darwin_19.x86_64.tbz2 from http://lil.fr.packages.macports.org/py37-tensorflow
1419:debug:archivefetch Fetching archive failed: The requested URL returned error: 404 Not Found
1420:debug:archivefetch Privilege de-escalation not attempted as not running as root.
1421:debug:fetch fetch phase started at Sat Oct 12 11:47:56 EDT 2019
1422:notice:fetch --->  Fetching distfiles for py37-tensorflow
1423:debug:fetch Executing proc-pre-org.macports.fetch-fetch-0
1424:debug:fetch Executing proc-pre-org.macports.fetch-fetch-1
1425:debug:fetch Executing org.macports.fetch (py37-tensorflow)
1426:debug:fetch Privilege de-escalation not attempted as not running as root.
1427:debug:checksum checksum phase started at Sat Oct 12 11:47:56 EDT 2019
1428:notice:checksum --->  Verifying checksums for py37-tensorflow
1429:debug:checksum Executing org.macports.checksum (py37-tensorflow)
1430:info:checksum --->  Checksumming tensorflow-2.0.0.tar.gz
1431:debug:checksum Calculated (rmd160) is 476dd5e51924d966cfed30ce5deb0f12d6d6bad8
1432:debug:checksum Correct (rmd160) checksum for tensorflow-2.0.0.tar.gz
1433:debug:checksum Calculated (sha256) is 5c6d97f622fffdcf318b45f705368eb2d32446ca4f4ed86c8b06083559ff55cf
1434:debug:checksum Correct (sha256) checksum for tensorflow-2.0.0.tar.gz
1435:debug:checksum Calculated (size) is 46183179
1436:debug:checksum Correct (size) checksum for tensorflow-2.0.0.tar.gz
1437:debug:checksum Privilege de-escalation not attempted as not running as root.
1438:debug:extract extract phase started at Sat Oct 12 11:47:57 EDT 2019
1439:notice:extract --->  Extracting py37-tensorflow
1440:debug:extract Executing proc-pre-org.macports.extract-extract-0
1441:debug:extract Executing org.macports.extract (py37-tensorflow)
1442:info:extract --->  Extracting tensorflow-2.0.0.tar.gz
1443:debug:extract setting option extract.args to '/opt/local/var/macports/distfiles/py-tensorflow/tensorflow-2.0.0.tar.gz'
1444:debug:extract Environment:
1445:debug:extract CC_PRINT_OPTIONS='YES'
1446:debug:extract CC_PRINT_OPTIONS_FILE='/opt/local/var/macports/build/_opt_local_var_macports_sources_rsync.macports.org_macports_release_tarballs_ports_python_py-tensorflow/py37-tensorflow/work/.CC_PRINT_OPTIONS'
1447:debug:extract CPATH='/opt/local/include'
1448:debug:extract DEVELOPER_DIR='/Library/Developer/CommandLineTools'
1449:debug:extract LIBRARY_PATH='/opt/local/lib'
1450:debug:extract MACOSX_DEPLOYMENT_TARGET='10.15'
1451:debug:extract SDKROOT='/Library/Developer/CommandLineTools/SDKs/MacOSX10.15.sdk'
1452:info:extract Executing:  cd "/opt/local/var/macports/build/_opt_local_var_macports_sources_rsync.macports.org_macports_release_tarballs_ports_python_py-tensorflow/py37-tensorflow/work" && /usr/bin/gzip -dc '/opt/local/var/macports/distfiles/py-tensorflow/tensorflow-2.0.0.tar.gz' | /usr/bin/tar -xf -
1453:debug:extract system:  cd "/opt/local/var/macports/build/_opt_local_var_macports_sources_rsync.macports.org_macports_release_tarballs_ports_python_py-tensorflow/py37-tensorflow/work" && /usr/bin/gzip -dc '/opt/local/var/macports/distfiles/py-tensorflow/tensorflow-2.0.0.tar.gz' | /usr/bin/tar -xf -
1454:debug:extract euid/egid changed to: 0/0
1455:debug:extract chowned /opt/local/var/macports/build/_opt_local_var_macports_sources_rsync.macports.org_macports_release_tarballs_ports_python_py-tensorflow/py37-tensorflow/work to macports
1456:debug:extract euid/egid changed to: 502/501
1457:debug:extract Symlink: /opt/local/var/macports/build/_opt_local_var_macports_sources_rsync.macports.org_macports_release_tarballs_ports_python_py-tensorflow/py37-tensorflow/work/tensorflow-2.0.0 -> tensorflow-tensorflow-64c3d38
1458:debug:extract Executing proc-post-org.macports.extract-extract-0
1459:debug:extract Executing proc-post-org.macports.extract-extract-1
1460:debug:extract Privilege de-escalation not attempted as not running as root.
1461:debug:patch patch phase started at Sat Oct 12 11:48:04 EDT 2019
1462:debug:patch Executing org.macports.patch (py37-tensorflow)
1463:debug:patch Privilege de-escalation not attempted as not running as root.
1464:debug:configure configure phase started at Sat Oct 12 11:48:04 EDT 2019
1465:notice:configure --->  Configuring py37-tensorflow
1466:debug:configure Preferred compilers: clang macports-clang-9.0 macports-clang-8.0 macports-clang-7.0 macports-clang-6.0 macports-clang-5.0
1467:debug:configure Using compiler 'Xcode Clang'
1468:debug:configure Executing proc-pre-org.macports.configure-configure-0
1469:debug:configure Active variants check for source-type install considers depends_fetch depends_extract depends_lib depends_build depends_run: python37 py37-absl py37-astor py37-gast py37-google-pasta py37-grpcio py37-keras py37-numpy py37-protobuf3 py37-six py37-tensorboard py37-tensorflow_estimator py37-termcolor py37-wheel py37-wrapt py37-future py37-pip py37-mock bazel26 cctools
1470:debug:configure Executing proc-pre-org.macports.configure-configure-1
1471:debug:configure compilers.enforce_c list:
1472:debug:configure compilers.enforce_fortran list:
1473:debug:configure compilers.enforce_some_fortran list:
1474:debug:configure Executing proc-pre-org.macports.configure-configure-2
1475:debug:configure Executing org.macports.configure (py37-tensorflow)
1476:debug:configure Environment:
1477:debug:configure CC='/usr/bin/clang'
1478:debug:configure CC_OPT_FLAGS='-march=x86-64'
1479:debug:configure CC_PRINT_OPTIONS='YES'
1480:debug:configure CC_PRINT_OPTIONS_FILE='/opt/local/var/macports/build/_opt_local_var_macports_sources_rsync.macports.org_macports_release_tarballs_ports_python_py-tensorflow/py37-tensorflow/work/.CC_PRINT_OPTIONS'
1481:debug:configure CFLAGS='-pipe -Os -isysroot/Library/Developer/CommandLineTools/SDKs/MacOSX10.15.sdk -arch x86_64'
1482:debug:configure CPATH='/opt/local/include'
1483:debug:configure CPPFLAGS='-I/opt/local/include -isysroot/Library/Developer/CommandLineTools/SDKs/MacOSX10.15.sdk'
1484:debug:configure CXX='/usr/bin/clang++'
1485:debug:configure CXXFLAGS='-pipe -Os -stdlib=libc++ -isysroot/Library/Developer/CommandLineTools/SDKs/MacOSX10.15.sdk -arch x86_64'
1486:debug:configure DEVELOPER_DIR='/Library/Developer/CommandLineTools'
1487:debug:configure F90FLAGS='-pipe -Os -m64'
1488:debug:configure FCFLAGS='-pipe -Os -m64'
1489:debug:configure FFLAGS='-pipe -Os -m64'
1490:debug:configure INSTALL='/usr/bin/install -c'
1491:debug:configure JAVA_HOME='/Library/Java/JavaVirtualMachines/openjdk12/Contents/Home'
1492:debug:configure LDFLAGS='-L/opt/local/lib -Wl,-headerpad_max_install_names -Wl,-syslibroot,/Library/Developer/CommandLineTools/SDKs/MacOSX10.15.sdk -arch x86_64'
1493:debug:configure LIBRARY_PATH='/opt/local/lib'
1494:debug:configure MACOSX_DEPLOYMENT_TARGET='10.15'
1495:debug:configure OBJC='/usr/bin/clang'
1496:debug:configure OBJCFLAGS='-pipe -Os -isysroot/Library/Developer/CommandLineTools/SDKs/MacOSX10.15.sdk -arch x86_64'
1497:debug:configure OBJCXX='/usr/bin/clang++'
1498:debug:configure OBJCXXFLAGS='-pipe -Os -stdlib=libc++ -isysroot/Library/Developer/CommandLineTools/SDKs/MacOSX10.15.sdk -arch x86_64'
1499:debug:configure PYTHON_BIN_PATH='/opt/local/bin/python3.7'
1500:debug:configure PYTHON_LIB_PATH='/opt/local/Library/Frameworks/Python.framework/Versions/3.7/lib/python3.7/site-packages'
1501:debug:configure SDKROOT='/Library/Developer/CommandLineTools/SDKs/MacOSX10.15.sdk'
1502:info:configure Executing:  cd "/opt/local/var/macports/build/_opt_local_var_macports_sources_rsync.macports.org_macports_release_tarballs_ports_python_py-tensorflow/py37-tensorflow/work/tensorflow-2.0.0" && ./configure
1503:debug:configure system:  cd "/opt/local/var/macports/build/_opt_local_var_macports_sources_rsync.macports.org_macports_release_tarballs_ports_python_py-tensorflow/py37-tensorflow/work/tensorflow-2.0.0" && ./configure
1504:info:configure WARNING: An illegal reflective access operation has occurred
1505:info:configure WARNING: Illegal reflective access by com.google.protobuf.UnsafeUtil (file:/private/var/tmp/_bazel_root/install/649d7329e4d0dbc589d729fe4b2d06cc/_embedded_binaries/A-server.jar) to field java.nio.Buffer.address
1506:info:configure WARNING: Please consider reporting this to the maintainers of com.google.protobuf.UnsafeUtil
1507:info:configure WARNING: Use --illegal-access=warn to enable warnings of further illegal reflective access operations
1508:info:configure WARNING: All illegal access operations will be denied in a future release
1509:info:configure WARNING: --batch mode is deprecated. Please instead explicitly shut down your Bazel server using the command "bazel shutdown".
1510:info:configure You have bazel 0.26.1- (@non-git) installed.
1511:info:configure Do you wish to build TensorFlow with XLA JIT support? [Y/n]: XLA JIT support will be enabled for TensorFlow.
1512:info:configure Do you wish to build TensorFlow with OpenCL SYCL support? [y/N]: No OpenCL SYCL support will be enabled for TensorFlow.
1513:info:configure Do you wish to build TensorFlow with ROCm support? [y/N]: No ROCm support will be enabled for TensorFlow.
1514:info:configure Do you wish to build TensorFlow with CUDA support? [y/N]: No CUDA support will be enabled for TensorFlow.
1515:info:configure Do you wish to download a fresh release of clang? (Experimental) [y/N]: Clang will not be downloaded.
1516:info:configure Do you wish to build TensorFlow with MPI support? [y/N]: No MPI support will be enabled for TensorFlow.
1517:info:configure Would you like to interactively configure ./WORKSPACE for Android builds? [y/N]: Not configuring the WORKSPACE for Android builds.
1518:info:configure Do you wish to build TensorFlow with iOS support? [y/N]: No iOS support will be enabled for TensorFlow.
1519:info:configure Preconfigured Bazel build configs. You can use any of the below by adding "--config=<>" to your build command. See .bazelrc for more details.
1520:info:configure         --config=mkl            # Build with MKL support.
1521:info:configure         --config=monolithic     # Config for mostly static monolithic build.
1522:info:configure         --config=gdr            # Build with GDR support.
1523:info:configure         --config=verbs          # Build with libverbs support.
1524:info:configure         --config=ngraph         # Build with Intel nGraph support.
1525:info:configure         --config=numa           # Build with NUMA support.
1526:info:configure         --config=dynamic_kernels        # (Experimental) Build kernels into separate shared objects.
1527:info:configure         --config=v2             # Build TensorFlow 2.x instead of 1.x.
1528:info:configure Preconfigured Bazel build configs to DISABLE default on features:
1529:info:configure         --config=noaws          # Disable AWS S3 filesystem support.
1530:info:configure         --config=nogcp          # Disable GCP support.
1531:info:configure         --config=nohdfs         # Disable HDFS support.
1532:info:configure         --config=noignite       # Disable Apache Ignite support.
1533:info:configure         --config=nokafka        # Disable Apache Kafka support.
1534:info:configure         --config=nonccl         # Disable NVIDIA NCCL support.
1535:info:configure Configuration finished
1536:debug:configure Privilege de-escalation not attempted as not running as root.
1537:debug:build build phase started at Sat Oct 12 11:48:07 EDT 2019
1538:notice:build --->  Building py37-tensorflow
1539:debug:build Executing proc-pre-org.macports.build-build-0
1540:debug:build Executing org.macports.build (py37-tensorflow)
1541:debug:build system -W /opt/local/var/macports/build/_opt_local_var_macports_sources_rsync.macports.org_macports_release_tarballs_ports_python_py-tensorflow/py37-tensorflow/work/tensorflow-2.0.0: CC_OPT_FLAGS=-march=x86-64 bazel --max_idle_secs=60 --output_user_root=/opt/local/var/macports/build/_opt_local_var_macports_sources_rsync.macports.org_macports_release_tarballs_ports_python_py-tensorflow/py37-tensorflow/work build -s -c opt --config=opt --conlyopt '-Os' --cxxopt '-Os' --cxxopt '-stdlib=libc++' --linkopt '-L/opt/local/lib' --linkopt '-Wl,-headerpad_max_install_names' --config=mkl --copt=-march=x86-64 //tensorflow/tools/pip_package:build_pip_package
1542:info:build Extracting Bazel installation...
1543:info:build Starting local Bazel server and connecting to it...
1544:info:build INFO: Options provided by the client:
1545:info:build   Inherited 'common' options: --isatty=0 --terminal_columns=159
1546:info:build INFO: Reading rc options for 'build' from /opt/local/var/macports/build/_opt_local_var_macports_sources_rsync.macports.org_macports_release_tarballs_ports_python_py-tensorflow/py37-tensorflow/work/tensorflow-tensorflow-64c3d38/.bazelrc:
1547:info:build   'build' options: --apple_platform_type=macos --define framework_shared_object=true --define open_source_build=true --define=use_fast_cpp_protos=true --define=allow_oversize_protos=true --spawn_strategy=standalone --strategy=Genrule=standalone -c opt --announce_rc --define=grpc_no_ares=true --define=PREFIX=/usr --define=LIBDIR=$(PREFIX)/lib --define=INCLUDEDIR=$(PREFIX)/include --config=v2
1548:info:build INFO: Reading rc options for 'build' from /opt/local/var/macports/build/_opt_local_var_macports_sources_rsync.macports.org_macports_release_tarballs_ports_python_py-tensorflow/py37-tensorflow/work/tensorflow-tensorflow-64c3d38/.tf_configure.bazelrc:
1549:info:build   'build' options: --action_env PYTHON_BIN_PATH=/opt/local/bin/python3.7 --action_env PYTHON_LIB_PATH=/opt/local/Library/Frameworks/Python.framework/Versions/3.7/lib/python3.7/site-packages --python_path=/opt/local/bin/python3.7 --config=xla --action_env TF_CONFIGURE_IOS=0
1550:info:build INFO: Found applicable config definition build:v2 in file /opt/local/var/macports/build/_opt_local_var_macports_sources_rsync.macports.org_macports_release_tarballs_ports_python_py-tensorflow/py37-tensorflow/work/tensorflow-tensorflow-64c3d38/.bazelrc: --define=tf_api_version=2
1551:info:build INFO: Found applicable config definition build:xla in file /opt/local/var/macports/build/_opt_local_var_macports_sources_rsync.macports.org_macports_release_tarballs_ports_python_py-tensorflow/py37-tensorflow/work/tensorflow-tensorflow-64c3d38/.tf_configure.bazelrc: --define with_xla_support=true
1552:info:build INFO: Found applicable config definition build:opt in file /opt/local/var/macports/build/_opt_local_var_macports_sources_rsync.macports.org_macports_release_tarballs_ports_python_py-tensorflow/py37-tensorflow/work/tensorflow-tensorflow-64c3d38/.tf_configure.bazelrc: --copt=-march=x86-64 --host_copt=-march=native --define with_default_optimizations=true
1553:info:build INFO: Found applicable config definition build:mkl in file /opt/local/var/macports/build/_opt_local_var_macports_sources_rsync.macports.org_macports_release_tarballs_ports_python_py-tensorflow/py37-tensorflow/work/tensorflow-tensorflow-64c3d38/.bazelrc: --define=build_with_mkl=true --define=enable_mkl=true --define=tensorflow_mkldnn_contraction_kernel=0 -c opt
1554:info:build Loading:
1555:info:build Loading: 0 packages loaded
1556:info:build Loading: 0 packages loaded
1557:info:build Loading: 0 packages loaded
1558:info:build Loading: 0 packages loaded
1559:info:build Loading: 0 packages loaded
1560:info:build DEBUG: Rule 'io_bazel_rules_docker' indicated that a canonical reproducible form can be obtained by modifying arguments shallow_since = "1556410077 -0400"
1561:info:build Loading: 0 packages loaded
1562:info:build Analyzing: target //tensorflow/tools/pip_package:build_pip_package (1 packages loaded, 0 targets configured)
1563:info:build Analyzing: target //tensorflow/tools/pip_package:build_pip_package (4 packages loaded, 18 targets configured)
1564:info:build Analyzing: target //tensorflow/tools/pip_package:build_pip_package (69 packages loaded, 1010 targets configured)
1565:info:build Analyzing: target //tensorflow/tools/pip_package:build_pip_package (99 packages loaded, 3061 targets configured)
1566:info:build Analyzing: target //tensorflow/tools/pip_package:build_pip_package (110 packages loaded, 3133 targets configured)
1567:info:build Analyzing: target //tensorflow/tools/pip_package:build_pip_package (167 packages loaded, 4423 targets configured)
1568:info:build Analyzing: target //tensorflow/tools/pip_package:build_pip_package (216 packages loaded, 6431 targets configured)
1569:info:build Analyzing: target //tensorflow/tools/pip_package:build_pip_package (257 packages loaded, 8841 targets configured)
1570:info:build Analyzing: target //tensorflow/tools/pip_package:build_pip_package (268 packages loaded, 10663 targets configured)
1571:info:build INFO: Call stack for the definition of repository 'nasm' which is a third_party_http_archive (rule definition at /opt/local/var/macports/build/_opt_local_var_macports_sources_rsync.macports.org_macports_release_tarballs_ports_python_py-tensorflow/py37-tensorflow/work/tensorflow-tensorflow-64c3d38/third_party/repo.bzl:204:28):
1572:info:build  - /opt/local/var/macports/build/_opt_local_var_macports_sources_rsync.macports.org_macports_release_tarballs_ports_python_py-tensorflow/py37-tensorflow/work/tensorflow-tensorflow-64c3d38/third_party/nasm/workspace.bzl:6:5
1573:info:build  - /opt/local/var/macports/build/_opt_local_var_macports_sources_rsync.macports.org_macports_release_tarballs_ports_python_py-tensorflow/py37-tensorflow/work/tensorflow-tensorflow-64c3d38/tensorflow/workspace.bzl:46:5
1574:info:build  - /opt/local/var/macports/build/_opt_local_var_macports_sources_rsync.macports.org_macports_release_tarballs_ports_python_py-tensorflow/py37-tensorflow/work/tensorflow-tensorflow-64c3d38/tensorflow/workspace.bzl:82:5
1575:info:build  - /opt/local/var/macports/build/_opt_local_var_macports_sources_rsync.macports.org_macports_release_tarballs_ports_python_py-tensorflow/py37-tensorflow/work/tensorflow-tensorflow-64c3d38/WORKSPACE:19:1
1576:info:build ERROR: An error occurred during the fetch of repository 'nasm':
1577:info:build    java.io.IOException: Error downloading [https://storage.googleapis.com/mirror.tensorflow.org/www.nasm.us/pub/nasm/releasebuilds/2.13.03/nasm-2.13.03.tar.bz2, http://pkgs.fedoraproject.org/repo/pkgs/nasm/nasm-2.13.03.tar.bz2/sha512/d7a6b4cee8dfd603d8d4c976e5287b5cc542fa0b466ff989b743276a6e28114e64289bf02a7819eca63142a5278aa6eed57773007e5f589e15768e6456a8919d/nasm-2.13.03.tar.bz2, http://www.nasm.us/pub/nasm/releasebuilds/2.13.03/nasm-2.13.03.tar.bz2] to /opt/local/var/macports/build/_opt_local_var_macports_sources_rsync.macports.org_macports_release_tarballs_ports_python_py-tensorflow/py37-tensorflow/work/f8edcfffe013e38c40c078c9afa6e5eb/external/nasm/nasm-2.13.03.tar.bz2: All mirrors are down: [GET returned 404 Not Found, connect timed out]
1578:info:build INFO: Call stack for the definition of repository 'pcre' which is a tf_http_archive (rule definition at /opt/local/var/macports/build/_opt_local_var_macports_sources_rsync.macports.org_macports_release_tarballs_ports_python_py-tensorflow/py37-tensorflow/work/tensorflow-tensorflow-64c3d38/third_party/repo.bzl:124:19):
1579:info:build  - /opt/local/var/macports/build/_opt_local_var_macports_sources_rsync.macports.org_macports_release_tarballs_ports_python_py-tensorflow/py37-tensorflow/work/tensorflow-tensorflow-64c3d38/tensorflow/workspace.bzl:475:5
1580:info:build  - /opt/local/var/macports/build/_opt_local_var_macports_sources_rsync.macports.org_macports_release_tarballs_ports_python_py-tensorflow/py37-tensorflow/work/tensorflow-tensorflow-64c3d38/WORKSPACE:19:1
1581:info:build INFO: Call stack for the definition of repository 'aws' which is a third_party_http_archive (rule definition at /opt/local/var/macports/build/_opt_local_var_macports_sources_rsync.macports.org_macports_release_tarballs_ports_python_py-tensorflow/py37-tensorflow/work/tensorflow-tensorflow-64c3d38/third_party/repo.bzl:204:28):
1582:info:build  - /opt/local/var/macports/build/_opt_local_var_macports_sources_rsync.macports.org_macports_release_tarballs_ports_python_py-tensorflow/py37-tensorflow/work/tensorflow-tensorflow-64c3d38/third_party/aws/workspace.bzl:9:5
1583:info:build  - /opt/local/var/macports/build/_opt_local_var_macports_sources_rsync.macports.org_macports_release_tarballs_ports_python_py-tensorflow/py37-tensorflow/work/tensorflow-tensorflow-64c3d38/tensorflow/workspace.bzl:38:5
1584:info:build  - /opt/local/var/macports/build/_opt_local_var_macports_sources_rsync.macports.org_macports_release_tarballs_ports_python_py-tensorflow/py37-tensorflow/work/tensorflow-tensorflow-64c3d38/tensorflow/workspace.bzl:82:5
1585:info:build  - /opt/local/var/macports/build/_opt_local_var_macports_sources_rsync.macports.org_macports_release_tarballs_ports_python_py-tensorflow/py37-tensorflow/work/tensorflow-tensorflow-64c3d38/WORKSPACE:19:1
1586:info:build INFO: Call stack for the definition of repository 'double_conversion' which is a tf_http_archive (rule definition at /opt/local/var/macports/build/_opt_local_var_macports_sources_rsync.macports.org_macports_release_tarballs_ports_python_py-tensorflow/py37-tensorflow/work/tensorflow-tensorflow-64c3d38/third_party/repo.bzl:124:19):
1587:info:build  - /opt/local/var/macports/build/_opt_local_var_macports_sources_rsync.macports.org_macports_release_tarballs_ports_python_py-tensorflow/py37-tensorflow/work/tensorflow-tensorflow-64c3d38/tensorflow/workspace.bzl:778:5
1588:info:build  - /opt/local/var/macports/build/_opt_local_var_macports_sources_rsync.macports.org_macports_release_tarballs_ports_python_py-tensorflow/py37-tensorflow/work/tensorflow-tensorflow-64c3d38/WORKSPACE:19:1
1589:info:build INFO: Call stack for the definition of repository 'com_github_nanopb_nanopb' which is a tf_http_archive (rule definition at /opt/local/var/macports/build/_opt_local_var_macports_sources_rsync.macports.org_macports_release_tarballs_ports_python_py-tensorflow/py37-tensorflow/work/tensorflow-tensorflow-64c3d38/third_party/repo.bzl:124:19):
1590:info:build  - /opt/local/var/macports/build/_opt_local_var_macports_sources_rsync.macports.org_macports_release_tarballs_ports_python_py-tensorflow/py37-tensorflow/work/tensorflow-tensorflow-64c3d38/tensorflow/workspace.bzl:524:5
1591:info:build  - /opt/local/var/macports/build/_opt_local_var_macports_sources_rsync.macports.org_macports_release_tarballs_ports_python_py-tensorflow/py37-tensorflow/work/tensorflow-tensorflow-64c3d38/WORKSPACE:19:1
1592:info:build ERROR: /opt/local/var/macports/build/_opt_local_var_macports_sources_rsync.macports.org_macports_release_tarballs_ports_python_py-tensorflow/py37-tensorflow/work/tensorflow-tensorflow-64c3d38/tensorflow/tools/pip_package/BUILD:157:1: no such package '@nasm//': java.io.IOException: Error downloading [https://storage.googleapis.com/mirror.tensorflow.org/www.nasm.us/pub/nasm/releasebuilds/2.13.03/nasm-2.13.03.tar.bz2, http://pkgs.fedoraproject.org/repo/pkgs/nasm/nasm-2.13.03.tar.bz2/sha512/d7a6b4cee8dfd603d8d4c976e5287b5cc542fa0b466ff989b743276a6e28114e64289bf02a7819eca63142a5278aa6eed57773007e5f589e15768e6456a8919d/nasm-2.13.03.tar.bz2, http://www.nasm.us/pub/nasm/releasebuilds/2.13.03/nasm-2.13.03.tar.bz2] to /opt/local/var/macports/build/_opt_local_var_macports_sources_rsync.macports.org_macports_release_tarballs_ports_python_py-tensorflow/py37-tensorflow/work/f8edcfffe013e38c40c078c9afa6e5eb/external/nasm/nasm-2.13.03.tar.bz2: All mirrors are down: [GET returned 404 Not Found, connect timed out] and referenced by '//tensorflow/tools/pip_package:licenses'
1593:info:build ERROR: Analysis of target '//tensorflow/tools/pip_package:build_pip_package' failed; build aborted: no such package '@nasm//': java.io.IOException: Error downloading [https://storage.googleapis.com/mirror.tensorflow.org/www.nasm.us/pub/nasm/releasebuilds/2.13.03/nasm-2.13.03.tar.bz2, http://pkgs.fedoraproject.org/repo/pkgs/nasm/nasm-2.13.03.tar.bz2/sha512/d7a6b4cee8dfd603d8d4c976e5287b5cc542fa0b466ff989b743276a6e28114e64289bf02a7819eca63142a5278aa6eed57773007e5f589e15768e6456a8919d/nasm-2.13.03.tar.bz2, http://www.nasm.us/pub/nasm/releasebuilds/2.13.03/nasm-2.13.03.tar.bz2] to /opt/local/var/macports/build/_opt_local_var_macports_sources_rsync.macports.org_macports_release_tarballs_ports_python_py-tensorflow/py37-tensorflow/work/f8edcfffe013e38c40c078c9afa6e5eb/external/nasm/nasm-2.13.03.tar.bz2: All mirrors are down: [GET returned 404 Not Found, connect timed out]
1594:info:build INFO: Elapsed time: 35.654s
1595:info:build INFO: 0 processes.
1596:info:build FAILED: Build did NOT complete successfully (270 packages loaded, 10962 targets configured)
1597:info:build FAILED: Build did NOT complete successfully (270 packages loaded, 10962 targets configured)
1598:info:build Command failed: CC_OPT_FLAGS=-march=x86-64 bazel --max_idle_secs=60 --output_user_root=/opt/local/var/macports/build/_opt_local_var_macports_sources_rsync.macports.org_macports_release_tarballs_ports_python_py-tensorflow/py37-tensorflow/work build -s -c opt --config=opt --conlyopt '-Os' --cxxopt '-Os' --cxxopt '-stdlib=libc++' --linkopt '-L/opt/local/lib' --linkopt '-Wl,-headerpad_max_install_names' --config=mkl --copt=-march=x86-64 //tensorflow/tools/pip_package:build_pip_package
1599:info:build Exit code: 1
1600:error:build Failed to build py37-tensorflow: command execution failed
1601:debug:build Error code: NONE
1602:debug:build Backtrace: command execution failed
1603:debug:build     while executing
1604:debug:build "$procedure $targetname"
1605:error:build See /opt/local/var/macports/logs/_opt_local_var_macports_sources_rsync.macports.org_macports_release_tarballs_ports_python_py-tensorflow/py37-tensorflow/main.log for details.