| 1 | version:1 |
|---|
| 2 | :debug:sysinfo macOS 10.15 (darwin/19.2.0) arch i386 |
|---|
| 3 | :debug:sysinfo MacPorts 2.6.2 |
|---|
| 4 | :debug:sysinfo Xcode 11.3.1 |
|---|
| 5 | :debug:sysinfo SDK 10.15 |
|---|
| 6 | :debug:sysinfo MACOSX_DEPLOYMENT_TARGET: 10.15 |
|---|
| 7 | :debug:main Attempting ln -sf /opt/local/var/macports/build/_opt_local_var_macports_sources_rsync.macports.org_release_tarballs_ports_devel_ossp-uuid/ossp-uuid/work /opt/local/var/macports/sources/rsync.macports.org/release/tarballs/ports/devel/ossp-uuid/work |
|---|
| 8 | :debug:main dropping privileges: euid changed to 501, egid changed to 20. |
|---|
| 9 | :debug:main Executing org.macports.main (ossp-uuid) |
|---|
| 10 | :debug:main Privilege de-escalation not attempted as not running as root. |
|---|
| 11 | :debug:archivefetch archivefetch phase started at Thu Jan 16 21:10:17 AEDT 2020 |
|---|
| 12 | :msg:archivefetch ---> Fetching archive for ossp-uuid |
|---|
| 13 | :debug:archivefetch Executing org.macports.archivefetch (ossp-uuid) |
|---|
| 14 | :debug:archivefetch euid/egid changed to: 0/0 |
|---|
| 15 | :debug:archivefetch chowned /opt/local/var/macports/incoming to macports |
|---|
| 16 | :debug:archivefetch euid/egid changed to: 501/20 |
|---|
| 17 | :info:archivefetch ---> ossp-uuid-1.6.2_11+perl5_26.darwin_19.x86_64.tbz2 doesn't seem to exist in /opt/local/var/macports/incoming/verified |
|---|
| 18 | :msg:archivefetch ---> Attempting to fetch ossp-uuid-1.6.2_11+perl5_26.darwin_19.x86_64.tbz2 from https://packages.macports.org/ossp-uuid |
|---|
| 19 | :debug:archivefetch Fetching archive failed: The requested URL returned error: 404 |
|---|
| 20 | :msg:archivefetch ---> Attempting to fetch ossp-uuid-1.6.2_11+perl5_26.darwin_19.x86_64.tbz2 from http://ywg.ca.packages.macports.org/mirror/macports/packages/ossp-uuid |
|---|
| 21 | :debug:archivefetch Fetching archive failed: The requested URL returned error: 404 Not Found |
|---|
| 22 | :msg:archivefetch ---> Attempting to fetch ossp-uuid-1.6.2_11+perl5_26.darwin_19.x86_64.tbz2 from http://kmq.jp.packages.macports.org/ossp-uuid |
|---|
| 23 | :debug:archivefetch Fetching archive failed: The requested URL returned error: 404 Not Found |
|---|
| 24 | :debug:archivefetch Privilege de-escalation not attempted as not running as root. |
|---|
| 25 | :debug:fetch fetch phase started at Thu Jan 16 21:10:19 AEDT 2020 |
|---|
| 26 | :notice:fetch ---> Fetching distfiles for ossp-uuid |
|---|
| 27 | :debug:fetch Executing proc-pre-org.macports.fetch-fetch-0 |
|---|
| 28 | :debug:fetch Executing org.macports.fetch (ossp-uuid) |
|---|
| 29 | :debug:fetch Privilege de-escalation not attempted as not running as root. |
|---|
| 30 | :debug:checksum checksum phase started at Thu Jan 16 21:10:19 AEDT 2020 |
|---|
| 31 | :notice:checksum ---> Verifying checksums for ossp-uuid |
|---|
| 32 | :debug:checksum Executing org.macports.checksum (ossp-uuid) |
|---|
| 33 | :info:checksum ---> Checksumming uuid-1.6.2.tar.gz |
|---|
| 34 | :debug:checksum Calculated (rmd160) is f9cd513577557c4f1d7de869f80035b8844b56d7 |
|---|
| 35 | :debug:checksum Correct (rmd160) checksum for uuid-1.6.2.tar.gz |
|---|
| 36 | :debug:checksum Calculated (sha256) is 11a615225baa5f8bb686824423f50e4427acd3f70d394765bdff32801f0fd5b0 |
|---|
| 37 | :debug:checksum Correct (sha256) checksum for uuid-1.6.2.tar.gz |
|---|
| 38 | :debug:checksum Calculated (size) is 397048 |
|---|
| 39 | :debug:checksum Correct (size) checksum for uuid-1.6.2.tar.gz |
|---|
| 40 | :debug:checksum Privilege de-escalation not attempted as not running as root. |
|---|
| 41 | :debug:extract extract phase started at Thu Jan 16 21:10:19 AEDT 2020 |
|---|
| 42 | :notice:extract ---> Extracting ossp-uuid |
|---|
| 43 | :debug:extract Executing org.macports.extract (ossp-uuid) |
|---|
| 44 | :info:extract ---> Extracting uuid-1.6.2.tar.gz |
|---|
| 45 | :debug:extract setting option extract.args to '/opt/local/var/macports/distfiles/ossp-uuid/uuid-1.6.2.tar.gz' |
|---|
| 46 | :debug:extract Environment: |
|---|
| 47 | :debug:extract CC_PRINT_OPTIONS='YES' |
|---|
| 48 | :debug:extract CC_PRINT_OPTIONS_FILE='/opt/local/var/macports/build/_opt_local_var_macports_sources_rsync.macports.org_release_tarballs_ports_devel_ossp-uuid/ossp-uuid/work/.CC_PRINT_OPTIONS' |
|---|
| 49 | :debug:extract CPATH='/opt/local/include' |
|---|
| 50 | :debug:extract DEVELOPER_DIR='/Applications/Xcode.app/Contents/Developer' |
|---|
| 51 | :debug:extract LIBRARY_PATH='/opt/local/lib' |
|---|
| 52 | :debug:extract MACOSX_DEPLOYMENT_TARGET='10.15' |
|---|
| 53 | :debug:extract SDKROOT='/Applications/Xcode.app/Contents/Developer/Platforms/MacOSX.platform/Developer/SDKs/MacOSX10.15.sdk' |
|---|
| 54 | :info:extract Executing: cd "/opt/local/var/macports/build/_opt_local_var_macports_sources_rsync.macports.org_release_tarballs_ports_devel_ossp-uuid/ossp-uuid/work" && /usr/bin/gzip -dc '/opt/local/var/macports/distfiles/ossp-uuid/uuid-1.6.2.tar.gz' | /usr/bin/tar -xf - |
|---|
| 55 | :debug:extract system: cd "/opt/local/var/macports/build/_opt_local_var_macports_sources_rsync.macports.org_release_tarballs_ports_devel_ossp-uuid/ossp-uuid/work" && /usr/bin/gzip -dc '/opt/local/var/macports/distfiles/ossp-uuid/uuid-1.6.2.tar.gz' | /usr/bin/tar -xf - |
|---|
| 56 | :debug:extract euid/egid changed to: 0/0 |
|---|
| 57 | :debug:extract chowned /opt/local/var/macports/build/_opt_local_var_macports_sources_rsync.macports.org_release_tarballs_ports_devel_ossp-uuid/ossp-uuid/work to macports |
|---|
| 58 | :debug:extract euid/egid changed to: 501/20 |
|---|
| 59 | :debug:extract Privilege de-escalation not attempted as not running as root. |
|---|
| 60 | :debug:patch patch phase started at Thu Jan 16 21:10:19 AEDT 2020 |
|---|
| 61 | :debug:patch Executing org.macports.patch (ossp-uuid) |
|---|
| 62 | :notice:patch ---> Applying patches to ossp-uuid |
|---|
| 63 | :info:patch ---> Applying patch-Makefile.in.diff |
|---|
| 64 | :debug:patch Environment: |
|---|
| 65 | :debug:patch CC_PRINT_OPTIONS='YES' |
|---|
| 66 | :debug:patch CC_PRINT_OPTIONS_FILE='/opt/local/var/macports/build/_opt_local_var_macports_sources_rsync.macports.org_release_tarballs_ports_devel_ossp-uuid/ossp-uuid/work/.CC_PRINT_OPTIONS' |
|---|
| 67 | :debug:patch CPATH='/opt/local/include' |
|---|
| 68 | :debug:patch DEVELOPER_DIR='/Applications/Xcode.app/Contents/Developer' |
|---|
| 69 | :debug:patch LIBRARY_PATH='/opt/local/lib' |
|---|
| 70 | :debug:patch MACOSX_DEPLOYMENT_TARGET='10.15' |
|---|
| 71 | :debug:patch SDKROOT='/Applications/Xcode.app/Contents/Developer/Platforms/MacOSX.platform/Developer/SDKs/MacOSX10.15.sdk' |
|---|
| 72 | :info:patch Executing: cd "/opt/local/var/macports/build/_opt_local_var_macports_sources_rsync.macports.org_release_tarballs_ports_devel_ossp-uuid/ossp-uuid/work/uuid-1.6.2" && /usr/bin/patch -p0 < '/opt/local/var/macports/sources/rsync.macports.org/release/tarballs/ports/devel/ossp-uuid/files/patch-Makefile.in.diff' |
|---|
| 73 | :debug:patch system: cd "/opt/local/var/macports/build/_opt_local_var_macports_sources_rsync.macports.org_release_tarballs_ports_devel_ossp-uuid/ossp-uuid/work/uuid-1.6.2" && /usr/bin/patch -p0 < '/opt/local/var/macports/sources/rsync.macports.org/release/tarballs/ports/devel/ossp-uuid/files/patch-Makefile.in.diff' |
|---|
| 74 | :info:patch patching file ./Makefile.in |
|---|
| 75 | :info:patch ---> Applying patch-uuid.pc.in.diff |
|---|
| 76 | :debug:patch Environment: |
|---|
| 77 | :debug:patch CC_PRINT_OPTIONS='YES' |
|---|
| 78 | :debug:patch CC_PRINT_OPTIONS_FILE='/opt/local/var/macports/build/_opt_local_var_macports_sources_rsync.macports.org_release_tarballs_ports_devel_ossp-uuid/ossp-uuid/work/.CC_PRINT_OPTIONS' |
|---|
| 79 | :debug:patch CPATH='/opt/local/include' |
|---|
| 80 | :debug:patch DEVELOPER_DIR='/Applications/Xcode.app/Contents/Developer' |
|---|
| 81 | :debug:patch LIBRARY_PATH='/opt/local/lib' |
|---|
| 82 | :debug:patch MACOSX_DEPLOYMENT_TARGET='10.15' |
|---|
| 83 | :debug:patch SDKROOT='/Applications/Xcode.app/Contents/Developer/Platforms/MacOSX.platform/Developer/SDKs/MacOSX10.15.sdk' |
|---|
| 84 | :info:patch Executing: cd "/opt/local/var/macports/build/_opt_local_var_macports_sources_rsync.macports.org_release_tarballs_ports_devel_ossp-uuid/ossp-uuid/work/uuid-1.6.2" && /usr/bin/patch -p0 < '/opt/local/var/macports/sources/rsync.macports.org/release/tarballs/ports/devel/ossp-uuid/files/patch-uuid.pc.in.diff' |
|---|
| 85 | :debug:patch system: cd "/opt/local/var/macports/build/_opt_local_var_macports_sources_rsync.macports.org_release_tarballs_ports_devel_ossp-uuid/ossp-uuid/work/uuid-1.6.2" && /usr/bin/patch -p0 < '/opt/local/var/macports/sources/rsync.macports.org/release/tarballs/ports/devel/ossp-uuid/files/patch-uuid.pc.in.diff' |
|---|
| 86 | :info:patch patching file uuid.pc.in |
|---|
| 87 | :info:patch ---> Applying patch-uuid-uuid.h.in.diff |
|---|
| 88 | :debug:patch Environment: |
|---|
| 89 | :debug:patch CC_PRINT_OPTIONS='YES' |
|---|
| 90 | :debug:patch CC_PRINT_OPTIONS_FILE='/opt/local/var/macports/build/_opt_local_var_macports_sources_rsync.macports.org_release_tarballs_ports_devel_ossp-uuid/ossp-uuid/work/.CC_PRINT_OPTIONS' |
|---|
| 91 | :debug:patch CPATH='/opt/local/include' |
|---|
| 92 | :debug:patch DEVELOPER_DIR='/Applications/Xcode.app/Contents/Developer' |
|---|
| 93 | :debug:patch LIBRARY_PATH='/opt/local/lib' |
|---|
| 94 | :debug:patch MACOSX_DEPLOYMENT_TARGET='10.15' |
|---|
| 95 | :debug:patch SDKROOT='/Applications/Xcode.app/Contents/Developer/Platforms/MacOSX.platform/Developer/SDKs/MacOSX10.15.sdk' |
|---|
| 96 | :info:patch Executing: cd "/opt/local/var/macports/build/_opt_local_var_macports_sources_rsync.macports.org_release_tarballs_ports_devel_ossp-uuid/ossp-uuid/work/uuid-1.6.2" && /usr/bin/patch -p0 < '/opt/local/var/macports/sources/rsync.macports.org/release/tarballs/ports/devel/ossp-uuid/files/patch-uuid-uuid.h.in.diff' |
|---|
| 97 | :debug:patch system: cd "/opt/local/var/macports/build/_opt_local_var_macports_sources_rsync.macports.org_release_tarballs_ports_devel_ossp-uuid/ossp-uuid/work/uuid-1.6.2" && /usr/bin/patch -p0 < '/opt/local/var/macports/sources/rsync.macports.org/release/tarballs/ports/devel/ossp-uuid/files/patch-uuid-uuid.h.in.diff' |
|---|
| 98 | :info:patch patching file uuid.h.in |
|---|
| 99 | :debug:patch Privilege de-escalation not attempted as not running as root. |
|---|
| 100 | :debug:configure configure phase started at Thu Jan 16 21:10:19 AEDT 2020 |
|---|
| 101 | :notice:configure ---> Configuring ossp-uuid |
|---|
| 102 | :debug:configure Preferred compilers: clang macports-clang-9.0 macports-clang-8.0 macports-clang-7.0 macports-clang-6.0 macports-clang-5.0 |
|---|
| 103 | :debug:configure Using compiler 'Xcode Clang' |
|---|
| 104 | :debug:configure Executing org.macports.configure (ossp-uuid) |
|---|
| 105 | :debug:configure Environment: |
|---|
| 106 | :debug:configure CC='/usr/bin/clang' |
|---|
| 107 | :debug:configure CC_PRINT_OPTIONS='YES' |
|---|
| 108 | :debug:configure CC_PRINT_OPTIONS_FILE='/opt/local/var/macports/build/_opt_local_var_macports_sources_rsync.macports.org_release_tarballs_ports_devel_ossp-uuid/ossp-uuid/work/.CC_PRINT_OPTIONS' |
|---|
| 109 | :debug:configure CFLAGS='-pipe -Os -isysroot/Applications/Xcode.app/Contents/Developer/Platforms/MacOSX.platform/Developer/SDKs/MacOSX10.15.sdk -arch x86_64' |
|---|
| 110 | :debug:configure CPATH='/opt/local/include' |
|---|
| 111 | :debug:configure CPPFLAGS='-I/opt/local/include -isysroot/Applications/Xcode.app/Contents/Developer/Platforms/MacOSX.platform/Developer/SDKs/MacOSX10.15.sdk' |
|---|
| 112 | :debug:configure CXX='/usr/bin/clang++' |
|---|
| 113 | :debug:configure CXXFLAGS='-pipe -Os -stdlib=libc++ -isysroot/Applications/Xcode.app/Contents/Developer/Platforms/MacOSX.platform/Developer/SDKs/MacOSX10.15.sdk -arch x86_64' |
|---|
| 114 | :debug:configure DEVELOPER_DIR='/Applications/Xcode.app/Contents/Developer' |
|---|
| 115 | :debug:configure F90FLAGS='-pipe -Os -m64' |
|---|
| 116 | :debug:configure FCFLAGS='-pipe -Os -m64' |
|---|
| 117 | :debug:configure FFLAGS='-pipe -Os -m64' |
|---|
| 118 | :debug:configure INSTALL='/usr/bin/install -c' |
|---|
| 119 | :debug:configure LDFLAGS='-L/opt/local/lib -Wl,-headerpad_max_install_names -Wl,-syslibroot,/Applications/Xcode.app/Contents/Developer/Platforms/MacOSX.platform/Developer/SDKs/MacOSX10.15.sdk -arch x86_64' |
|---|
| 120 | :debug:configure LIBRARY_PATH='/opt/local/lib' |
|---|
| 121 | :debug:configure MACOSX_DEPLOYMENT_TARGET='10.15' |
|---|
| 122 | :debug:configure OBJC='/usr/bin/clang' |
|---|
| 123 | :debug:configure OBJCFLAGS='-pipe -Os -isysroot/Applications/Xcode.app/Contents/Developer/Platforms/MacOSX.platform/Developer/SDKs/MacOSX10.15.sdk -arch x86_64' |
|---|
| 124 | :debug:configure OBJCXX='/usr/bin/clang++' |
|---|
| 125 | :debug:configure OBJCXXFLAGS='-pipe -Os -stdlib=libc++ -isysroot/Applications/Xcode.app/Contents/Developer/Platforms/MacOSX.platform/Developer/SDKs/MacOSX10.15.sdk -arch x86_64' |
|---|
| 126 | :debug:configure PERL='/opt/local/bin/perl5.26' |
|---|
| 127 | :debug:configure SDKROOT='/Applications/Xcode.app/Contents/Developer/Platforms/MacOSX.platform/Developer/SDKs/MacOSX10.15.sdk' |
|---|
| 128 | :info:configure Executing: cd "/opt/local/var/macports/build/_opt_local_var_macports_sources_rsync.macports.org_release_tarballs_ports_devel_ossp-uuid/ossp-uuid/work/uuid-1.6.2" && ./configure --prefix=/opt/local --without-php --without-pgsql --includedir=/opt/local/include/ossp --with-perl --with-perl-compat |
|---|
| 129 | :debug:configure system: cd "/opt/local/var/macports/build/_opt_local_var_macports_sources_rsync.macports.org_release_tarballs_ports_devel_ossp-uuid/ossp-uuid/work/uuid-1.6.2" && ./configure --prefix=/opt/local --without-php --without-pgsql --includedir=/opt/local/include/ossp --with-perl --with-perl-compat |
|---|
| 130 | :info:configure shtool:echo:Warning: unable to determine terminal sequence for bold mode |
|---|
| 131 | :info:configure Configuring OSSP uuid (Universally Unique Identifier), version 1.6.2 (04-Jul-2008) |
|---|
| 132 | :info:configure checking whether make sets $(MAKE)... yes |
|---|
| 133 | :info:configure checking for gcc... /usr/bin/clang |
|---|
| 134 | :info:configure checking for C compiler default output file name... a.out |
|---|
| 135 | :info:configure checking whether the C compiler works... yes |
|---|
| 136 | :info:configure checking whether we are cross compiling... no |
|---|
| 137 | :info:configure checking for suffix of executables... |
|---|
| 138 | :info:configure checking for suffix of object files... o |
|---|
| 139 | :info:configure checking whether we are using the GNU C compiler... yes |
|---|
| 140 | :info:configure checking whether /usr/bin/clang accepts -g... yes |
|---|
| 141 | :info:configure checking for /usr/bin/clang option to accept ISO C89... none needed |
|---|
| 142 | :info:configure checking for compilation debug mode... disabled |
|---|
| 143 | :info:configure checking how to run the C preprocessor... /usr/bin/clang -E |
|---|
| 144 | :info:configure checking for grep that handles long lines and -e... /usr/bin/grep |
|---|
| 145 | :info:configure checking for egrep... /usr/bin/grep -E |
|---|
| 146 | :info:configure checking for ANSI C header files... yes |
|---|
| 147 | :info:configure checking for sys/types.h... yes |
|---|
| 148 | :info:configure checking for sys/stat.h... yes |
|---|
| 149 | :info:configure checking for stdlib.h... yes |
|---|
| 150 | :info:configure checking for string.h... yes |
|---|
| 151 | :info:configure checking for memory.h... yes |
|---|
| 152 | :info:configure checking for strings.h... yes |
|---|
| 153 | :info:configure checking for inttypes.h... yes |
|---|
| 154 | :info:configure checking for stdint.h... yes |
|---|
| 155 | :info:configure checking for unistd.h... yes |
|---|
| 156 | :info:configure checking whether to build against external Dmalloc library... no |
|---|
| 157 | :info:configure checking build system type... i386-apple-darwin19.2.0 |
|---|
| 158 | :info:configure checking host system type... i386-apple-darwin19.2.0 |
|---|
| 159 | :info:configure checking for a sed that does not truncate output... /usr/bin/sed |
|---|
| 160 | :info:configure checking for fgrep... /usr/bin/grep -F |
|---|
| 161 | :info:configure checking for ld used by /usr/bin/clang... /Applications/Xcode.app/Contents/Developer/Toolchains/XcodeDefault.xctoolchain/usr/bin/ld |
|---|
| 162 | :info:configure checking if the linker (/Applications/Xcode.app/Contents/Developer/Toolchains/XcodeDefault.xctoolchain/usr/bin/ld) is GNU ld... no |
|---|
| 163 | :info:configure checking for BSD- or MS-compatible name lister (nm)... /usr/bin/nm -B |
|---|
| 164 | :info:configure checking the name lister (/usr/bin/nm -B) interface... BSD nm |
|---|
| 165 | :info:configure checking whether ln -s works... yes |
|---|
| 166 | :info:configure checking the maximum length of command line arguments... 196608 |
|---|
| 167 | :info:configure checking whether the shell understands some XSI constructs... yes |
|---|
| 168 | :info:configure checking whether the shell understands "+="... yes |
|---|
| 169 | :info:configure checking for /Applications/Xcode.app/Contents/Developer/Toolchains/XcodeDefault.xctoolchain/usr/bin/ld option to reload object files... -r |
|---|
| 170 | :info:configure checking how to recognize dependent libraries... pass_all |
|---|
| 171 | :info:configure checking for ar... ar |
|---|
| 172 | :info:configure checking for strip... strip |
|---|
| 173 | :info:configure checking for ranlib... ranlib |
|---|
| 174 | :info:configure checking command to parse /usr/bin/nm -B output from /usr/bin/clang object... ok |
|---|
| 175 | :info:configure checking for dsymutil... dsymutil |
|---|
| 176 | :info:configure checking for nmedit... nmedit |
|---|
| 177 | :info:configure checking for lipo... lipo |
|---|
| 178 | :info:configure checking for otool... otool |
|---|
| 179 | :info:configure checking for otool64... no |
|---|
| 180 | :info:configure checking for -single_module linker flag... yes |
|---|
| 181 | :info:configure checking for -exported_symbols_list linker flag... yes |
|---|
| 182 | :info:configure checking for dlfcn.h... yes |
|---|
| 183 | :info:configure checking for objdir... .libs |
|---|
| 184 | :info:configure checking if /usr/bin/clang supports -fno-rtti -fno-exceptions... yes |
|---|
| 185 | :info:configure checking for /usr/bin/clang option to produce PIC... -fno-common -DPIC |
|---|
| 186 | :info:configure checking if /usr/bin/clang PIC flag -fno-common -DPIC works... yes |
|---|
| 187 | :info:configure checking if /usr/bin/clang static flag -static works... no |
|---|
| 188 | :info:configure checking if /usr/bin/clang supports -c -o file.o... yes |
|---|
| 189 | :info:configure checking if /usr/bin/clang supports -c -o file.o... (cached) yes |
|---|
| 190 | :info:configure checking whether the /usr/bin/clang linker (/Applications/Xcode.app/Contents/Developer/Toolchains/XcodeDefault.xctoolchain/usr/bin/ld) supports shared libraries... yes |
|---|
| 191 | :info:configure checking dynamic linker characteristics... darwin19.2.0 dyld |
|---|
| 192 | :info:configure checking how to hardcode library paths into programs... immediate |
|---|
| 193 | :info:configure checking whether stripping libraries is possible... yes |
|---|
| 194 | :info:configure checking if libtool supports shared libraries... yes |
|---|
| 195 | :info:configure checking whether to build shared libraries... yes |
|---|
| 196 | :info:configure checking whether to build static libraries... yes |
|---|
| 197 | :info:configure checking whether we are using the GNU C++ compiler... yes |
|---|
| 198 | :info:configure checking whether /usr/bin/clang++ accepts -g... yes |
|---|
| 199 | :info:configure checking how to run the C++ preprocessor... /usr/bin/clang++ -E |
|---|
| 200 | :info:configure checking for gethostname in -lnsl... no |
|---|
| 201 | :info:configure checking for gethostbyname in -lnsl... no |
|---|
| 202 | :info:configure checking for accept in -lsocket... no |
|---|
| 203 | :info:configure checking for va_copy() function... yes |
|---|
| 204 | :info:configure checking for sys/types.h... (cached) yes |
|---|
| 205 | :info:configure checking sys/param.h usability... yes |
|---|
| 206 | :info:configure checking sys/param.h presence... yes |
|---|
| 207 | :info:configure checking for sys/param.h... yes |
|---|
| 208 | :info:configure checking sys/time.h usability... yes |
|---|
| 209 | :info:configure checking sys/time.h presence... yes |
|---|
| 210 | :info:configure checking for sys/time.h... yes |
|---|
| 211 | :info:configure checking sys/socket.h usability... yes |
|---|
| 212 | :info:configure checking sys/socket.h presence... yes |
|---|
| 213 | :info:configure checking for sys/socket.h... yes |
|---|
| 214 | :info:configure checking sys/sockio.h usability... yes |
|---|
| 215 | :info:configure checking sys/sockio.h presence... yes |
|---|
| 216 | :info:configure checking for sys/sockio.h... yes |
|---|
| 217 | :info:configure checking sys/ioctl.h usability... yes |
|---|
| 218 | :info:configure checking sys/ioctl.h presence... yes |
|---|
| 219 | :info:configure checking for sys/ioctl.h... yes |
|---|
| 220 | :info:configure checking sys/select.h usability... yes |
|---|
| 221 | :info:configure checking sys/select.h presence... yes |
|---|
| 222 | :info:configure checking for sys/select.h... yes |
|---|
| 223 | :info:configure checking for netdb.h... yes |
|---|
| 224 | :info:configure checking for ifaddrs.h... yes |
|---|
| 225 | :info:configure checking for net/if.h... yes |
|---|
| 226 | :info:configure checking for net/if_dl.h... yes |
|---|
| 227 | :info:configure checking for net/if_arp.h... yes |
|---|
| 228 | :info:configure checking for netinet/in.h... yes |
|---|
| 229 | :info:configure checking for arpa/inet.h... yes |
|---|
| 230 | :info:configure checking for struct timeval... yes |
|---|
| 231 | :info:configure checking for getifaddrs... yes |
|---|
| 232 | :info:configure checking for nanosleep... yes |
|---|
| 233 | :info:configure checking for Sleep... no |
|---|
| 234 | :info:configure checking for gettimeofday... yes |
|---|
| 235 | :info:configure checking for clock_gettime... yes |
|---|
| 236 | :info:configure checking for long long... yes |
|---|
| 237 | :info:configure checking for long double... yes |
|---|
| 238 | :info:configure checking size of char... 1 |
|---|
| 239 | :info:configure checking size of unsigned char... 1 |
|---|
| 240 | :info:configure checking size of short... 2 |
|---|
| 241 | :info:configure checking size of unsigned short... 2 |
|---|
| 242 | :info:configure checking size of int... 4 |
|---|
| 243 | :info:configure checking size of unsigned int... 4 |
|---|
| 244 | :info:configure checking size of long... 8 |
|---|
| 245 | :info:configure checking size of unsigned long... 8 |
|---|
| 246 | :info:configure checking size of long long... 8 |
|---|
| 247 | :info:configure checking size of unsigned long long... 8 |
|---|
| 248 | :info:configure checking whether to build DCE 1.1 backward compatibility API... (cached) no |
|---|
| 249 | :info:configure checking whether to build C++ bindings to C API... (cached) no |
|---|
| 250 | :info:configure checking whether to build Perl bindings to C API... (cached) yes |
|---|
| 251 | :info:configure checking whether to build Perl compatibility API... (cached) yes |
|---|
| 252 | :info:configure checking for perl... /opt/local/bin/perl5.26 |
|---|
| 253 | :info:configure checking whether to build PHP bindings to C API... (cached) no |
|---|
| 254 | :info:configure checking for php5... no |
|---|
| 255 | :info:configure checking for php... /usr/bin/php |
|---|
| 256 | :info:configure checking whether to build PostgreSQL bindings to C API... (cached) no |
|---|
| 257 | :info:configure checking for pg_config... no |
|---|
| 258 | :info:configure configure: creating ./config.status |
|---|
| 259 | :info:configure config.status: creating Makefile |
|---|
| 260 | :info:configure config.status: creating uuid-config |
|---|
| 261 | :info:configure config.status: creating uuid.pc |
|---|
| 262 | :info:configure config.status: creating uuid.h |
|---|
| 263 | :info:configure config.status: creating config.h |
|---|
| 264 | :info:configure config.status: executing libtool commands |
|---|
| 265 | :info:configure config.status: executing adjustment commands |
|---|
| 266 | :debug:configure Privilege de-escalation not attempted as not running as root. |
|---|
| 267 | :debug:build build phase started at Thu Jan 16 21:10:34 AEDT 2020 |
|---|
| 268 | :notice:build ---> Building ossp-uuid |
|---|
| 269 | :debug:build Executing org.macports.build (ossp-uuid) |
|---|
| 270 | :debug:build Environment: |
|---|
| 271 | :debug:build CC_PRINT_OPTIONS='YES' |
|---|
| 272 | :debug:build CC_PRINT_OPTIONS_FILE='/opt/local/var/macports/build/_opt_local_var_macports_sources_rsync.macports.org_release_tarballs_ports_devel_ossp-uuid/ossp-uuid/work/.CC_PRINT_OPTIONS' |
|---|
| 273 | :debug:build CPATH='/opt/local/include' |
|---|
| 274 | :debug:build DEVELOPER_DIR='/Applications/Xcode.app/Contents/Developer' |
|---|
| 275 | :debug:build LIBRARY_PATH='/opt/local/lib' |
|---|
| 276 | :debug:build MACOSX_DEPLOYMENT_TARGET='10.15' |
|---|
| 277 | :debug:build SDKROOT='/Applications/Xcode.app/Contents/Developer/Platforms/MacOSX.platform/Developer/SDKs/MacOSX10.15.sdk' |
|---|
| 278 | :info:build Executing: cd "/opt/local/var/macports/build/_opt_local_var_macports_sources_rsync.macports.org_release_tarballs_ports_devel_ossp-uuid/ossp-uuid/work/uuid-1.6.2" && /usr/bin/make -j8 -w all |
|---|
| 279 | :debug:build system: cd "/opt/local/var/macports/build/_opt_local_var_macports_sources_rsync.macports.org_release_tarballs_ports_devel_ossp-uuid/ossp-uuid/work/uuid-1.6.2" && /usr/bin/make -j8 -w all |
|---|
| 280 | :info:build make: Entering directory `/opt/local/var/macports/build/_opt_local_var_macports_sources_rsync.macports.org_release_tarballs_ports_devel_ossp-uuid/ossp-uuid/work/uuid-1.6.2' |
|---|
| 281 | :info:build libtool: compile: /usr/bin/clang -I. -I. -I/opt/local/include -isysroot/Applications/Xcode.app/Contents/Developer/Platforms/MacOSX.platform/Developer/SDKs/MacOSX10.15.sdk -DHAVE_CONFIG_H -pipe -Os -isysroot/Applications/Xcode.app/Contents/Developer/Platforms/MacOSX.platform/Developer/SDKs/MacOSX10.15.sdk -arch x86_64 -c uuid_ui128.c -fno-common -DPIC -o .libs/uuid_ui128.o |
|---|
| 282 | :info:build libtool: compile: /usr/bin/clang -I. -I. -I/opt/local/include -isysroot/Applications/Xcode.app/Contents/Developer/Platforms/MacOSX.platform/Developer/SDKs/MacOSX10.15.sdk -DHAVE_CONFIG_H -pipe -Os -isysroot/Applications/Xcode.app/Contents/Developer/Platforms/MacOSX.platform/Developer/SDKs/MacOSX10.15.sdk -arch x86_64 -c uuid_ui64.c -fno-common -DPIC -o .libs/uuid_ui64.o |
|---|
| 283 | :info:build libtool: compile: /usr/bin/clang -I. -I. -I/opt/local/include -isysroot/Applications/Xcode.app/Contents/Developer/Platforms/MacOSX.platform/Developer/SDKs/MacOSX10.15.sdk -DHAVE_CONFIG_H -pipe -Os -isysroot/Applications/Xcode.app/Contents/Developer/Platforms/MacOSX.platform/Developer/SDKs/MacOSX10.15.sdk -arch x86_64 -c uuid_md5.c -fno-common -DPIC -o .libs/uuid_md5.o |
|---|
| 284 | :info:build libtool: compile: /usr/bin/clang -I. -I. -I/opt/local/include -isysroot/Applications/Xcode.app/Contents/Developer/Platforms/MacOSX.platform/Developer/SDKs/MacOSX10.15.sdk -DHAVE_CONFIG_H -pipe -Os -isysroot/Applications/Xcode.app/Contents/Developer/Platforms/MacOSX.platform/Developer/SDKs/MacOSX10.15.sdk -arch x86_64 -c uuid.c -fno-common -DPIC -o .libs/uuid.o |
|---|
| 285 | :info:build libtool: compile: /usr/bin/clang -I. -I. -I/opt/local/include -isysroot/Applications/Xcode.app/Contents/Developer/Platforms/MacOSX.platform/Developer/SDKs/MacOSX10.15.sdk -DHAVE_CONFIG_H -pipe -Os -isysroot/Applications/Xcode.app/Contents/Developer/Platforms/MacOSX.platform/Developer/SDKs/MacOSX10.15.sdk -arch x86_64 -c uuid_prng.c -fno-common -DPIC -o .libs/uuid_prng.o |
|---|
| 286 | :info:build libtool: compile: /usr/bin/clang -I. -I. -I/opt/local/include -isysroot/Applications/Xcode.app/Contents/Developer/Platforms/MacOSX.platform/Developer/SDKs/MacOSX10.15.sdk -DHAVE_CONFIG_H -pipe -Os -isysroot/Applications/Xcode.app/Contents/Developer/Platforms/MacOSX.platform/Developer/SDKs/MacOSX10.15.sdk -arch x86_64 -c uuid_mac.c -fno-common -DPIC -o .libs/uuid_mac.o |
|---|
| 287 | :info:build libtool: compile: /usr/bin/clang -I. -I. -I/opt/local/include -isysroot/Applications/Xcode.app/Contents/Developer/Platforms/MacOSX.platform/Developer/SDKs/MacOSX10.15.sdk -DHAVE_CONFIG_H -pipe -Os -isysroot/Applications/Xcode.app/Contents/Developer/Platforms/MacOSX.platform/Developer/SDKs/MacOSX10.15.sdk -arch x86_64 -c uuid_time.c -fno-common -DPIC -o .libs/uuid_time.o |
|---|
| 288 | :info:build libtool: compile: /usr/bin/clang -I. -I. -I/opt/local/include -isysroot/Applications/Xcode.app/Contents/Developer/Platforms/MacOSX.platform/Developer/SDKs/MacOSX10.15.sdk -DHAVE_CONFIG_H -pipe -Os -isysroot/Applications/Xcode.app/Contents/Developer/Platforms/MacOSX.platform/Developer/SDKs/MacOSX10.15.sdk -arch x86_64 -c uuid_sha1.c -fno-common -DPIC -o .libs/uuid_sha1.o |
|---|
| 289 | :info:build libtool: compile: /usr/bin/clang -I. -I. -I/opt/local/include -isysroot/Applications/Xcode.app/Contents/Developer/Platforms/MacOSX.platform/Developer/SDKs/MacOSX10.15.sdk -DHAVE_CONFIG_H -pipe -Os -isysroot/Applications/Xcode.app/Contents/Developer/Platforms/MacOSX.platform/Developer/SDKs/MacOSX10.15.sdk -arch x86_64 -c uuid_time.c -o uuid_time.o >/dev/null 2>&1 |
|---|
| 290 | :info:build libtool: compile: /usr/bin/clang -I. -I. -I/opt/local/include -isysroot/Applications/Xcode.app/Contents/Developer/Platforms/MacOSX.platform/Developer/SDKs/MacOSX10.15.sdk -DHAVE_CONFIG_H -pipe -Os -isysroot/Applications/Xcode.app/Contents/Developer/Platforms/MacOSX.platform/Developer/SDKs/MacOSX10.15.sdk -arch x86_64 -c uuid_mac.c -o uuid_mac.o >/dev/null 2>&1 |
|---|
| 291 | :info:build libtool: compile: /usr/bin/clang -I. -I. -I/opt/local/include -isysroot/Applications/Xcode.app/Contents/Developer/Platforms/MacOSX.platform/Developer/SDKs/MacOSX10.15.sdk -DHAVE_CONFIG_H -pipe -Os -isysroot/Applications/Xcode.app/Contents/Developer/Platforms/MacOSX.platform/Developer/SDKs/MacOSX10.15.sdk -arch x86_64 -c uuid_prng.c -o uuid_prng.o >/dev/null 2>&1 |
|---|
| 292 | :info:build uuid.c:176:25: warning: comparison of function 'uuid_clone' equal to a null pointer is always false [-Wtautological-pointer-compare] |
|---|
| 293 | :info:build if (uuid == NULL || uuid_clone == NULL) |
|---|
| 294 | :info:build ^~~~~~~~~~ ~~~~ |
|---|
| 295 | :info:build uuid.c:176:25: note: prefix with the address-of operator to silence this warning |
|---|
| 296 | :info:build if (uuid == NULL || uuid_clone == NULL) |
|---|
| 297 | :info:build ^ |
|---|
| 298 | :info:build & |
|---|
| 299 | :info:build libtool: compile: /usr/bin/clang -I. -I. -I/opt/local/include -isysroot/Applications/Xcode.app/Contents/Developer/Platforms/MacOSX.platform/Developer/SDKs/MacOSX10.15.sdk -DHAVE_CONFIG_H -pipe -Os -isysroot/Applications/Xcode.app/Contents/Developer/Platforms/MacOSX.platform/Developer/SDKs/MacOSX10.15.sdk -arch x86_64 -c uuid_sha1.c -o uuid_sha1.o >/dev/null 2>&1 |
|---|
| 300 | :info:build /usr/bin/clang -I. -I. -I/opt/local/include -isysroot/Applications/Xcode.app/Contents/Developer/Platforms/MacOSX.platform/Developer/SDKs/MacOSX10.15.sdk -DHAVE_CONFIG_H -pipe -Os -isysroot/Applications/Xcode.app/Contents/Developer/Platforms/MacOSX.platform/Developer/SDKs/MacOSX10.15.sdk -arch x86_64 -c uuid_cli.c |
|---|
| 301 | :info:build libtool: compile: /usr/bin/clang -I. -I. -I/opt/local/include -isysroot/Applications/Xcode.app/Contents/Developer/Platforms/MacOSX.platform/Developer/SDKs/MacOSX10.15.sdk -DHAVE_CONFIG_H -pipe -Os -isysroot/Applications/Xcode.app/Contents/Developer/Platforms/MacOSX.platform/Developer/SDKs/MacOSX10.15.sdk -arch x86_64 -c uuid_str.c -fno-common -DPIC -o .libs/uuid_str.o |
|---|
| 302 | :info:build libtool: compile: /usr/bin/clang -I. -I. -I/opt/local/include -isysroot/Applications/Xcode.app/Contents/Developer/Platforms/MacOSX.platform/Developer/SDKs/MacOSX10.15.sdk -DHAVE_CONFIG_H -pipe -Os -isysroot/Applications/Xcode.app/Contents/Developer/Platforms/MacOSX.platform/Developer/SDKs/MacOSX10.15.sdk -arch x86_64 -c uuid_md5.c -o uuid_md5.o >/dev/null 2>&1 |
|---|
| 303 | :info:build libtool: compile: /usr/bin/clang -I. -I. -I/opt/local/include -isysroot/Applications/Xcode.app/Contents/Developer/Platforms/MacOSX.platform/Developer/SDKs/MacOSX10.15.sdk -DHAVE_CONFIG_H -pipe -Os -isysroot/Applications/Xcode.app/Contents/Developer/Platforms/MacOSX.platform/Developer/SDKs/MacOSX10.15.sdk -arch x86_64 -c uuid_ui64.c -o uuid_ui64.o >/dev/null 2>&1 |
|---|
| 304 | :info:build libtool: compile: /usr/bin/clang -I. -I. -I/opt/local/include -isysroot/Applications/Xcode.app/Contents/Developer/Platforms/MacOSX.platform/Developer/SDKs/MacOSX10.15.sdk -DHAVE_CONFIG_H -pipe -Os -isysroot/Applications/Xcode.app/Contents/Developer/Platforms/MacOSX.platform/Developer/SDKs/MacOSX10.15.sdk -arch x86_64 -c uuid_ui128.c -o uuid_ui128.o >/dev/null 2>&1 |
|---|
| 305 | :info:build 1 warning generated. |
|---|
| 306 | :info:build libtool: compile: /usr/bin/clang -I. -I. -I/opt/local/include -isysroot/Applications/Xcode.app/Contents/Developer/Platforms/MacOSX.platform/Developer/SDKs/MacOSX10.15.sdk -DHAVE_CONFIG_H -pipe -Os -isysroot/Applications/Xcode.app/Contents/Developer/Platforms/MacOSX.platform/Developer/SDKs/MacOSX10.15.sdk -arch x86_64 -c uuid.c -o uuid.o >/dev/null 2>&1 |
|---|
| 307 | :info:build libtool: compile: /usr/bin/clang -I. -I. -I/opt/local/include -isysroot/Applications/Xcode.app/Contents/Developer/Platforms/MacOSX.platform/Developer/SDKs/MacOSX10.15.sdk -DHAVE_CONFIG_H -pipe -Os -isysroot/Applications/Xcode.app/Contents/Developer/Platforms/MacOSX.platform/Developer/SDKs/MacOSX10.15.sdk -arch x86_64 -c uuid_str.c -o uuid_str.o >/dev/null 2>&1 |
|---|
| 308 | :info:build libtool: link: /usr/bin/clang -dynamiclib -Wl,-flat_namespace -Wl,-undefined -Wl,suppress -o .libs/libuuid.16.dylib .libs/uuid.o .libs/uuid_md5.o .libs/uuid_sha1.o .libs/uuid_prng.o .libs/uuid_mac.o .libs/uuid_time.o .libs/uuid_ui64.o .libs/uuid_ui128.o .libs/uuid_str.o -L/opt/local/lib -Wl,-headerpad_max_install_names -Wl,-syslibroot -Wl,/Applications/Xcode.app/Contents/Developer/Platforms/MacOSX.platform/Developer/SDKs/MacOSX10.15.sdk -arch x86_64 -install_name /opt/local/lib/libuuid.16.dylib -compatibility_version 17 -current_version 17.22 -Wl,-single_module |
|---|
| 309 | :info:build libtool: link: dsymutil .libs/libuuid.16.dylib || : |
|---|
| 310 | :info:build warning: no debug symbols in executable (-arch x86_64) |
|---|
| 311 | :info:build libtool: link: (cd ".libs" && rm -f "libuuid.dylib" && ln -s "libuuid.16.dylib" "libuuid.dylib") |
|---|
| 312 | :info:build libtool: link: ar cru .libs/libuuid.a uuid.o uuid_md5.o uuid_sha1.o uuid_prng.o uuid_mac.o uuid_time.o uuid_ui64.o uuid_ui128.o uuid_str.o |
|---|
| 313 | :info:build libtool: link: ranlib .libs/libuuid.a |
|---|
| 314 | :info:build libtool: link: ( cd ".libs" && rm -f "libuuid.la" && ln -s "../libuuid.la" "libuuid.la" ) |
|---|
| 315 | :info:build libtool: link: /usr/bin/clang -Wl,-headerpad_max_install_names -Wl,-syslibroot -Wl,/Applications/Xcode.app/Contents/Developer/Platforms/MacOSX.platform/Developer/SDKs/MacOSX10.15.sdk -arch x86_64 -o .libs/uuid uuid_cli.o -L/opt/local/lib ./.libs/libuuid.dylib |
|---|
| 316 | :info:build Checking if your kit is complete... |
|---|
| 317 | :info:build Looks good |
|---|
| 318 | :info:build Warning: -L../.libs changed to -L/opt/local/var/macports/build/_opt_local_var_macports_sources_rsync.macports.org_release_tarballs_ports_devel_ossp-uuid/ossp-uuid/work/uuid-1.6.2/perl/../.libs |
|---|
| 319 | :info:build Warning: -L.. changed to -L/opt/local/var/macports/build/_opt_local_var_macports_sources_rsync.macports.org_release_tarballs_ports_devel_ossp-uuid/ossp-uuid/work/uuid-1.6.2/perl/.. |
|---|
| 320 | :info:build Generating a Unix-style Makefile |
|---|
| 321 | :info:build Writing Makefile for OSSP::uuid |
|---|
| 322 | :info:build Writing MYMETA.yml and MYMETA.json |
|---|
| 323 | :info:build make[1]: Entering directory `/opt/local/var/macports/build/_opt_local_var_macports_sources_rsync.macports.org_release_tarballs_ports_devel_ossp-uuid/ossp-uuid/work/uuid-1.6.2/perl' |
|---|
| 324 | :info:build "/opt/local/bin/perl5.26" "/opt/local/lib/perl5/5.26/ExtUtils/xsubpp" -typemap '/opt/local/lib/perl5/5.26/ExtUtils/typemap' -typemap '/opt/local/var/macports/build/_opt_local_var_macports_sources_rsync.macports.org_release_tarballs_ports_devel_ossp-uuid/ossp-uuid/work/uuid-1.6.2/perl/uuid.tm' uuid.xs > uuid.xsc |
|---|
| 325 | :info:build Running Mkbootstrap for uuid () |
|---|
| 326 | :info:build chmod 644 "uuid.bs" |
|---|
| 327 | :info:build "/opt/local/bin/perl5.26" -MExtUtils::Command::MM -e 'cp_nonempty' -- uuid.bs blib/arch/auto/OSSP/uuid/uuid.bs 644 |
|---|
| 328 | :info:build cp uuid.pm blib/lib/OSSP/uuid.pm |
|---|
| 329 | :info:build cp uuid.pod blib/lib/OSSP/uuid.pod |
|---|
| 330 | :info:build cp uuid_compat.pm blib/lib/OSSP/../Data/UUID.pm |
|---|
| 331 | :info:build cp uuid_compat.pod blib/lib/OSSP/../Data/UUID.pod |
|---|
| 332 | :info:build mv uuid.xsc uuid.c |
|---|
| 333 | :info:build /usr/bin/clang -c -I. -I.. -fno-common -DPERL_DARWIN -mmacosx-version-min=10.15 -pipe -Os -isysroot/Library/Developer/CommandLineTools/SDKs/MacOSX10.15.sdk -fno-strict-aliasing -fstack-protector-strong -I/opt/local/include -DPERL_USE_SAFE_PUTENV -O3 -DVERSION=\"1.0602\" -DXS_VERSION=\"1.0602\" "-I/opt/local/lib/perl5/5.26/darwin-thread-multi-2level/CORE" uuid.c |
|---|
| 334 | :info:build In file included from uuid.xs:30: |
|---|
| 335 | :info:build ../uuid.h:39:10: fatal error: 'sys/types.h' file not found |
|---|
| 336 | :info:build #include <sys/types.h> |
|---|
| 337 | :info:build ^~~~~~~~~~~~~ |
|---|
| 338 | :info:build 1 error generated. |
|---|
| 339 | :info:build make[1]: *** [uuid.o] Error 1 |
|---|
| 340 | :info:build make[1]: Leaving directory `/opt/local/var/macports/build/_opt_local_var_macports_sources_rsync.macports.org_release_tarballs_ports_devel_ossp-uuid/ossp-uuid/work/uuid-1.6.2/perl' |
|---|
| 341 | :info:build make: *** [perl/blib/lib/OSSP/uuid.pm] Error 2 |
|---|
| 342 | :info:build make: Leaving directory `/opt/local/var/macports/build/_opt_local_var_macports_sources_rsync.macports.org_release_tarballs_ports_devel_ossp-uuid/ossp-uuid/work/uuid-1.6.2' |
|---|
| 343 | :info:build Command failed: cd "/opt/local/var/macports/build/_opt_local_var_macports_sources_rsync.macports.org_release_tarballs_ports_devel_ossp-uuid/ossp-uuid/work/uuid-1.6.2" && /usr/bin/make -j8 -w all |
|---|
| 344 | :info:build Exit code: 2 |
|---|
| 345 | :error:build Failed to build ossp-uuid: command execution failed |
|---|
| 346 | :debug:build Error code: CHILDSTATUS 44241 2 |
|---|
| 347 | :debug:build Backtrace: command execution failed |
|---|
| 348 | :debug:build while executing |
|---|
| 349 | :debug:build "system {*}$notty {*}$nice $fullcmdstring" |
|---|
| 350 | :debug:build invoked from within |
|---|
| 351 | :debug:build "command_exec build" |
|---|
| 352 | :debug:build (procedure "portbuild::build_main" line 8) |
|---|
| 353 | :debug:build invoked from within |
|---|
| 354 | :debug:build "$procedure $targetname" |
|---|
| 355 | :error:build See /opt/local/var/macports/logs/_opt_local_var_macports_sources_rsync.macports.org_release_tarballs_ports_devel_ossp-uuid/ossp-uuid/main.log for details. |
|---|