Ticket #61546: main.log

File main.log, 100.4 KB (added by neilt (Neil Tiffin), 2 years ago)

log file

Line 
1version:1
2:debug:sysinfo macOS 11.0 (darwin/20.1.0) arch i386
3:debug:sysinfo MacPorts 2.6.4
4:debug:sysinfo Xcode 12.2
5:debug:sysinfo SDK 11.0
6:debug:sysinfo MACOSX_DEPLOYMENT_TARGET: 11.0
7:debug:main epoch: in tree: 0 installed: 0
8:debug:main xz 5.2.5_0 exists in the ports tree
9:debug:main xz 5.2.5_0  is the latest installed
10:debug:main xz 5.2.5_0  is active
11:debug:main Merging existing variants '' into variants
12:debug:main new fully merged portvariants:
13:debug:main Changing to port directory: /opt/local/var/macports/sources/rsync.macports.org/macports/release/tarballs/ports/archivers/xz
14:debug:main OS darwin/20.1.0 (macOS 11.0) arch i386
15:debug:main Sourcing PortGroup clang_dependency 1.0 from /opt/local/var/macports/sources/rsync.macports.org/macports/release/tarballs/ports/_resources/port1.0/group/clang_dependency-1.0.tcl
16:debug:main adding the default universal variant
17:debug:main Reading variant descriptions from /opt/local/var/macports/sources/rsync.macports.org/macports/release/tarballs/ports/_resources/port1.0/variant_descriptions.conf
18:debug:main Running callback portconfigure::add_automatic_compiler_dependencies
19:debug:main Finished running callback portconfigure::add_automatic_compiler_dependencies
20:debug:main Running callback portbuild::add_automatic_buildsystem_dependencies
21:debug:main Finished running callback portbuild::add_automatic_buildsystem_dependencies
22:debug:main Running callback portstartupitem::add_notes
23:debug:main Finished running callback portstartupitem::add_notes
24:debug:main No need to upgrade! xz 5.2.5_0 >= xz 5.2.5_0
25:debug:main epoch: in tree: 0 installed: 0
26:debug:main libiconv 1.16_1 exists in the ports tree
27:debug:main libiconv 1.16_1  is the latest installed
28:debug:main libiconv 1.16_1  is active
29:debug:main Merging existing variants '' into variants
30:debug:main new fully merged portvariants:
31:debug:main Changing to port directory: /opt/local/var/macports/sources/rsync.macports.org/macports/release/tarballs/ports/textproc/libiconv
32:debug:main OS darwin/20.1.0 (macOS 11.0) arch i386
33:debug:main Reading variant descriptions from /opt/local/var/macports/sources/rsync.macports.org/macports/release/tarballs/ports/_resources/port1.0/variant_descriptions.conf
34:debug:main Sourcing PortGroup muniversal 1.0 from /opt/local/var/macports/sources/rsync.macports.org/macports/release/tarballs/ports/_resources/port1.0/group/muniversal-1.0.tcl
35:debug:main Sourcing PortGroup clang_dependency 1.0 from /opt/local/var/macports/sources/rsync.macports.org/macports/release/tarballs/ports/_resources/port1.0/group/clang_dependency-1.0.tcl
36:debug:main Sourcing PortGroup xcodeversion 1.0 from /opt/local/var/macports/sources/rsync.macports.org/macports/release/tarballs/ports/_resources/port1.0/group/xcodeversion-1.0.tcl
37:debug:main universal variant already exists, so not adding the default one
38:debug:main Running callback portconfigure::add_automatic_compiler_dependencies
39:debug:main Finished running callback portconfigure::add_automatic_compiler_dependencies
40:debug:main Running callback portbuild::add_automatic_buildsystem_dependencies
41:debug:main Finished running callback portbuild::add_automatic_buildsystem_dependencies
42:debug:main Running callback portstartupitem::add_notes
43:debug:main Finished running callback portstartupitem::add_notes
44:debug:main No need to upgrade! libiconv 1.16_1 >= libiconv 1.16_1
45:debug:main epoch: in tree: 2 installed: 2
46:debug:main gettext 0.19.8.1_2 exists in the ports tree
47:debug:main gettext 0.19.8.1_2  is the latest installed
48:debug:main gettext 0.19.8.1_2  is active
49:debug:main Merging existing variants '' into variants
50:debug:main new fully merged portvariants:
51:debug:main Changing to port directory: /opt/local/var/macports/sources/rsync.macports.org/macports/release/tarballs/ports/devel/gettext
52:debug:main OS darwin/20.1.0 (macOS 11.0) arch i386
53:debug:main Sourcing PortGroup compiler_blacklist_versions 1.0 from /opt/local/var/macports/sources/rsync.macports.org/macports/release/tarballs/ports/_resources/port1.0/group/compiler_blacklist_versions-1.0.tcl
54:debug:main Reading variant descriptions from /opt/local/var/macports/sources/rsync.macports.org/macports/release/tarballs/ports/_resources/port1.0/variant_descriptions.conf
55:debug:main Sourcing PortGroup muniversal 1.0 from /opt/local/var/macports/sources/rsync.macports.org/macports/release/tarballs/ports/_resources/port1.0/group/muniversal-1.0.tcl
56:debug:main Sourcing PortGroup clang_dependency 1.0 from /opt/local/var/macports/sources/rsync.macports.org/macports/release/tarballs/ports/_resources/port1.0/group/clang_dependency-1.0.tcl
57:debug:main compiler clang 1200.0.32.27 not blacklisted because it doesn't match {clang < 211.10.1}
58:debug:main universal variant already exists, so not adding the default one
59:debug:main Running callback portconfigure::add_automatic_compiler_dependencies
60:debug:main Finished running callback portconfigure::add_automatic_compiler_dependencies
61:debug:main Running callback portbuild::add_automatic_buildsystem_dependencies
62:debug:main Finished running callback portbuild::add_automatic_buildsystem_dependencies
63:debug:main Running callback portstartupitem::add_notes
64:debug:main Finished running callback portstartupitem::add_notes
65:debug:main No need to upgrade! gettext 0.19.8.1_2 >= gettext 0.19.8.1_2
66:debug:main epoch: in tree: 0 installed: 0
67:debug:main ncurses 6.2_0 exists in the ports tree
68:debug:main ncurses 6.2_0  is the latest installed
69:debug:main ncurses 6.2_0  is active
70:debug:main Merging existing variants '' into variants
71:debug:main new fully merged portvariants:
72:debug:main Changing to port directory: /opt/local/var/macports/sources/rsync.macports.org/macports/release/tarballs/ports/devel/ncurses
73:debug:main OS darwin/20.1.0 (macOS 11.0) arch i386
74:debug:main Sourcing PortGroup clang_dependency 1.0 from /opt/local/var/macports/sources/rsync.macports.org/macports/release/tarballs/ports/_resources/port1.0/group/clang_dependency-1.0.tcl
75:debug:main adding the default universal variant
76:debug:main Reading variant descriptions from /opt/local/var/macports/sources/rsync.macports.org/macports/release/tarballs/ports/_resources/port1.0/variant_descriptions.conf
77:debug:main Running callback portconfigure::add_automatic_compiler_dependencies
78:debug:main Finished running callback portconfigure::add_automatic_compiler_dependencies
79:debug:main Running callback portbuild::add_automatic_buildsystem_dependencies
80:debug:main Finished running callback portbuild::add_automatic_buildsystem_dependencies
81:debug:main Running callback portstartupitem::add_notes
82:debug:main Finished running callback portstartupitem::add_notes
83:debug:main No need to upgrade! ncurses 6.2_0 >= ncurses 6.2_0
84:debug:main epoch: in tree: 0 installed: 0
85:debug:main avarice 2.13_2 exists in the ports tree
86:debug:main avarice 2.13_2  is the latest installed
87:debug:main avarice 2.13_2  is active
88:debug:main Merging existing variants '' into variants
89:debug:main new fully merged portvariants:
90:debug:main Changing to port directory: /opt/local/var/macports/sources/rsync.macports.org/macports/release/tarballs/ports/cross/avarice
91:debug:main OS darwin/20.1.0 (macOS 11.0) arch i386
92:debug:main adding the default universal variant
93:debug:main Reading variant descriptions from /opt/local/var/macports/sources/rsync.macports.org/macports/release/tarballs/ports/_resources/port1.0/variant_descriptions.conf
94:debug:main Running callback portconfigure::add_automatic_compiler_dependencies
95:debug:main Finished running callback portconfigure::add_automatic_compiler_dependencies
96:debug:main Running callback portbuild::add_automatic_buildsystem_dependencies
97:debug:main Finished running callback portbuild::add_automatic_buildsystem_dependencies
98:debug:main Running callback portstartupitem::add_notes
99:debug:main Finished running callback portstartupitem::add_notes
100:debug:main No need to upgrade! avarice 2.13_2 >= avarice 2.13_2
101:debug:main epoch: in tree: 0 installed: 0
102:debug:main binutils 2.34_0 exists in the ports tree
103:debug:main binutils 2.34_0  is the latest installed
104:debug:main binutils 2.34_0  is active
105:debug:main Merging existing variants '' into variants
106:debug:main new fully merged portvariants:
107:debug:main Changing to port directory: /opt/local/var/macports/sources/rsync.macports.org/macports/release/tarballs/ports/devel/binutils
108:debug:main OS darwin/20.1.0 (macOS 11.0) arch i386
109:debug:main universal_variant is false, so not adding the default universal variant
110:debug:main Running callback portconfigure::add_automatic_compiler_dependencies
111:debug:main Finished running callback portconfigure::add_automatic_compiler_dependencies
112:debug:main Running callback portbuild::add_automatic_buildsystem_dependencies
113:debug:main Finished running callback portbuild::add_automatic_buildsystem_dependencies
114:debug:main Running callback portstartupitem::add_notes
115:debug:main Finished running callback portstartupitem::add_notes
116:debug:main No need to upgrade! binutils 2.34_0 >= binutils 2.34_0
117:debug:main epoch: in tree: 0 installed: 0
118:debug:main zlib 1.2.11_0 exists in the ports tree
119:debug:main zlib 1.2.11_0  is the latest installed
120:debug:main zlib 1.2.11_0  is active
121:debug:main Merging existing variants '' into variants
122:debug:main new fully merged portvariants:
123:debug:main Changing to port directory: /opt/local/var/macports/sources/rsync.macports.org/macports/release/tarballs/ports/archivers/zlib
124:debug:main OS darwin/20.1.0 (macOS 11.0) arch i386
125:debug:main Sourcing PortGroup xcodeversion 1.0 from /opt/local/var/macports/sources/rsync.macports.org/macports/release/tarballs/ports/_resources/port1.0/group/xcodeversion-1.0.tcl
126:debug:main adding the default universal variant
127:debug:main Reading variant descriptions from /opt/local/var/macports/sources/rsync.macports.org/macports/release/tarballs/ports/_resources/port1.0/variant_descriptions.conf
128:debug:main Running callback portconfigure::add_automatic_compiler_dependencies
129:debug:main Finished running callback portconfigure::add_automatic_compiler_dependencies
130:debug:main Running callback portbuild::add_automatic_buildsystem_dependencies
131:debug:main Finished running callback portbuild::add_automatic_buildsystem_dependencies
132:debug:main Running callback portstartupitem::add_notes
133:debug:main Finished running callback portstartupitem::add_notes
134:debug:main No need to upgrade! zlib 1.2.11_0 >= zlib 1.2.11_0
135:debug:main epoch: in tree: 0 installed: 0
136:debug:main libusb-compat 0.1.7_0 exists in the ports tree
137:debug:main libusb-compat 0.1.7_0  is the latest installed
138:debug:main libusb-compat 0.1.7_0  is active
139:debug:main Merging existing variants '' into variants
140:debug:main new fully merged portvariants:
141:debug:main Changing to port directory: /opt/local/var/macports/sources/rsync.macports.org/macports/release/tarballs/ports/devel/libusb-compat
142:debug:main OS darwin/20.1.0 (macOS 11.0) arch i386
143:debug:main Sourcing PortGroup github 1.0 from /opt/local/var/macports/sources/rsync.macports.org/macports/release/tarballs/ports/_resources/port1.0/group/github-1.0.tcl
144:debug:main Re-registering default for livecheck.regex
145:debug:main adding the default universal variant
146:debug:main Reading variant descriptions from /opt/local/var/macports/sources/rsync.macports.org/macports/release/tarballs/ports/_resources/port1.0/variant_descriptions.conf
147:debug:main Running callback portconfigure::add_automatic_compiler_dependencies
148:debug:main Finished running callback portconfigure::add_automatic_compiler_dependencies
149:debug:main Running callback portbuild::add_automatic_buildsystem_dependencies
150:debug:main Finished running callback portbuild::add_automatic_buildsystem_dependencies
151:debug:main Running callback portstartupitem::add_notes
152:debug:main Finished running callback portstartupitem::add_notes
153:debug:main No need to upgrade! libusb-compat 0.1.7_0 >= libusb-compat 0.1.7_0
154:debug:main epoch: in tree: 0 installed: 0
155:debug:main libusb 1.0.23_0 exists in the ports tree
156:debug:main libusb 1.0.23_0  is the latest installed
157:debug:main libusb 1.0.23_0  is active
158:debug:main Merging existing variants '' into variants
159:debug:main new fully merged portvariants:
160:debug:main Changing to port directory: /opt/local/var/macports/sources/rsync.macports.org/macports/release/tarballs/ports/devel/libusb
161:debug:main OS darwin/20.1.0 (macOS 11.0) arch i386
162:debug:main Sourcing PortGroup github 1.0 from /opt/local/var/macports/sources/rsync.macports.org/macports/release/tarballs/ports/_resources/port1.0/group/github-1.0.tcl
163:debug:main Re-registering default for livecheck.regex
164:debug:main adding the default universal variant
165:debug:main Reading variant descriptions from /opt/local/var/macports/sources/rsync.macports.org/macports/release/tarballs/ports/_resources/port1.0/variant_descriptions.conf
166:debug:main Running callback portconfigure::add_automatic_compiler_dependencies
167:debug:main Finished running callback portconfigure::add_automatic_compiler_dependencies
168:debug:main Running callback portbuild::add_automatic_buildsystem_dependencies
169:debug:main Finished running callback portbuild::add_automatic_buildsystem_dependencies
170:debug:main Running callback portstartupitem::add_notes
171:debug:main Finished running callback portstartupitem::add_notes
172:debug:main No need to upgrade! libusb 1.0.23_0 >= libusb 1.0.23_0
173:msg:main --->  Computing dependencies for avr-gdb:info:main .:debug:main avr-gdb has no conflicts
174:debug:main Searching for dependency: xz
175:debug:main Found Dependency: receipt exists for xz
176:debug:main Searching for dependency: avarice
177:debug:main Found Dependency: receipt exists for avarice
178:debug:main Executing org.macports.main (avr-gdb)
179:debug:main dropping privileges: euid changed to 502, egid changed to 501.
180:debug:archivefetch archivefetch phase started at Wed Nov 18 09:35:52 CST 2020
181:msg:archivefetch --->  Fetching archive for avr-gdb
182:debug:archivefetch Executing org.macports.archivefetch (avr-gdb)
183:debug:archivefetch euid/egid changed to: 0/0
184:debug:archivefetch chowned /opt/local/var/macports/incoming to macports
185:debug:archivefetch euid/egid changed to: 502/501
186:info:archivefetch --->  avr-gdb-8.0_0.darwin_20.x86_64.tbz2 doesn't seem to exist in /opt/local/var/macports/incoming/verified
187:msg:archivefetch --->  Attempting to fetch avr-gdb-8.0_0.darwin_20.x86_64.tbz2 from https://packages.macports.org/avr-gdb
188:debug:archivefetch Fetching archive failed: The requested URL returned error: 404
189:msg:archivefetch --->  Attempting to fetch avr-gdb-8.0_0.darwin_20.x86_64.tbz2 from https://ywg.ca.packages.macports.org/mirror/macports/packages/avr-gdb/avr-gdb
190:debug:archivefetch Fetching archive failed: The requested URL returned error: 404 Not Found
191:msg:archivefetch --->  Attempting to fetch avr-gdb-8.0_0.darwin_20.x86_64.tbz2 from https://mse.uk.packages.macports.org/avr-gdb
192:debug:archivefetch Fetching archive failed: The requested URL returned error: 404 Not Found
193:debug:archivefetch Privilege de-escalation not attempted as not running as root.
194:debug:fetch fetch phase started at Wed Nov 18 09:35:54 CST 2020
195:notice:fetch --->  Fetching distfiles for avr-gdb
196:debug:fetch Executing org.macports.fetch (avr-gdb)
197:debug:fetch Privilege de-escalation not attempted as not running as root.
198:debug:checksum checksum phase started at Wed Nov 18 09:35:54 CST 2020
199:notice:checksum --->  Verifying checksums for avr-gdb
200:debug:checksum Executing org.macports.checksum (avr-gdb)
201:info:checksum --->  Checksumming gdb-8.0.tar.xz
202:debug:checksum Calculated (rmd160) is 2d218e845614b7a0fb0777273309e8ad1b7bbcba
203:debug:checksum Correct (rmd160) checksum for gdb-8.0.tar.xz
204:debug:checksum Calculated (sha256) is f6a24ffe4917e67014ef9273eb8b547cb96a13e5ca74895b06d683b391f3f4ee
205:debug:checksum Correct (sha256) checksum for gdb-8.0.tar.xz
206:debug:checksum Privilege de-escalation not attempted as not running as root.
207:debug:extract extract phase started at Wed Nov 18 09:35:54 CST 2020
208:notice:extract --->  Extracting avr-gdb
209:debug:extract setting option extract.cmd to /opt/local/bin/xz
210:debug:extract Executing org.macports.extract (avr-gdb)
211:info:extract --->  Extracting gdb-8.0.tar.xz
212:debug:extract setting option extract.args to '/opt/local/var/macports/distfiles/avr-gdb/gdb-8.0.tar.xz'
213:debug:extract Environment:
214:debug:extract CC_PRINT_OPTIONS='YES'
215:debug:extract CC_PRINT_OPTIONS_FILE='/opt/local/var/macports/build/_opt_local_var_macports_sources_rsync.macports.org_macports_release_tarballs_ports_cross_avr-gdb/avr-gdb/work/.CC_PRINT_OPTIONS'
216:debug:extract CPATH='/opt/local/include'
217:debug:extract DEVELOPER_DIR='/Library/Developer/CommandLineTools'
218:debug:extract LIBRARY_PATH='/opt/local/lib'
219:debug:extract MACOSX_DEPLOYMENT_TARGET='11.0'
220:debug:extract SDKROOT='/Library/Developer/CommandLineTools/SDKs/MacOSX11.0.sdk'
221:info:extract Executing:  cd "/opt/local/var/macports/build/_opt_local_var_macports_sources_rsync.macports.org_macports_release_tarballs_ports_cross_avr-gdb/avr-gdb/work" && /opt/local/bin/xz -dc '/opt/local/var/macports/distfiles/avr-gdb/gdb-8.0.tar.xz' | /usr/bin/tar -xf -
222:debug:extract system:  cd "/opt/local/var/macports/build/_opt_local_var_macports_sources_rsync.macports.org_macports_release_tarballs_ports_cross_avr-gdb/avr-gdb/work" && /opt/local/bin/xz -dc '/opt/local/var/macports/distfiles/avr-gdb/gdb-8.0.tar.xz' | /usr/bin/tar -xf -
223:debug:extract euid/egid changed to: 0/0
224:debug:extract chowned /opt/local/var/macports/build/_opt_local_var_macports_sources_rsync.macports.org_macports_release_tarballs_ports_cross_avr-gdb/avr-gdb/work to macports
225:debug:extract euid/egid changed to: 502/501
226:debug:extract Privilege de-escalation not attempted as not running as root.
227:debug:patch patch phase started at Wed Nov 18 09:35:57 CST 2020
228:debug:patch Executing org.macports.patch (avr-gdb)
229:debug:patch Privilege de-escalation not attempted as not running as root.
230:debug:configure configure phase started at Wed Nov 18 09:35:57 CST 2020
231:notice:configure --->  Configuring avr-gdb
232:debug:configure Preferred compilers: clang macports-clang-9.0 macports-clang-8.0 macports-clang-7.0 macports-clang-6.0 macports-clang-5.0
233:debug:configure Using compiler 'Xcode Clang'
234:debug:configure Executing org.macports.configure (avr-gdb)
235:debug:configure Environment:
236:debug:configure CC='/usr/bin/clang'
237:debug:configure CC_PRINT_OPTIONS='YES'
238:debug:configure CC_PRINT_OPTIONS_FILE='/opt/local/var/macports/build/_opt_local_var_macports_sources_rsync.macports.org_macports_release_tarballs_ports_cross_avr-gdb/avr-gdb/work/.CC_PRINT_OPTIONS'
239:debug:configure CFLAGS='-pipe -Os -isysroot/Library/Developer/CommandLineTools/SDKs/MacOSX11.0.sdk -arch x86_64'
240:debug:configure CPATH='/opt/local/include'
241:debug:configure CPPFLAGS='-I/opt/local/include -isysroot/Library/Developer/CommandLineTools/SDKs/MacOSX11.0.sdk'
242:debug:configure CXX='/usr/bin/clang++'
243:debug:configure CXXFLAGS='-pipe -Os -stdlib=libc++ -isysroot/Library/Developer/CommandLineTools/SDKs/MacOSX11.0.sdk -arch x86_64'
244:debug:configure DEVELOPER_DIR='/Library/Developer/CommandLineTools'
245:debug:configure F90FLAGS='-pipe -Os -m64'
246:debug:configure FCFLAGS='-pipe -Os -m64'
247:debug:configure FFLAGS='-pipe -Os -m64'
248:debug:configure INSTALL='/usr/bin/install -c'
249:debug:configure LDFLAGS='-L/opt/local/lib -Wl,-headerpad_max_install_names -Wl,-syslibroot,/Library/Developer/CommandLineTools/SDKs/MacOSX11.0.sdk -arch x86_64'
250:debug:configure LIBRARY_PATH='/opt/local/lib'
251:debug:configure MACOSX_DEPLOYMENT_TARGET='11.0'
252:debug:configure OBJC='/usr/bin/clang'
253:debug:configure OBJCFLAGS='-pipe -Os -isysroot/Library/Developer/CommandLineTools/SDKs/MacOSX11.0.sdk -arch x86_64'
254:debug:configure OBJCXX='/usr/bin/clang++'
255:debug:configure OBJCXXFLAGS='-pipe -Os -stdlib=libc++ -isysroot/Library/Developer/CommandLineTools/SDKs/MacOSX11.0.sdk -arch x86_64'
256:debug:configure SDKROOT='/Library/Developer/CommandLineTools/SDKs/MacOSX11.0.sdk'
257:info:configure Executing:  cd "/opt/local/var/macports/build/_opt_local_var_macports_sources_rsync.macports.org_macports_release_tarballs_ports_cross_avr-gdb/avr-gdb/work/gdb-8.0" && ./configure --prefix=/opt/local --mandir=/opt/local/share/man --infodir=/opt/local/share/info --disable-werror --target=avr
258:debug:configure system:  cd "/opt/local/var/macports/build/_opt_local_var_macports_sources_rsync.macports.org_macports_release_tarballs_ports_cross_avr-gdb/avr-gdb/work/gdb-8.0" && ./configure --prefix=/opt/local --mandir=/opt/local/share/man --infodir=/opt/local/share/info --disable-werror --target=avr
259:info:configure checking build system type... x86_64-apple-darwin20.1.0
260:info:configure checking host system type... x86_64-apple-darwin20.1.0
261:info:configure checking target system type... avr-unknown-none
262:info:configure checking for a BSD-compatible install... /usr/bin/install -c
263:info:configure checking whether ln works... yes
264:info:configure checking whether ln -s works... yes
265:info:configure checking for a sed that does not truncate output... /opt/local/bin/gsed
266:info:configure checking for gawk... gawk
267:info:configure checking for gcc... /usr/bin/clang
268:info:configure checking for C compiler default output file name... a.out
269:info:configure checking whether the C compiler works... yes
270:info:configure checking whether we are cross compiling... no
271:info:configure checking for suffix of executables...
272:info:configure checking for suffix of object files... o
273:info:configure checking whether we are using the GNU C compiler... yes
274:info:configure checking whether /usr/bin/clang accepts -g... yes
275:info:configure checking for /usr/bin/clang option to accept ISO C89... none needed
276:info:configure checking whether we are using the GNU C++ compiler... yes
277:info:configure checking whether /usr/bin/clang++ accepts -g... yes
278:info:configure checking whether g++ accepts -static-libstdc++ -static-libgcc... no
279:info:configure checking for gnatbind... no
280:info:configure checking for gnatmake... no
281:info:configure checking whether compiler driver understands Ada... no
282:info:configure checking how to compare bootstrapped objects... cmp --ignore-initial=16 $$f1 $$f2
283:info:configure checking for objdir... .libs
284:info:configure checking for isl 0.16, 0.15, or deprecated 0.14... yes
285:info:configure checking for isl 0.16 or 0.15... yes
286:info:configure checking for default BUILD_CONFIG...
287:info:configure checking for --enable-vtable-verify... no
288:info:configure checking for bison... bison -y
289:info:configure checking for bison... bison
290:info:configure checking for gm4... gm4
291:info:configure checking for flex... flex
292:info:configure checking for flex... flex
293:info:configure checking for makeinfo... makeinfo
294:info:configure makeinfo: warning: error loading ./Config: Can't locate ./Config at /opt/local/bin/makeinfo line 345.
295:info:configure checking for expect... expect
296:info:configure checking for runtest... no
297:info:configure checking for ar... ar
298:info:configure checking for as... as
299:info:configure checking for dlltool... no
300:info:configure checking for ld... (cached) /Library/Developer/CommandLineTools/usr/bin/ld
301:info:configure checking for lipo... lipo
302:info:configure checking for nm... nm
303:info:configure checking for ranlib... ranlib
304:info:configure checking for strip... strip
305:info:configure checking for windres... no
306:info:configure checking for windmc... no
307:info:configure checking for objcopy... no
308:info:configure checking for objdump... objdump
309:info:configure checking for readelf... no
310:info:configure checking for avr-cc... no
311:info:configure checking for avr-gcc... no
312:info:configure checking for avr-c++... no
313:info:configure checking for avr-g++... no
314:info:configure checking for avr-cxx... no
315:info:configure checking for avr-gxx... no
316:info:configure checking for avr-gcc... no
317:info:configure checking for avr-gfortran... no
318:info:configure checking for avr-gccgo... no
319:info:configure checking for avr-ar... no
320:info:configure checking for avr-as... no
321:info:configure checking for avr-dlltool... no
322:info:configure checking for avr-ld... no
323:info:configure checking for avr-lipo... no
324:info:configure checking for avr-nm... no
325:info:configure checking for avr-objcopy... no
326:info:configure checking for avr-objdump... no
327:info:configure checking for avr-ranlib... no
328:info:configure checking for avr-readelf... no
329:info:configure checking for avr-strip... no
330:info:configure checking for avr-windres... no
331:info:configure checking for avr-windmc... no
332:info:configure checking where to find the target ar... pre-installed
333:info:configure checking where to find the target as... pre-installed
334:info:configure checking where to find the target cc... pre-installed
335:info:configure checking where to find the target c++... pre-installed
336:info:configure checking where to find the target c++ for libstdc++... pre-installed
337:info:configure checking where to find the target dlltool... pre-installed
338:info:configure checking where to find the target gcc... pre-installed
339:info:configure checking where to find the target gfortran... pre-installed
340:info:configure checking where to find the target gccgo... pre-installed
341:info:configure checking where to find the target ld... pre-installed
342:info:configure checking where to find the target lipo... pre-installed
343:info:configure checking where to find the target nm... pre-installed
344:info:configure checking where to find the target objcopy... pre-installed
345:info:configure checking where to find the target objdump... pre-installed
346:info:configure checking where to find the target ranlib... pre-installed
347:info:configure checking where to find the target readelf... pre-installed
348:info:configure checking where to find the target strip... pre-installed
349:info:configure checking where to find the target windres... pre-installed
350:info:configure checking where to find the target windmc... pre-installed
351:info:configure checking whether to enable maintainer-specific portions of Makefiles... no
352:info:configure configure: creating ./config.status
353:info:configure config.status: creating Makefile
354:debug:configure Privilege de-escalation not attempted as not running as root.
355:debug:build build phase started at Wed Nov 18 09:35:59 CST 2020
356:notice:build --->  Building avr-gdb
357:debug:build Executing org.macports.build (avr-gdb)
358:debug:build Environment:
359:debug:build CC_PRINT_OPTIONS='YES'
360:debug:build CC_PRINT_OPTIONS_FILE='/opt/local/var/macports/build/_opt_local_var_macports_sources_rsync.macports.org_macports_release_tarballs_ports_cross_avr-gdb/avr-gdb/work/.CC_PRINT_OPTIONS'
361:debug:build CPATH='/opt/local/include'
362:debug:build DEVELOPER_DIR='/Library/Developer/CommandLineTools'
363:debug:build LIBRARY_PATH='/opt/local/lib'
364:debug:build MACOSX_DEPLOYMENT_TARGET='11.0'
365:debug:build SDKROOT='/Library/Developer/CommandLineTools/SDKs/MacOSX11.0.sdk'
366:info:build Executing:  cd "/opt/local/var/macports/build/_opt_local_var_macports_sources_rsync.macports.org_macports_release_tarballs_ports_cross_avr-gdb/avr-gdb/work/gdb-8.0" && /usr/bin/make -j8 -w all
367:debug:build system:  cd "/opt/local/var/macports/build/_opt_local_var_macports_sources_rsync.macports.org_macports_release_tarballs_ports_cross_avr-gdb/avr-gdb/work/gdb-8.0" && /usr/bin/make -j8 -w all
368:info:build make: Entering directory `/opt/local/var/macports/build/_opt_local_var_macports_sources_rsync.macports.org_macports_release_tarballs_ports_cross_avr-gdb/avr-gdb/work/gdb-8.0'
369:info:build make[1]: Entering directory `/opt/local/var/macports/build/_opt_local_var_macports_sources_rsync.macports.org_macports_release_tarballs_ports_cross_avr-gdb/avr-gdb/work/gdb-8.0'
370:info:build make[1]: Nothing to be done for `all-target'.
371:info:build Configuring in ./libiberty
372:info:build Configuring in ./zlib
373:info:build Configuring in ./intl
374:info:build Configuring in ./libdecnumber
375:info:build Configuring in ./readline
376:info:build Configuring in ./etc
377:info:build configure: creating cache ./config.cache
378:info:build configure: creating cache ./config.cache
379:info:build configure: creating cache ./config.cache
380:info:build configure: creating cache ./config.cache
381:info:build configure: creating cache ./config.cache
382:info:build checking for a BSD-compatible install... /usr/bin/install -c
383:info:build checking whether /Library/Developer/CommandLineTools/usr/bin/make sets $(MAKE)... checking whether /Library/Developer/CommandLineTools/usr/bin/make sets $(MAKE)... configure: creating cache ./config.cache
384:info:build checking whether to enable maintainer-specific portions of Makefiles... no
385:info:build checking for makeinfo... makeinfo --split-size=5000000
386:info:build yes
387:info:build yes
388:info:build checking for x86_64-apple-darwin20.1.0-gcc... /usr/bin/clang
389:info:build checking for a BSD-compatible install... /usr/bin/install -c
390:info:build checking whether NLS is requested... yes
391:info:build checking build system type... checking for msgfmt... checking build system type... configure: updating cache ./config.cache
392:info:build configure: creating ./config.status
393:info:build x86_64-apple-darwin20.1.0
394:info:build checking host system type... x86_64-apple-darwin20.1.0
395:info:build checking host system type... /opt/local/bin/msgfmt
396:info:build checking for gmsgfmt... /opt/local/bin/msgfmt
397:info:build checking for xgettext... x86_64-apple-darwin20.1.0
398:info:build checking target system type... x86_64-apple-darwin20.1.0
399:info:build Beginning configuration for readline-6.2 for x86_64-apple-darwin20.1.0
400:info:build checking whether /Library/Developer/CommandLineTools/usr/bin/make sets $(MAKE)... avr-unknown-none
401:info:build yes
402:info:build checking for x86_64-apple-darwin20.1.0-gcc... /usr/bin/clang
403:info:build checking for a BSD-compatible install... /usr/bin/install -c
404:info:build checking whether build environment is sane... /opt/local/bin/xgettext
405:info:build checking for msgmerge... /opt/local/bin/msgmerge
406:info:build checking for C compiler default output file name... checking for x86_64-apple-darwin20.1.0-gcc... /usr/bin/clang
407:info:build checking for C compiler default output file name... makeinfo: warning: error loading ./Config: Can't locate ./Config at /opt/local/bin/makeinfo line 345.
408:info:build checking for perl... perl
409:info:build checking build system type... a.out
410:info:build checking whether the C compiler works... config.status: creating Makefile
411:info:build x86_64-apple-darwin20.1.0
412:info:build checking host system type... x86_64-apple-darwin20.1.0
413:info:build checking for x86_64-apple-darwin20.1.0-ar... ar
414:info:build checking for x86_64-apple-darwin20.1.0-ranlib... ranlib
415:info:build checking whether to install libiberty headers and static library... no
416:info:build configure: target_header_dir =
417:info:build checking for x86_64-apple-darwin20.1.0-gcc... /usr/bin/clang
418:info:build checking for C compiler default output file name... a.out
419:info:build checking whether the C compiler works... yes
420:info:build checking whether we are cross compiling... no
421:info:build checking for suffix of executables... make[2]: Entering directory `/opt/local/var/macports/build/_opt_local_var_macports_sources_rsync.macports.org_macports_release_tarballs_ports_cross_avr-gdb/avr-gdb/work/gdb-8.0/etc'
422:info:build make[2]: Nothing to be done for `all'.
423:info:build make[2]: Leaving directory `/opt/local/var/macports/build/_opt_local_var_macports_sources_rsync.macports.org_macports_release_tarballs_ports_cross_avr-gdb/avr-gdb/work/gdb-8.0/etc'
424:info:build a.out
425:info:build checking whether the C compiler works... yes
426:info:build checking whether we are cross compiling... no
427:info:build checking for suffix of executables...
428:info:build checking for suffix of object files... yes
429:info:build checking whether we are cross compiling... no
430:info:build checking for suffix of executables... checking for C compiler default output file name... o
431:info:build checking whether we are using the GNU C compiler...
432:info:build checking for suffix of object files... yes
433:info:build checking whether /usr/bin/clang accepts -g...
434:info:build checking for suffix of object files... o
435:info:build checking whether we are using the GNU C compiler... yes
436:info:build checking for /usr/bin/clang option to accept ISO C89... a.out
437:info:build checking whether the C compiler works... o
438:info:build checking whether we are using the GNU C compiler... yes
439:info:build checking whether /usr/bin/clang accepts -g... yes
440:info:build checking whether we are cross compiling... no
441:info:build checking for suffix of executables... none needed
442:info:build checking for x86_64-apple-darwin20.1.0-ranlib... ranlib
443:info:build checking for aclocal... aclocal
444:info:build checking for autoconf... autoconf
445:info:build checking for autoheader... autoheader
446:info:build yes
447:info:build yes
448:info:build checking whether /usr/bin/clang accepts -g... checking for /usr/bin/clang option to accept ISO C89... checking whether /usr/bin/clang supports -W... yes
449:info:build yes
450:info:build checking for /usr/bin/clang option to accept ISO C89... checking whether /usr/bin/clang supports -Wall...
451:info:build checking for suffix of object files... none needed
452:info:build checking how to run the C preprocessor... yes
453:info:build checking whether /usr/bin/clang supports -Wwrite-strings... o
454:info:build none needed
455:info:build checking whether we are using the GNU C compiler... checking build system type... yes
456:info:build checking whether /usr/bin/clang supports -Wstrict-prototypes... /usr/bin/clang -E
457:info:build x86_64-apple-darwin20.1.0
458:info:build checking host system type... yes
459:info:build checking whether /usr/bin/clang accepts -g... x86_64-apple-darwin20.1.0
460:info:build checking for x86_64-apple-darwin20.1.0-ranlib... ranlib
461:info:build checking for library containing strerror... yes
462:info:build checking whether /usr/bin/clang supports -Wmissing-prototypes... yes
463:info:build checking for /usr/bin/clang option to accept ISO C89... yes
464:info:build checking for grep that handles long lines and -e... checking whether /usr/bin/clang supports -Wold-style-definition... /opt/local/bin/ggrep
465:info:build checking for egrep... /opt/local/bin/ggrep -E
466:info:build checking for ANSI C header files... none needed
467:info:build checking how to run the C preprocessor... yes
468:info:build checking whether /usr/bin/clang supports -Wmissing-format-attribute... none required
469:info:build checking how to run the C preprocessor... yes
470:info:build checking whether /usr/bin/clang supports -Wcast-qual... /usr/bin/clang -E
471:info:build /usr/bin/clang -E
472:info:build yes
473:info:build checking whether /usr/bin/clang supports -pedantic -Wlong-long... yes
474:info:build checking how to run the C preprocessor... checking for grep that handles long lines and -e... /opt/local/bin/ggrep
475:info:build checking for egrep... checking for grep that handles long lines and -e... /opt/local/bin/ggrep -E
476:info:build checking for ANSI C header files... /opt/local/bin/ggrep
477:info:build checking for egrep... /opt/local/bin/ggrep -E
478:info:build checking for ANSI C header files... /usr/bin/clang -E
479:info:build checking for grep that handles long lines and -e... /opt/local/bin/ggrep
480:info:build checking for egrep... /opt/local/bin/ggrep -E
481:info:build checking for ANSI C header files... yes
482:info:build checking for sys/types.h... yes
483:info:build checking for sys/stat.h... yes
484:info:build checking for a thread-safe mkdir -p... /opt/local/bin/gmkdir -p
485:info:build yes
486:info:build checking for gawk... gawk
487:info:build checking whether /Library/Developer/CommandLineTools/usr/bin/make sets $(MAKE)... checking for stdlib.h... yes
488:info:build checking whether to enable maintainer-specific portions of Makefiles... no
489:info:build checking for x86_64-apple-darwin20.1.0-gcc... /usr/bin/clang
490:info:build yes
491:info:build checking for sys/types.h... yes
492:info:build checking for string.h... yes
493:info:build yes
494:info:build checking for an ANSI C-conforming const... checking for sys/stat.h... yes
495:info:build checking for memory.h... yes
496:info:build checking for inline... yes
497:info:build yes
498:info:build checking for sys/types.h... inline
499:info:build checking for stdlib.h... checking for C compiler default output file name... checking for sys/types.h... yes
500:info:build checking for strings.h... yes
501:info:build yes
502:info:build checking for sys/stat.h... yes
503:info:build checking for string.h... checking for sys/stat.h... yes
504:info:build a.out
505:info:build checking whether the C compiler works... checking for inttypes.h... yes
506:info:build yes
507:info:build checking for stdlib.h... yes
508:info:build checking for memory.h... checking for stdlib.h... yes
509:info:build checking whether we are cross compiling... no
510:info:build checking for suffix of executables... yes
511:info:build checking for stdint.h... yes
512:info:build checking for string.h... yes
513:info:build yes
514:info:build checking for strings.h... checking for string.h... yes
515:info:build checking for suffix of object files... checking for unistd.h... yes
516:info:build checking for memory.h... yes
517:info:build yes
518:info:build o
519:info:build checking whether we are using the GNU C compiler... checking for inttypes.h... checking for memory.h... yes
520:info:build checking minix/config.h usability... yes
521:info:build checking whether /usr/bin/clang accepts -g... yes
522:info:build yes
523:info:build yes
524:info:build checking for strings.h... checking for stdint.h... checking for strings.h... yes
525:info:build checking for /usr/bin/clang option to accept ISO C89... no
526:info:build checking minix/config.h presence... yes
527:info:build yes
528:info:build yes
529:info:build checking for inttypes.h... none needed
530:info:build checking for style of include used by /Library/Developer/CommandLineTools/usr/bin/make... no
531:info:build checking for minix/config.h... no
532:info:build checking whether it is safe to define __EXTENSIONS__... checking for unistd.h... checking for inttypes.h... GNU
533:info:build checking dependency style of /usr/bin/clang... yes
534:info:build yes
535:info:build yes
536:info:build checking for stdint.h... yes
537:info:build checking minix/config.h usability... checking whether /usr/bin/clang needs -traditional... checking for stdint.h... gcc3
538:info:build checking how to print strings... printf
539:info:build checking for a sed that does not truncate output... /opt/local/bin/gsed
540:info:build checking for grep that handles long lines and -e... /opt/local/bin/ggrep
541:info:build checking for egrep... yes
542:info:build /opt/local/bin/ggrep -E
543:info:build checking for fgrep... no
544:info:build checking minix/config.h presence... yes
545:info:build checking for unistd.h... no
546:info:build checking for a BSD-compatible install... /usr/bin/install -c
547:info:build checking for ar... ar
548:info:build checking for x86_64-apple-darwin20.1.0-ranlib... ranlib
549:info:build checking for an ANSI C-conforming const... /opt/local/bin/ggrep -F
550:info:build checking for ld used by /usr/bin/clang... checking for unistd.h... no
551:info:build checking for minix/config.h... no
552:info:build checking whether it is safe to define __EXTENSIONS__... /Library/Developer/CommandLineTools/usr/bin/ld
553:info:build checking if the linker (/Library/Developer/CommandLineTools/usr/bin/ld) is GNU ld... yes
554:info:build checking for function prototypes... yes
555:info:build checking whether char is unsigned... no
556:info:build checking for BSD- or MS-compatible name lister (nm)... nm
557:info:build checking the name lister (nm) interface... yes
558:info:build yes
559:info:build checking ctype.h usability... checking for off_t... yes
560:info:build checking for special C compiler options needed for large files... no
561:info:build checking for _FILE_OFFSET_BITS value needed for large files... no
562:info:build checking for working volatile... yes
563:info:build checking ctype.h presence... BSD nm
564:info:build checking whether ln -s works... yes
565:info:build checking the maximum length of command line arguments... 786432
566:info:build checking whether the shell understands some XSI constructs... yes
567:info:build checking whether the shell understands "+="... yes
568:info:build no
569:info:build yes
570:info:build checking return type of signal handlers... checking for /Library/Developer/CommandLineTools/usr/bin/ld option to reload object files... -r
571:info:build checking for x86_64-apple-darwin20.1.0-objdump... objdump
572:info:build checking how to recognize dependent libraries... pass_all
573:info:build checking for x86_64-apple-darwin20.1.0-ar... ar
574:info:build checking for x86_64-apple-darwin20.1.0-strip... no
575:info:build checking for strip... strip
576:info:build checking for x86_64-apple-darwin20.1.0-ranlib... ranlib
577:info:build checking command to parse nm output from /usr/bin/clang object... checking whether /usr/bin/clang supports -W... yes
578:info:build checking for ctype.h... yes
579:info:build checking stddef.h usability... yes
580:info:build checking whether /usr/bin/clang supports -Wall... yes
581:info:build checking for size_t... void
582:info:build checking for size_t... yes
583:info:build yes
584:info:build checking stddef.h presence... checking whether /usr/bin/clang supports -Wwrite-strings... yes
585:info:build checking for stddef.h... yes
586:info:build yes
587:info:build checking for string.h... (cached) yes
588:info:build checking whether /usr/bin/clang supports -Wc++-compat... checking stdio.h usability... yes
589:info:build checking whether /usr/bin/clang supports -Wstrict-prototypes... yes
590:info:build checking for working alloca.h... yes
591:info:build checking for ssize_t... yes
592:info:build checking stdio.h presence... yes
593:info:build checking whether /usr/bin/clang supports -Wshadow=local... yes
594:info:build checking for stdio.h... yes
595:info:build looking for a compliant stdint.h in stdint.h, checking for uintmax_t... yes
596:info:build checking whether /usr/bin/clang supports -pedantic ... yes
597:info:build checking for alloca... yes
598:info:build checking whether /usr/bin/clang and cc understand -c and -o together... ok
599:info:build yes
600:info:build checking for x86_64-apple-darwin20.1.0-dsymutil... checking for ANSI C header files... (cached) yes
601:info:build no
602:info:build checking whether stat file-mode macros are broken... checking for dsymutil... dsymutil
603:info:build checking for x86_64-apple-darwin20.1.0-nmedit... no
604:info:build checking for nmedit... nmedit
605:info:build checking for x86_64-apple-darwin20.1.0-lipo... no
606:info:build checking for lipo... lipo
607:info:build checking for x86_64-apple-darwin20.1.0-otool... no
608:info:build checking for otool... otool
609:info:build checking for x86_64-apple-darwin20.1.0-otool64... no
610:info:build checking for otool64... no
611:info:build checking for -single_module linker flag... yes
612:info:build checking for uintptr_t... yes
613:info:build checking for stdlib.h... (cached) yes
614:info:build no
615:info:build checking for dirent.h that defines DIR... checking for unistd.h... (cached) yes
616:info:build checking for getpagesize... yes
617:info:build checking for -exported_symbols_list linker flag... yes
618:info:build checking for library containing opendir... yes
619:info:build checking for an ANSI C-conforming const... yes
620:info:build checking for int_least32_t... yes
621:info:build checking for working mmap... yes
622:info:build checking for -force_load linker flag... yes
623:info:build checking for inline... none required
624:info:build checking for fcntl... inline
625:info:build checking whether byte ordering is bigendian... yes
626:info:build checking for int_fast32_t... yes
627:info:build checking for kill... yes
628:info:build checking how to run the C preprocessor... yes
629:info:build checking for uint64_t... yes
630:info:build no
631:info:build checking for a BSD-compatible install... /usr/bin/install -c
632:info:build checking whether we are using the GNU C Library 2.1 or newer... checking for sys/file.h... yes
633:info:build /usr/bin/clang -E
634:info:build no
635:info:build checking whether integer division by zero raises SIGFPE... checking for lstat... yes
636:info:build checking for sys/param.h... no
637:info:build checking for inttypes.h... yes
638:info:build checking what to include in gstdint.h... stdint.h (already complete)
639:info:build checking for an ANSI C-conforming const... checking for ANSI C header files... yes
640:info:build checking for limits.h... yes
641:info:build yes
642:info:build checking for off_t... yes
643:info:build checking for stdint.h... checking for memmove... yes
644:info:build checking for stdlib.h... (cached) yes
645:info:build checking for malloc.h... yes
646:info:build checking for unsigned long long... no
647:info:build checking for string.h... (cached) yes
648:info:build checking for unistd.h... (cached) yes
649:info:build yes
650:info:build checking for strings.h... (cached) yes
651:info:build checking for putenv... checking for sys/time.h... yes
652:info:build checking size of int... yes
653:info:build checking for inttypes.h... yes
654:info:build checking for time.h... yes
655:info:build yes
656:info:build checking whether the inttypes.h PRIxNN macros are broken... yes
657:info:build checking for select... checking for sys/resource.h... no
658:info:build checking for ld used by GCC... yes
659:info:build checking for sys/stat.h... (cached) yes
660:info:build /Library/Developer/CommandLineTools/usr/bin/ld
661:info:build checking if the linker (/Library/Developer/CommandLineTools/usr/bin/ld) is GNU ld... checking for sys/mman.h... no
662:info:build checking for shared library run path origin... yes
663:info:build checking for sys/types.h... yes
664:info:build checking for setenv... yes
665:info:build done
666:info:build checking for fcntl.h... checking argz.h usability... yes
667:info:build 4
668:info:build yes
669:info:build checking size of long... checking for sys/stat.h... checking for alloca.h... yes
670:info:build no
671:info:build checking argz.h presence... yes
672:info:build checking for setlocale... checking for sys/pstat.h... yes
673:info:build checking for stdlib.h... no
674:info:build checking for argz.h... no
675:info:build checking limits.h usability... no
676:info:build checking for sys/sysmp.h... yes
677:info:build yes
678:info:build checking for string.h... no
679:info:build checking for strcasecmp... yes
680:info:build checking limits.h presence... checking for sys/sysinfo.h... yes
681:info:build checking for limits.h... yes
682:info:build no
683:info:build checking locale.h usability... checking for machine/hal_sysinfo.h... yes
684:info:build 8
685:info:build checking for ANSI C header files... (cached) yes
686:info:build checking for memory.h... checking build system type... no
687:info:build checking for sys/table.h... x86_64-apple-darwin20.1.0
688:info:build checking host system type... yes
689:info:build checking for strpbrk... yes
690:info:build checking locale.h presence... x86_64-apple-darwin20.1.0
691:info:build checking target system type... yes
692:info:build no
693:info:build avr-unknown-none
694:info:build checking for strings.h... checking for decimal floating point... configure: WARNING: decimal float is not supported for this target, ignored
695:info:build dpd
696:info:build checking whether byte ordering is bigendian... checking for sys/sysctl.h... yes
697:info:build checking for locale.h... yes
698:info:build checking nl_types.h usability... yes
699:info:build yes
700:info:build checking for sys/systemcfg.h... yes
701:info:build checking for inttypes.h... yes
702:info:build checking for tcgetattr... checking nl_types.h presence... no
703:info:build checking for stdint.h... (cached) yes
704:info:build yes
705:info:build checking for nl_types.h... yes
706:info:build checking for stdio_ext.h... yes
707:info:build checking malloc.h usability... checking for stdint.h... no
708:info:build no
709:info:build checking for process.h... yes
710:info:build configure: updating cache ./config.cache
711:info:build checking for vsnprintf... configure: creating ./config.status
712:info:build yes
713:info:build no
714:info:build checking malloc.h presence... no
715:info:build checking for unistd.h... checking for sys/prctl.h... no
716:info:build checking for malloc.h... no
717:info:build checking stddef.h usability... no
718:info:build checking for sys/wait.h that is POSIX.1 compatible... yes
719:info:build checking for dlfcn.h... yes
720:info:build checking for isascii... yes
721:info:build checking stddef.h presence... yes
722:info:build checking whether time.h and sys/time.h may both be included... yes
723:info:build checking for stddef.h... yes
724:info:build yes
725:info:build checking for objdir... checking for stdlib.h... (cached) yes
726:info:build .libs
727:info:build checking for string.h... (cached) yes
728:info:build yes
729:info:build config.status: creating Makefile
730:info:build checking whether errno must be declared... checking for unistd.h... (cached) yes
731:info:build checking sys/param.h usability... yes
732:info:build config.status: creating config.h
733:info:build checking for isxdigit... no
734:info:build checking size of int... config.status: executing gstdint.h commands
735:info:build yes
736:info:build checking sys/param.h presence... yes
737:info:build checking for sys/param.h... yes
738:info:build checking if /usr/bin/clang supports -fno-rtti -fno-exceptions... yes
739:info:build checking for feof_unlocked... checking for getpwent... make[2]: Entering directory `/opt/local/var/macports/build/_opt_local_var_macports_sources_rsync.macports.org_macports_release_tarballs_ports_cross_avr-gdb/avr-gdb/work/gdb-8.0/libdecnumber'
740:info:build source='decNumber.c' object='decNumber.o' libtool=no /usr/bin/clang  -I. -I.  -pipe -Os -isysroot/Library/Developer/CommandLineTools/SDKs/MacOSX11.0.sdk -arch x86_64 -W -Wall -Wwrite-strings -Wstrict-prototypes -Wmissing-prototypes -Wold-style-definition -Wmissing-format-attribute -Wcast-qual -pedantic -Wno-long-long  -I. -I.   -c decNumber.c
741:info:build source='decContext.c' object='decContext.o' libtool=no /usr/bin/clang  -I. -I.  -pipe -Os -isysroot/Library/Developer/CommandLineTools/SDKs/MacOSX11.0.sdk -arch x86_64 -W -Wall -Wwrite-strings -Wstrict-prototypes -Wmissing-prototypes -Wold-style-definition -Wmissing-format-attribute -Wcast-qual -pedantic -Wno-long-long  -I. -I.   -c decContext.c
742:info:build source='dpd/decimal32.c' object='decimal32.o' libtool=no /usr/bin/clang  -I. -I.  -pipe -Os -isysroot/Library/Developer/CommandLineTools/SDKs/MacOSX11.0.sdk -arch x86_64 -W -Wall -Wwrite-strings -Wstrict-prototypes -Wmissing-prototypes -Wold-style-definition -Wmissing-format-attribute -Wcast-qual -pedantic -Wno-long-long  -I. -I.   -c ./dpd/decimal32.c
743:info:build source='dpd/decimal64.c' object='decimal64.o' libtool=no /usr/bin/clang  -I. -I.  -pipe -Os -isysroot/Library/Developer/CommandLineTools/SDKs/MacOSX11.0.sdk -arch x86_64 -W -Wall -Wwrite-strings -Wstrict-prototypes -Wmissing-prototypes -Wold-style-definition -Wmissing-format-attribute -Wcast-qual -pedantic -Wno-long-long  -I. -I.   -c ./dpd/decimal64.c
744:info:build yes
745:info:build checking for /usr/bin/clang option to produce PIC... -fno-common -DPIC
746:info:build checking if /usr/bin/clang PIC flag -fno-common -DPIC works... yes
747:info:build yes
748:info:build 4
749:info:build checking size of long... checking for fgets_unlocked... source='dpd/decimal128.c' object='decimal128.o' libtool=no /usr/bin/clang  -I. -I.  -pipe -Os -isysroot/Library/Developer/CommandLineTools/SDKs/MacOSX11.0.sdk -arch x86_64 -W -Wall -Wwrite-strings -Wstrict-prototypes -Wmissing-prototypes -Wold-style-definition -Wmissing-format-attribute -Wcast-qual -pedantic -Wno-long-long  -I. -I.   -c ./dpd/decimal128.c
750:info:build checking for getpwnam... yes
751:info:build checking if /usr/bin/clang static flag -static works... no
752:info:build checking if /usr/bin/clang supports -c -o file.o... no
753:info:build yes
754:info:build checking for getc_unlocked... checking for getpwuid... yes
755:info:build checking if /usr/bin/clang supports -c -o file.o... (cached) yes
756:info:build checking whether the /usr/bin/clang linker (/Library/Developer/CommandLineTools/usr/bin/ld) supports shared libraries... yes
757:info:build checking dynamic linker characteristics... yes
758:info:build yes
759:info:build checking for getcwd... checking for working strcoll... darwin20.1.0 dyld
760:info:build checking how to hardcode library paths into programs... immediate
761:info:build checking whether stripping libraries is possible... 8
762:info:build checking size of size_t... yes
763:info:build checking if libtool supports shared libraries... yes
764:info:build checking whether to build shared libraries... yes
765:info:build checking whether to build static libraries... yes
766:info:build checking how to run the C preprocessor... /usr/bin/clang -E
767:info:build yes
768:info:build checking for getegid... checking for stdlib.h... (cached) yes
769:info:build checking for unistd.h... (cached) yes
770:info:build checking for getpagesize... yes
771:info:build checking for geteuid... yes
772:info:build checking fcntl.h usability... yes
773:info:build checking for working mmap... 8
774:info:build checking for long long... yes
775:info:build checking fcntl.h presence... yes
776:info:build checking for getgid... yes
777:info:build checking for fcntl.h... yes
778:info:build checking for unistd.h... (cached) yes
779:info:build checking for stdlib.h... (cached) yes
780:info:build checking varargs.h usability... yes
781:info:build checking size of long long... yes
782:info:build yes
783:info:build checking for getuid... checking for memcpy... no
784:info:build checking varargs.h presence... no
785:info:build checking for varargs.h... no
786:info:build checking stdarg.h usability... yes
787:info:build yes
788:info:build checking for mempcpy... checking for strerror... yes
789:info:build checking stdarg.h presence... 8
790:info:build checking for a 64-bit type... yes
791:info:build checking for stdarg.h... yes
792:info:build checking for string.h... (cached) yes
793:info:build checking for strings.h... (cached) yes
794:info:build uint64_t
795:info:build checking for intptr_t... checking limits.h usability... no
796:info:build checking for munmap... yes
797:info:build checking for unistd.h... (cached) yes
798:info:build yes
799:info:build checking limits.h presence... configure: updating cache ./config.cache
800:info:build configure: creating ./config.status
801:info:build yes
802:info:build checking for limits.h... yes
803:info:build yes
804:info:build checking locale.h usability... checking for putenv... rm -f libdecnumber.a
805:info:build ar cru libdecnumber.a decNumber.o decContext.o decimal32.o decimal64.o decimal128.o
806:info:build yes
807:info:build checking for uintptr_t... ranlib libdecnumber.a
808:info:build make[2]: Leaving directory `/opt/local/var/macports/build/_opt_local_var_macports_sources_rsync.macports.org_macports_release_tarballs_ports_cross_avr-gdb/avr-gdb/work/gdb-8.0/libdecnumber'
809:info:build yes
810:info:build checking locale.h presence... yes
811:info:build yes
812:info:build checking for locale.h... yes
813:info:build checking for setenv... checking pwd.h usability... yes
814:info:build checking for ssize_t... yes
815:info:build checking pwd.h presence... yes
816:info:build yes
817:info:build checking for pwd.h... yes
818:info:build checking for setlocale... checking for memory.h... (cached) yes
819:info:build checking termcap.h usability... yes
820:info:build checking termcap.h presence... yes
821:info:build checking for pid_t... yes
822:info:build checking for stpcpy... yes
823:info:build checking for termcap.h... yes
824:info:build checking termios.h usability... yes
825:info:build checking termios.h presence... yes
826:info:build checking for strcasecmp... yes
827:info:build checking for library containing strerror... yes
828:info:build checking for termios.h... yes
829:info:build checking termio.h usability... yes
830:info:build no
831:info:build checking termio.h presence... none required
832:info:build checking for strdup... checking for asprintf... no
833:info:build checking for termio.h... no
834:info:build checking sys/pte.h usability... yes
835:info:build yes
836:info:build no
837:info:build checking sys/pte.h presence... checking for strtoul... checking for atexit... no
838:info:build checking for sys/pte.h... no
839:info:build checking sys/stream.h usability... yes
840:info:build yes
841:info:build checking for basename... no
842:info:build checking sys/stream.h presence... checking for tsearch... no
843:info:build checking for sys/stream.h... no
844:info:build checking sys/select.h usability... yes
845:info:build yes
846:info:build checking for bcmp... checking for __argz_count... yes
847:info:build checking sys/select.h presence... yes
848:info:build checking for sys/select.h... yes
849:info:build checking sys/file.h usability... no
850:info:build yes
851:info:build checking for __argz_stringify... checking for bcopy... yes
852:info:build checking sys/file.h presence... yes
853:info:build checking for sys/file.h... yes
854:info:build checking for sys/ptem.h... no
855:info:build yes
856:info:build checking for __argz_next... no
857:info:build checking for special C compiler options needed for large files... no
858:info:build checking for _FILE_OFFSET_BITS value needed for large files... checking for bsearch... no
859:info:build checking for type of signal functions... yes
860:info:build no
861:info:build checking for __fsetlocking... checking for bzero... posix
862:info:build checking if signal handlers must be reinstalled when invoked... yes
863:info:build no
864:info:build checking for iconv... yes
865:info:build checking for presence of POSIX-style sigsetjmp/siglongjmp... checking for calloc... missing
866:info:build checking for lstat... yes
867:info:build checking for clock... yes
868:info:build checking whether or not strcoll and strcmp differ... no
869:info:build checking whether the ctype macros accept non-ascii characters... yes
870:info:build yes
871:info:build checking how to link with libiconv... -liconv
872:info:build checking for iconv declaration... checking for ffs... no
873:info:build checking whether getpw functions are declared in pwd.h... install-shextern size_t iconv (iconv_t cd, char * *inbuf, size_t *inbytesleft, char * *outbuf, size_t *outbytesleft);
874:info:build checking for nl_langinfo and CODESET... yes
875:info:build checking whether termios.h defines TIOCGWINSZ... yes
876:info:build checking for getcwd... yes
877:info:build checking for sig_atomic_t in signal.h... yes
878:info:build checking for LC_MESSAGES... yes
879:info:build checking for getpagesize... yes
880:info:build checking whether signal handlers are of type void... yes
881:info:build checking for bison... bison
882:info:build checking version of bison... 3.7.3, ok
883:info:build checking whether NLS is requested... yes
884:info:build checking whether included gettext is requested... no
885:info:build checking for GNU gettext in libc... yes
886:info:build checking for TIOCSTAT in sys/ioctl.h... yes
887:info:build checking for gettimeofday... yes
888:info:build checking for FIONREAD in sys/ioctl.h... config.status: creating Makefile
889:info:build no
890:info:build config.status: executing depfiles commands
891:info:build checking for GNU gettext in libintl... yes
892:info:build checking for speed_t in sys/types.h... config.status: executing libtool commands
893:info:build yes
894:info:build checking for index... no
895:info:build checking for struct winsize in sys/ioctl.h and termios.h... yes
896:info:build checking whether to use NLS... yes
897:info:build checking where the gettext function comes from... external libintl
898:info:build checking how to link with libintl... -lintl
899:info:build checking for aclocal... aclocal
900:info:build checking for autoconf... autoconf
901:info:build checking for autoheader... autoheader
902:info:build sys/ioctl.h
903:info:build checking for struct dirent.d_ino... configure: updating cache ./config.cache
904:info:build configure: creating ./config.status
905:info:build yes
906:info:build make[2]: Entering directory `/opt/local/var/macports/build/_opt_local_var_macports_sources_rsync.macports.org_macports_release_tarballs_ports_cross_avr-gdb/avr-gdb/work/gdb-8.0/zlib'
907:info:build /usr/bin/clang -DPACKAGE_NAME=\"\" -DPACKAGE_TARNAME=\"\" -DPACKAGE_VERSION=\"\" -DPACKAGE_STRING=\"\" -DPACKAGE_BUGREPORT=\"\" -DPACKAGE_URL=\"\" -DPACKAGE=\"zlib\" -DVERSION=\"1.1.4\" -DSTDC_HEADERS=1 -DHAVE_SYS_TYPES_H=1 -DHAVE_SYS_STAT_H=1 -DHAVE_STDLIB_H=1 -DHAVE_STRING_H=1 -DHAVE_MEMORY_H=1 -DHAVE_STRINGS_H=1 -DHAVE_INTTYPES_H=1 -DHAVE_STDINT_H=1 -DHAVE_UNISTD_H=1 -DHAVE_DLFCN_H=1 -DLT_OBJDIR=\".libs/\" -DHAVE_STDLIB_H=1 -DHAVE_UNISTD_H=1 -DHAVE_GETPAGESIZE=1 -DHAVE_MMAP=1 -DHAVE_MEMCPY=1 -DHAVE_STRERROR=1 -DHAVE_UNISTD_H=1 -I.      -pipe -Os -isysroot/Library/Developer/CommandLineTools/SDKs/MacOSX11.0.sdk -arch x86_64 -c -o libz_a-adler32.o `test -f 'adler32.c' || echo './'`adler32.c
908:info:build /usr/bin/clang -DPACKAGE_NAME=\"\" -DPACKAGE_TARNAME=\"\" -DPACKAGE_VERSION=\"\" -DPACKAGE_STRING=\"\" -DPACKAGE_BUGREPORT=\"\" -DPACKAGE_URL=\"\" -DPACKAGE=\"zlib\" -DVERSION=\"1.1.4\" -DSTDC_HEADERS=1 -DHAVE_SYS_TYPES_H=1 -DHAVE_SYS_STAT_H=1 -DHAVE_STDLIB_H=1 -DHAVE_STRING_H=1 -DHAVE_MEMORY_H=1 -DHAVE_STRINGS_H=1 -DHAVE_INTTYPES_H=1 -DHAVE_STDINT_H=1 -DHAVE_UNISTD_H=1 -DHAVE_DLFCN_H=1 -DLT_OBJDIR=\".libs/\" -DHAVE_STDLIB_H=1 -DHAVE_UNISTD_H=1 -DHAVE_GETPAGESIZE=1 -DHAVE_MMAP=1 -DHAVE_MEMCPY=1 -DHAVE_STRERROR=1 -DHAVE_UNISTD_H=1 -I.      -pipe -Os -isysroot/Library/Developer/CommandLineTools/SDKs/MacOSX11.0.sdk -arch x86_64 -c -o libz_a-compress.o `test -f 'compress.c' || echo './'`compress.c
909:info:build /usr/bin/clang -DPACKAGE_NAME=\"\" -DPACKAGE_TARNAME=\"\" -DPACKAGE_VERSION=\"\" -DPACKAGE_STRING=\"\" -DPACKAGE_BUGREPORT=\"\" -DPACKAGE_URL=\"\" -DPACKAGE=\"zlib\" -DVERSION=\"1.1.4\" -DSTDC_HEADERS=1 -DHAVE_SYS_TYPES_H=1 -DHAVE_SYS_STAT_H=1 -DHAVE_STDLIB_H=1 -DHAVE_STRING_H=1 -DHAVE_MEMORY_H=1 -DHAVE_STRINGS_H=1 -DHAVE_INTTYPES_H=1 -DHAVE_STDINT_H=1 -DHAVE_UNISTD_H=1 -DHAVE_DLFCN_H=1 -DLT_OBJDIR=\".libs/\" -DHAVE_STDLIB_H=1 -DHAVE_UNISTD_H=1 -DHAVE_GETPAGESIZE=1 -DHAVE_MMAP=1 -DHAVE_MEMCPY=1 -DHAVE_STRERROR=1 -DHAVE_UNISTD_H=1 -I.      -pipe -Os -isysroot/Library/Developer/CommandLineTools/SDKs/MacOSX11.0.sdk -arch x86_64 -c -o libz_a-crc32.o `test -f 'crc32.c' || echo './'`crc32.c
910:info:build /usr/bin/clang -DPACKAGE_NAME=\"\" -DPACKAGE_TARNAME=\"\" -DPACKAGE_VERSION=\"\" -DPACKAGE_STRING=\"\" -DPACKAGE_BUGREPORT=\"\" -DPACKAGE_URL=\"\" -DPACKAGE=\"zlib\" -DVERSION=\"1.1.4\" -DSTDC_HEADERS=1 -DHAVE_SYS_TYPES_H=1 -DHAVE_SYS_STAT_H=1 -DHAVE_STDLIB_H=1 -DHAVE_STRING_H=1 -DHAVE_MEMORY_H=1 -DHAVE_STRINGS_H=1 -DHAVE_INTTYPES_H=1 -DHAVE_STDINT_H=1 -DHAVE_UNISTD_H=1 -DHAVE_DLFCN_H=1 -DLT_OBJDIR=\".libs/\" -DHAVE_STDLIB_H=1 -DHAVE_UNISTD_H=1 -DHAVE_GETPAGESIZE=1 -DHAVE_MMAP=1 -DHAVE_MEMCPY=1 -DHAVE_STRERROR=1 -DHAVE_UNISTD_H=1 -I.      -pipe -Os -isysroot/Library/Developer/CommandLineTools/SDKs/MacOSX11.0.sdk -arch x86_64 -c -o libz_a-deflate.o `test -f 'deflate.c' || echo './'`deflate.c
911:info:build /usr/bin/clang -DPACKAGE_NAME=\"\" -DPACKAGE_TARNAME=\"\" -DPACKAGE_VERSION=\"\" -DPACKAGE_STRING=\"\" -DPACKAGE_BUGREPORT=\"\" -DPACKAGE_URL=\"\" -DPACKAGE=\"zlib\" -DVERSION=\"1.1.4\" -DSTDC_HEADERS=1 -DHAVE_SYS_TYPES_H=1 -DHAVE_SYS_STAT_H=1 -DHAVE_STDLIB_H=1 -DHAVE_STRING_H=1 -DHAVE_MEMORY_H=1 -DHAVE_STRINGS_H=1 -DHAVE_INTTYPES_H=1 -DHAVE_STDINT_H=1 -DHAVE_UNISTD_H=1 -DHAVE_DLFCN_H=1 -DLT_OBJDIR=\".libs/\" -DHAVE_STDLIB_H=1 -DHAVE_UNISTD_H=1 -DHAVE_GETPAGESIZE=1 -DHAVE_MMAP=1 -DHAVE_MEMCPY=1 -DHAVE_STRERROR=1 -DHAVE_UNISTD_H=1 -I.      -pipe -Os -isysroot/Library/Developer/CommandLineTools/SDKs/MacOSX11.0.sdk -arch x86_64 -c -o libz_a-gzread.o `test -f 'gzread.c' || echo './'`gzread.c
912:info:build checking for insque... yes
913:info:build checking for struct dirent.d_fileno... /usr/bin/clang -DPACKAGE_NAME=\"\" -DPACKAGE_TARNAME=\"\" -DPACKAGE_VERSION=\"\" -DPACKAGE_STRING=\"\" -DPACKAGE_BUGREPORT=\"\" -DPACKAGE_URL=\"\" -DPACKAGE=\"zlib\" -DVERSION=\"1.1.4\" -DSTDC_HEADERS=1 -DHAVE_SYS_TYPES_H=1 -DHAVE_SYS_STAT_H=1 -DHAVE_STDLIB_H=1 -DHAVE_STRING_H=1 -DHAVE_MEMORY_H=1 -DHAVE_STRINGS_H=1 -DHAVE_INTTYPES_H=1 -DHAVE_STDINT_H=1 -DHAVE_UNISTD_H=1 -DHAVE_DLFCN_H=1 -DLT_OBJDIR=\".libs/\" -DHAVE_STDLIB_H=1 -DHAVE_UNISTD_H=1 -DHAVE_GETPAGESIZE=1 -DHAVE_MMAP=1 -DHAVE_MEMCPY=1 -DHAVE_STRERROR=1 -DHAVE_UNISTD_H=1 -I.      -pipe -Os -isysroot/Library/Developer/CommandLineTools/SDKs/MacOSX11.0.sdk -arch x86_64 -c -o libz_a-gzclose.o `test -f 'gzclose.c' || echo './'`gzclose.c
914:info:build yes
915:info:build checking for tgetent... /usr/bin/clang -DPACKAGE_NAME=\"\" -DPACKAGE_TARNAME=\"\" -DPACKAGE_VERSION=\"\" -DPACKAGE_STRING=\"\" -DPACKAGE_BUGREPORT=\"\" -DPACKAGE_URL=\"\" -DPACKAGE=\"zlib\" -DVERSION=\"1.1.4\" -DSTDC_HEADERS=1 -DHAVE_SYS_TYPES_H=1 -DHAVE_SYS_STAT_H=1 -DHAVE_STDLIB_H=1 -DHAVE_STRING_H=1 -DHAVE_MEMORY_H=1 -DHAVE_STRINGS_H=1 -DHAVE_INTTYPES_H=1 -DHAVE_STDINT_H=1 -DHAVE_UNISTD_H=1 -DHAVE_DLFCN_H=1 -DLT_OBJDIR=\".libs/\" -DHAVE_STDLIB_H=1 -DHAVE_UNISTD_H=1 -DHAVE_GETPAGESIZE=1 -DHAVE_MMAP=1 -DHAVE_MEMCPY=1 -DHAVE_STRERROR=1 -DHAVE_UNISTD_H=1 -I.      -pipe -Os -isysroot/Library/Developer/CommandLineTools/SDKs/MacOSX11.0.sdk -arch x86_64 -c -o libz_a-gzwrite.o `test -f 'gzwrite.c' || echo './'`gzwrite.c
916:info:build yes
917:info:build /usr/bin/clang -DPACKAGE_NAME=\"\" -DPACKAGE_TARNAME=\"\" -DPACKAGE_VERSION=\"\" -DPACKAGE_STRING=\"\" -DPACKAGE_BUGREPORT=\"\" -DPACKAGE_URL=\"\" -DPACKAGE=\"zlib\" -DVERSION=\"1.1.4\" -DSTDC_HEADERS=1 -DHAVE_SYS_TYPES_H=1 -DHAVE_SYS_STAT_H=1 -DHAVE_STDLIB_H=1 -DHAVE_STRING_H=1 -DHAVE_MEMORY_H=1 -DHAVE_STRINGS_H=1 -DHAVE_INTTYPES_H=1 -DHAVE_STDINT_H=1 -DHAVE_UNISTD_H=1 -DHAVE_DLFCN_H=1 -DLT_OBJDIR=\".libs/\" -DHAVE_STDLIB_H=1 -DHAVE_UNISTD_H=1 -DHAVE_GETPAGESIZE=1 -DHAVE_MMAP=1 -DHAVE_MEMCPY=1 -DHAVE_STRERROR=1 -DHAVE_UNISTD_H=1 -I.      -pipe -Os -isysroot/Library/Developer/CommandLineTools/SDKs/MacOSX11.0.sdk -arch x86_64 -c -o libz_a-gzlib.o `test -f 'gzlib.c' || echo './'`gzlib.c
918:info:build /usr/bin/clang -DPACKAGE_NAME=\"\" -DPACKAGE_TARNAME=\"\" -DPACKAGE_VERSION=\"\" -DPACKAGE_STRING=\"\" -DPACKAGE_BUGREPORT=\"\" -DPACKAGE_URL=\"\" -DPACKAGE=\"zlib\" -DVERSION=\"1.1.4\" -DSTDC_HEADERS=1 -DHAVE_SYS_TYPES_H=1 -DHAVE_SYS_STAT_H=1 -DHAVE_STDLIB_H=1 -DHAVE_STRING_H=1 -DHAVE_MEMORY_H=1 -DHAVE_STRINGS_H=1 -DHAVE_INTTYPES_H=1 -DHAVE_STDINT_H=1 -DHAVE_UNISTD_H=1 -DHAVE_DLFCN_H=1 -DLT_OBJDIR=\".libs/\" -DHAVE_STDLIB_H=1 -DHAVE_UNISTD_H=1 -DHAVE_GETPAGESIZE=1 -DHAVE_MMAP=1 -DHAVE_MEMCPY=1 -DHAVE_STRERROR=1 -DHAVE_UNISTD_H=1 -I.      -pipe -Os -isysroot/Library/Developer/CommandLineTools/SDKs/MacOSX11.0.sdk -arch x86_64 -c -o libz_a-infback.o `test -f 'infback.c' || echo './'`infback.c
919:info:build checking for memchr... /usr/bin/clang -DPACKAGE_NAME=\"\" -DPACKAGE_TARNAME=\"\" -DPACKAGE_VERSION=\"\" -DPACKAGE_STRING=\"\" -DPACKAGE_BUGREPORT=\"\" -DPACKAGE_URL=\"\" -DPACKAGE=\"zlib\" -DVERSION=\"1.1.4\" -DSTDC_HEADERS=1 -DHAVE_SYS_TYPES_H=1 -DHAVE_SYS_STAT_H=1 -DHAVE_STDLIB_H=1 -DHAVE_STRING_H=1 -DHAVE_MEMORY_H=1 -DHAVE_STRINGS_H=1 -DHAVE_INTTYPES_H=1 -DHAVE_STDINT_H=1 -DHAVE_UNISTD_H=1 -DHAVE_DLFCN_H=1 -DLT_OBJDIR=\".libs/\" -DHAVE_STDLIB_H=1 -DHAVE_UNISTD_H=1 -DHAVE_GETPAGESIZE=1 -DHAVE_MMAP=1 -DHAVE_MEMCPY=1 -DHAVE_STRERROR=1 -DHAVE_UNISTD_H=1 -I.      -pipe -Os -isysroot/Library/Developer/CommandLineTools/SDKs/MacOSX11.0.sdk -arch x86_64 -c -o libz_a-inffast.o `test -f 'inffast.c' || echo './'`inffast.c
920:info:build no
921:info:build checking for tgetent in -ltermcap... yes
922:info:build /usr/bin/clang -DPACKAGE_NAME=\"\" -DPACKAGE_TARNAME=\"\" -DPACKAGE_VERSION=\"\" -DPACKAGE_STRING=\"\" -DPACKAGE_BUGREPORT=\"\" -DPACKAGE_URL=\"\" -DPACKAGE=\"zlib\" -DVERSION=\"1.1.4\" -DSTDC_HEADERS=1 -DHAVE_SYS_TYPES_H=1 -DHAVE_SYS_STAT_H=1 -DHAVE_STDLIB_H=1 -DHAVE_STRING_H=1 -DHAVE_MEMORY_H=1 -DHAVE_STRINGS_H=1 -DHAVE_INTTYPES_H=1 -DHAVE_STDINT_H=1 -DHAVE_UNISTD_H=1 -DHAVE_DLFCN_H=1 -DLT_OBJDIR=\".libs/\" -DHAVE_STDLIB_H=1 -DHAVE_UNISTD_H=1 -DHAVE_GETPAGESIZE=1 -DHAVE_MMAP=1 -DHAVE_MEMCPY=1 -DHAVE_STRERROR=1 -DHAVE_UNISTD_H=1 -I.      -pipe -Os -isysroot/Library/Developer/CommandLineTools/SDKs/MacOSX11.0.sdk -arch x86_64 -c -o libz_a-inflate.o `test -f 'inflate.c' || echo './'`inflate.c
923:info:build /usr/bin/clang -DPACKAGE_NAME=\"\" -DPACKAGE_TARNAME=\"\" -DPACKAGE_VERSION=\"\" -DPACKAGE_STRING=\"\" -DPACKAGE_BUGREPORT=\"\" -DPACKAGE_URL=\"\" -DPACKAGE=\"zlib\" -DVERSION=\"1.1.4\" -DSTDC_HEADERS=1 -DHAVE_SYS_TYPES_H=1 -DHAVE_SYS_STAT_H=1 -DHAVE_STDLIB_H=1 -DHAVE_STRING_H=1 -DHAVE_MEMORY_H=1 -DHAVE_STRINGS_H=1 -DHAVE_INTTYPES_H=1 -DHAVE_STDINT_H=1 -DHAVE_UNISTD_H=1 -DHAVE_DLFCN_H=1 -DLT_OBJDIR=\".libs/\" -DHAVE_STDLIB_H=1 -DHAVE_UNISTD_H=1 -DHAVE_GETPAGESIZE=1 -DHAVE_MMAP=1 -DHAVE_MEMCPY=1 -DHAVE_STRERROR=1 -DHAVE_UNISTD_H=1 -I.      -pipe -Os -isysroot/Library/Developer/CommandLineTools/SDKs/MacOSX11.0.sdk -arch x86_64 -c -o libz_a-inftrees.o `test -f 'inftrees.c' || echo './'`inftrees.c
924:info:build config.status: creating Makefile
925:info:build checking for memcmp... /usr/bin/clang -DPACKAGE_NAME=\"\" -DPACKAGE_TARNAME=\"\" -DPACKAGE_VERSION=\"\" -DPACKAGE_STRING=\"\" -DPACKAGE_BUGREPORT=\"\" -DPACKAGE_URL=\"\" -DPACKAGE=\"zlib\" -DVERSION=\"1.1.4\" -DSTDC_HEADERS=1 -DHAVE_SYS_TYPES_H=1 -DHAVE_SYS_STAT_H=1 -DHAVE_STDLIB_H=1 -DHAVE_STRING_H=1 -DHAVE_MEMORY_H=1 -DHAVE_STRINGS_H=1 -DHAVE_INTTYPES_H=1 -DHAVE_STDINT_H=1 -DHAVE_UNISTD_H=1 -DHAVE_DLFCN_H=1 -DLT_OBJDIR=\".libs/\" -DHAVE_STDLIB_H=1 -DHAVE_UNISTD_H=1 -DHAVE_GETPAGESIZE=1 -DHAVE_MMAP=1 -DHAVE_MEMCPY=1 -DHAVE_STRERROR=1 -DHAVE_UNISTD_H=1 -I.      -pipe -Os -isysroot/Library/Developer/CommandLineTools/SDKs/MacOSX11.0.sdk -arch x86_64 -c -o libz_a-trees.o `test -f 'trees.c' || echo './'`trees.c
926:info:build config.status: creating config.intl
927:info:build yes
928:info:build checking which library has the termcap functions... using libtermcap
929:info:build checking wctype.h usability... config.status: creating config.h
930:info:build /usr/bin/clang -DPACKAGE_NAME=\"\" -DPACKAGE_TARNAME=\"\" -DPACKAGE_VERSION=\"\" -DPACKAGE_STRING=\"\" -DPACKAGE_BUGREPORT=\"\" -DPACKAGE_URL=\"\" -DPACKAGE=\"zlib\" -DVERSION=\"1.1.4\" -DSTDC_HEADERS=1 -DHAVE_SYS_TYPES_H=1 -DHAVE_SYS_STAT_H=1 -DHAVE_STDLIB_H=1 -DHAVE_STRING_H=1 -DHAVE_MEMORY_H=1 -DHAVE_STRINGS_H=1 -DHAVE_INTTYPES_H=1 -DHAVE_STDINT_H=1 -DHAVE_UNISTD_H=1 -DHAVE_DLFCN_H=1 -DLT_OBJDIR=\".libs/\" -DHAVE_STDLIB_H=1 -DHAVE_UNISTD_H=1 -DHAVE_GETPAGESIZE=1 -DHAVE_MMAP=1 -DHAVE_MEMCPY=1 -DHAVE_STRERROR=1 -DHAVE_UNISTD_H=1 -I.      -pipe -Os -isysroot/Library/Developer/CommandLineTools/SDKs/MacOSX11.0.sdk -arch x86_64 -c -o libz_a-uncompr.o `test -f 'uncompr.c' || echo './'`uncompr.c
931:info:build config.status: executing default-1 commands
932:info:build /usr/bin/clang -DPACKAGE_NAME=\"\" -DPACKAGE_TARNAME=\"\" -DPACKAGE_VERSION=\"\" -DPACKAGE_STRING=\"\" -DPACKAGE_BUGREPORT=\"\" -DPACKAGE_URL=\"\" -DPACKAGE=\"zlib\" -DVERSION=\"1.1.4\" -DSTDC_HEADERS=1 -DHAVE_SYS_TYPES_H=1 -DHAVE_SYS_STAT_H=1 -DHAVE_STDLIB_H=1 -DHAVE_STRING_H=1 -DHAVE_MEMORY_H=1 -DHAVE_STRINGS_H=1 -DHAVE_INTTYPES_H=1 -DHAVE_STDINT_H=1 -DHAVE_UNISTD_H=1 -DHAVE_DLFCN_H=1 -DLT_OBJDIR=\".libs/\" -DHAVE_STDLIB_H=1 -DHAVE_UNISTD_H=1 -DHAVE_GETPAGESIZE=1 -DHAVE_MMAP=1 -DHAVE_MEMCPY=1 -DHAVE_STRERROR=1 -DHAVE_UNISTD_H=1 -I.      -pipe -Os -isysroot/Library/Developer/CommandLineTools/SDKs/MacOSX11.0.sdk -arch x86_64 -c -o libz_a-zutil.o `test -f 'zutil.c' || echo './'`zutil.c
933:info:build yes
934:info:build checking wctype.h presence... yes
935:info:build checking for memcpy... yes
936:info:build checking for wctype.h... yes
937:info:build true "AR_FLAGS=rc" "CC_FOR_BUILD=/usr/bin/clang" "CFLAGS=-pipe -Os -isysroot/Library/Developer/CommandLineTools/SDKs/MacOSX11.0.sdk -arch x86_64" "CXXFLAGS=-pipe -Os -stdlib=libc++ -isysroot/Library/Developer/CommandLineTools/SDKs/MacOSX11.0.sdk -arch x86_64" "CFLAGS_FOR_BUILD=-pipe -Os -isysroot/Library/Developer/CommandLineTools/SDKs/MacOSX11.0.sdk -arch x86_64" "CFLAGS_FOR_TARGET=-g -O2" "INSTALL=/usr/bin/install -c" "INSTALL_DATA=/usr/bin/install -c -m 644" "INSTALL_PROGRAM=/usr/bin/install -c" "INSTALL_SCRIPT=/usr/bin/install -c" "LDFLAGS=-L/opt/local/lib -Wl,-headerpad_max_install_names -Wl,-syslibroot,/Library/Developer/CommandLineTools/SDKs/MacOSX11.0.sdk -arch x86_64" "LIBCFLAGS=-pipe -Os -isysroot/Library/Developer/CommandLineTools/SDKs/MacOSX11.0.sdk -arch x86_64" "LIBCFLAGS_FOR_TARGET=-g -O2" "MAKE=/Library/Developer/CommandLineTools/usr/bin/make" "MAKEINFO=makeinfo --split-size=5000000 --split-size=5000000 " "PICFLAG=" "PICFLAG_FOR_TARGET=" "SHELL=/bin/sh" "EXPECT=expect" "RUNTEST=runtest" "RUNTESTFLAGS=" "exec_prefix=/opt/local" "infodir=/opt/local/share/info" "libdir=/opt/local/lib" "prefix=/opt/local" "tooldir=/opt/local/avr" "AR=ar" "AS=as" "CC=/usr/bin/clang" "CXX=/usr/bin/clang++" "LD=/Library/Developer/CommandLineTools/usr/bin/ld" "LIBCFLAGS=-pipe -Os -isysroot/Library/Developer/CommandLineTools/SDKs/MacOSX11.0.sdk -arch x86_64" "NM=nm" "PICFLAG=" "RANLIB=ranlib" "DESTDIR=" DO=all multi-do # /Library/Developer/CommandLineTools/usr/bin/make
938:info:build checking wchar.h usability... Configuring in ./sim
939:info:build make[2]: Entering directory `/opt/local/var/macports/build/_opt_local_var_macports_sources_rsync.macports.org_macports_release_tarballs_ports_cross_avr-gdb/avr-gdb/work/gdb-8.0/intl'
940:info:build make[2]: Nothing to be done for `all'.
941:info:build make[2]: Leaving directory `/opt/local/var/macports/build/_opt_local_var_macports_sources_rsync.macports.org_macports_release_tarballs_ports_cross_avr-gdb/avr-gdb/work/gdb-8.0/intl'
942:info:build yes
943:info:build checking wchar.h presence... yes
944:info:build checking for memmem... yes
945:info:build checking for wchar.h... yes
946:info:build checking langinfo.h usability... yes
947:info:build checking langinfo.h presence... yes
948:info:build checking for memmove... configure: creating cache ./config.cache
949:info:build checking for x86_64-apple-darwin20.1.0-gcc... /usr/bin/clang
950:info:build yes
951:info:build checking for langinfo.h... yes
952:info:build checking for mbrlen... checking for C compiler default output file name... yes
953:info:build yes
954:info:build checking for mbscasecmp... checking for mempcpy... rm -f libz.a
955:info:build ar cru libz.a libz_a-adler32.o libz_a-compress.o libz_a-crc32.o libz_a-deflate.o libz_a-gzread.o libz_a-gzclose.o libz_a-gzwrite.o libz_a-gzlib.o libz_a-infback.o libz_a-inffast.o libz_a-inflate.o libz_a-inftrees.o libz_a-trees.o libz_a-uncompr.o libz_a-zutil.o
956:info:build ranlib libz.a
957:info:build make[2]: Leaving directory `/opt/local/var/macports/build/_opt_local_var_macports_sources_rsync.macports.org_macports_release_tarballs_ports_cross_avr-gdb/avr-gdb/work/gdb-8.0/zlib'
958:info:build a.out
959:info:build checking whether the C compiler works... no
960:info:build checking for mbscmp... no
961:info:build checking for memset... yes
962:info:build checking whether we are cross compiling... no
963:info:build checking for suffix of executables... no
964:info:build checking for mbsnrtowcs...
965:info:build checking for suffix of object files... yes
966:info:build checking for mkstemps... o
967:info:build checking whether we are using the GNU C compiler... yes
968:info:build checking for mbsrtowcs... yes
969:info:build checking whether /usr/bin/clang accepts -g... yes
970:info:build checking for putenv... yes
971:info:build checking for /usr/bin/clang option to accept ISO C89... yes
972:info:build checking for mbschr... none needed
973:info:build checking for a BSD-compatible install... /usr/bin/install -c
974:info:build checking for x86_64-apple-darwin20.1.0-ar... ar
975:info:build checking for x86_64-apple-darwin20.1.0-ranlib... ranlib
976:info:build yes
977:info:build checking build system type... checking for random... x86_64-apple-darwin20.1.0
978:info:build checking host system type... x86_64-apple-darwin20.1.0
979:info:build checking target system type... no
980:info:build checking for wcrtomb... avr-unknown-none
981:info:build checking for x86_64-apple-darwin20.1.0-gcc... (cached) /usr/bin/clang
982:info:build yes
983:info:build checking for rename... yes
984:info:build checking for wcscoll... checking whether we are using the GNU C compiler... (cached) yes
985:info:build checking whether /usr/bin/clang accepts -g... (cached) yes
986:info:build checking for /usr/bin/clang option to accept ISO C89... (cached) none needed
987:info:build checking for x86_64-apple-darwin20.1.0-ranlib... (cached) ranlib
988:info:build configure: updating cache ./config.cache
989:info:build configure: creating ./config.status
990:info:build yes
991:info:build checking for rindex... yes
992:info:build checking for wcsdup... yes
993:info:build yes
994:info:build checking for wcwidth... checking for setenv... config.status: creating Makefile
995:info:build === configuring in avr (/opt/local/var/macports/build/_opt_local_var_macports_sources_rsync.macports.org_macports_release_tarballs_ports_cross_avr-gdb/avr-gdb/work/gdb-8.0/sim/avr)
996:info:build configure: running /bin/sh ./configure --disable-option-checking '--prefix=/opt/local'  '--mandir=/opt/local/share/man' '--infodir=/opt/local/share/info' '--disable-werror' '--program-transform-name=s&^&avr-&' '--build=x86_64-apple-darwin20.1.0' '--host=x86_64-apple-darwin20.1.0' '--target=avr' 'build_alias=x86_64-apple-darwin20.1.0' 'host_alias=x86_64-apple-darwin20.1.0' 'target_alias=avr' 'CC=/usr/bin/clang' 'CFLAGS=-pipe -Os -isysroot/Library/Developer/CommandLineTools/SDKs/MacOSX11.0.sdk -arch x86_64' 'LDFLAGS=  -L/opt/local/lib -Wl,-headerpad_max_install_names -Wl,-syslibroot,/Library/Developer/CommandLineTools/SDKs/MacOSX11.0.sdk -arch x86_64' --cache-file=.././config.cache --srcdir=.
997:info:build yes
998:info:build checking for wctype... yes
999:info:build checking for snprintf... yes
1000:info:build checking for wcswidth... yes
1001:info:build checking for sigsetmask... yes
1002:info:build configure: loading cache .././config.cache
1003:info:build checking whether mbrtowc and mbstate_t are properly declared... checking for x86_64-apple-darwin20.1.0-gcc... (cached) /usr/bin/clang
1004:info:build yes
1005:info:build checking for stpcpy... checking for C compiler default output file name... yes
1006:info:build checking for iswlower... yes
1007:info:build checking for stpncpy... a.out
1008:info:build checking whether the C compiler works... yes
1009:info:build checking for iswupper... yes
1010:info:build checking whether we are cross compiling... no
1011:info:build checking for suffix of executables... yes
1012:info:build checking for strcasecmp... yes
1013:info:build checking for towlower...
1014:info:build checking for suffix of object files... (cached) o
1015:info:build checking whether we are using the GNU C compiler... (cached) yes
1016:info:build checking whether /usr/bin/clang accepts -g... (cached) yes
1017:info:build checking for /usr/bin/clang option to accept ISO C89... (cached) none needed
1018:info:build checking build system type... (cached) x86_64-apple-darwin20.1.0
1019:info:build checking host system type... (cached) x86_64-apple-darwin20.1.0
1020:info:build checking target system type... (cached) avr-unknown-none
1021:info:build checking how to run the C preprocessor... yes
1022:info:build checking for strchr... yes
1023:info:build /usr/bin/clang -E
1024:info:build checking for towupper... yes
1025:info:build checking for grep that handles long lines and -e... checking for strdup... /opt/local/bin/ggrep
1026:info:build checking for egrep... yes
1027:info:build /opt/local/bin/ggrep -E
1028:info:build checking for ANSI C header files... checking for iswctype... yes
1029:info:build checking for strncasecmp... yes
1030:info:build checking for nl_langinfo and CODESET... yes
1031:info:build checking for strndup... yes
1032:info:build checking for wchar_t in wchar.h... yes
1033:info:build checking for wctype_t in wctype.h... yes
1034:info:build yes
1035:info:build checking for wint_t in wctype.h... yes
1036:info:build checking for strnlen... checking for sys/types.h... yes
1037:info:build checking configuration for building shared libraries... supported
1038:info:build yes
1039:info:build checking for sys/stat.h... yes
1040:info:build configure: updating cache ./config.cache
1041:info:build configure: creating ./config.status
1042:info:build checking for strrchr... yes
1043:info:build checking for stdlib.h... yes
1044:info:build yes
1045:info:build checking for string.h... checking for strstr... yes
1046:info:build checking for memory.h... config.status: creating Makefile
1047:info:build config.status: creating doc/Makefile
1048:info:build yes
1049:info:build checking for strtod... yes
1050:info:build checking for strings.h... config.status: creating examples/Makefile
1051:info:build config.status: creating shlib/Makefile
1052:info:build yes
1053:info:build config.status: creating config.h
1054:info:build checking for inttypes.h... yes
1055:info:build checking for strtol... config.status: executing default commands
1056:info:build yes
1057:info:build checking for stdint.h... make[2]: Entering directory `/opt/local/var/macports/build/_opt_local_var_macports_sources_rsync.macports.org_macports_release_tarballs_ports_cross_avr-gdb/avr-gdb/work/gdb-8.0/readline'
1058:info:build rm -f readline.o
1059:info:build rm -f vi_mode.o
1060:info:build rm -f funmap.o
1061:info:build /usr/bin/clang -c -DHAVE_CONFIG_H    -I. -I. -DRL_LIBRARY_VERSION='"6.2"' -pipe -Os -isysroot/Library/Developer/CommandLineTools/SDKs/MacOSX11.0.sdk -arch x86_64 readline.c
1062:info:build /usr/bin/clang -c -DHAVE_CONFIG_H    -I. -I. -DRL_LIBRARY_VERSION='"6.2"' -pipe -Os -isysroot/Library/Developer/CommandLineTools/SDKs/MacOSX11.0.sdk -arch x86_64 vi_mode.c
1063:info:build rm -f keymaps.o
1064:info:build /usr/bin/clang -c -DHAVE_CONFIG_H    -I. -I. -DRL_LIBRARY_VERSION='"6.2"' -pipe -Os -isysroot/Library/Developer/CommandLineTools/SDKs/MacOSX11.0.sdk -arch x86_64 funmap.c
1065:info:build rm -f parens.o
1066:info:build /usr/bin/clang -c -DHAVE_CONFIG_H    -I. -I. -DRL_LIBRARY_VERSION='"6.2"' -pipe -Os -isysroot/Library/Developer/CommandLineTools/SDKs/MacOSX11.0.sdk -arch x86_64 keymaps.c
1067:info:build rm -f search.o
1068:info:build /usr/bin/clang -c -DHAVE_CONFIG_H    -I. -I. -DRL_LIBRARY_VERSION='"6.2"' -pipe -Os -isysroot/Library/Developer/CommandLineTools/SDKs/MacOSX11.0.sdk -arch x86_64 parens.c
1069:info:build /usr/bin/clang -c -DHAVE_CONFIG_H    -I. -I. -DRL_LIBRARY_VERSION='"6.2"' -pipe -Os -isysroot/Library/Developer/CommandLineTools/SDKs/MacOSX11.0.sdk -arch x86_64 search.c
1070:info:build yes
1071:info:build yes
1072:info:build checking for strtoul... checking for unistd.h... rm -f rltty.o
1073:info:build /usr/bin/clang -c -DHAVE_CONFIG_H    -I. -I. -DRL_LIBRARY_VERSION='"6.2"' -pipe -Os -isysroot/Library/Developer/CommandLineTools/SDKs/MacOSX11.0.sdk -arch x86_64 rltty.c
1074:info:build rm -f complete.o
1075:info:build /usr/bin/clang -c -DHAVE_CONFIG_H    -I. -I. -DRL_LIBRARY_VERSION='"6.2"' -pipe -Os -isysroot/Library/Developer/CommandLineTools/SDKs/MacOSX11.0.sdk -arch x86_64 complete.c
1076:info:build rm -f bind.o
1077:info:build /usr/bin/clang -c -DHAVE_CONFIG_H    -I. -I. -DRL_LIBRARY_VERSION='"6.2"' -pipe -Os -isysroot/Library/Developer/CommandLineTools/SDKs/MacOSX11.0.sdk -arch x86_64 bind.c
1078:info:build yes
1079:info:build checking minix/config.h usability... rltty.c:83:7: error: implicit declaration of function 'ioctl' is invalid in C99 [-Werror,-Wimplicit-function-declaration]
1080:info:build   if (ioctl (tty, TIOCGWINSZ, &w) == 0)
1081:info:build       ^
1082:info:build rltty.c:720:3: error: implicit declaration of function 'ioctl' is invalid in C99 [-Werror,-Wimplicit-function-declaration]
1083:info:build   ioctl (fildes, TIOCSTART, 0);
1084:info:build   ^
1085:info:build rltty.c:759:3: error: implicit declaration of function 'ioctl' is invalid in C99 [-Werror,-Wimplicit-function-declaration]
1086:info:build   ioctl (fildes, TIOCSTOP, 0);
1087:info:build   ^
1088:info:build rm -f isearch.o
1089:info:build 3 errors generated.
1090:info:build make[2]: *** [rltty.o] Error 1
1091:info:build make[2]: *** Waiting for unfinished jobs....
1092:info:build /usr/bin/clang -c -DHAVE_CONFIG_H    -I. -I. -DRL_LIBRARY_VERSION='"6.2"' -pipe -Os -isysroot/Library/Developer/CommandLineTools/SDKs/MacOSX11.0.sdk -arch x86_64 isearch.c
1093:info:build yes
1094:info:build complete.c:1003:23: warning: using the result of an assignment as a condition without parentheses [-Wparentheses]
1095:info:build       while (rl_point = MB_PREVCHAR (rl_line_buffer, rl_point, MB_FIND_ANY))
1096:info:build              ~~~~~~~~~^~~~~~~~~~~~~~~~~~~~~~~~~~~~~~~~~~~~~~~~~~~~~~~~~~~~~
1097:info:build complete.c:1003:23: note: place parentheses around the assignment to silence this warning
1098:info:build       while (rl_point = MB_PREVCHAR (rl_line_buffer, rl_point, MB_FIND_ANY))
1099:info:build                       ^
1100:info:build              (                                                             )
1101:info:build complete.c:1003:23: note: use '==' to turn this assignment into an equality comparison
1102:info:build       while (rl_point = MB_PREVCHAR (rl_line_buffer, rl_point, MB_FIND_ANY))
1103:info:build                       ^
1104:info:build                       ==
1105:info:build bind.c:451:21: warning: using the result of an assignment as a condition without parentheses [-Wparentheses]
1106:info:build   for (i = l = 0; c = seq[i]; i++)
1107:info:build                   ~~^~~~~~~~
1108:info:build bind.c:451:21: note: place parentheses around the assignment to silence this warning
1109:info:build   for (i = l = 0; c = seq[i]; i++)
1110:info:build                     ^
1111:info:build                   (         )
1112:info:build bind.c:451:21: note: use '==' to turn this assignment into an equality comparison
1113:info:build   for (i = l = 0; c = seq[i]; i++)
1114:info:build                     ^
1115:info:build                     ==
1116:info:build checking for strtoll... complete.c:2011:17: warning: using the result of an assignment as a condition without parentheses [-Wparentheses]
1117:info:build   while (string = (*entry_function) (text, matches))
1118:info:build          ~~~~~~~^~~~~~~~~~~~~~~~~~~~~~~~~~~~~~~~~~~
1119:info:build complete.c:2011:17: note: place parentheses around the assignment to silence this warning
1120:info:build   while (string = (*entry_function) (text, matches))
1121:info:build                 ^
1122:info:build          (                                         )
1123:info:build complete.c:2011:17: note: use '==' to turn this assignment into an equality comparison
1124:info:build   while (string = (*entry_function) (text, matches))
1125:info:build                 ^
1126:info:build                 ==
1127:info:build complete.c:2064:16: warning: using the result of an assignment as a condition without parentheses [-Wparentheses]
1128:info:build   while (entry = getpwent ())
1129:info:build          ~~~~~~^~~~~~~~~~~~~
1130:info:build complete.c:2064:16: note: place parentheses around the assignment to silence this warning
1131:info:build   while (entry = getpwent ())
1132:info:build                ^
1133:info:build          (                  )
1134:info:build complete.c:2064:16: note: use '==' to turn this assignment into an equality comparison
1135:info:build   while (entry = getpwent ())
1136:info:build                ^
1137:info:build                ==
1138:info:build bind.c:1197:21: warning: using the result of an assignment as a condition without parentheses [-Wparentheses]
1139:info:build       for (i = 1; c = string[i]; i++)
1140:info:build                   ~~^~~~~~~~~~~
1141:info:build bind.c:1197:21: note: place parentheses around the assignment to silence this warning
1142:info:build       for (i = 1; c = string[i]; i++)
1143:info:build                     ^
1144:info:build                   (            )
1145:info:build bind.c:1197:21: note: use '==' to turn this assignment into an equality comparison
1146:info:build       for (i = 1; c = string[i]; i++)
1147:info:build                     ^
1148:info:build                     ==
1149:info:build bind.c:1288:25: warning: using the result of an assignment as a condition without parentheses [-Wparentheses]
1150:info:build       for (passc = 0; c = string[i]; i++)
1151:info:build                       ~~^~~~~~~~~~~
1152:info:build bind.c:1288:25: note: place parentheses around the assignment to silence this warning
1153:info:build       for (passc = 0; c = string[i]; i++)
1154:info:build                         ^
1155:info:build                       (            )
1156:info:build bind.c:1288:25: note: use '==' to turn this assignment into an equality comparison
1157:info:build       for (passc = 0; c = string[i]; i++)
1158:info:build                         ^
1159:info:build                         ==
1160:info:build bind.c:2117:20: warning: using the result of an assignment as a condition without parentheses [-Wparentheses]
1161:info:build   for (i = 0; name = names[i]; i++)
1162:info:build               ~~~~~^~~~~~~~~~
1163:info:build bind.c:2117:20: note: place parentheses around the assignment to silence this warning
1164:info:build   for (i = 0; name = names[i]; i++)
1165:info:build                    ^
1166:info:build               (              )
1167:info:build bind.c:2117:20: note: use '==' to turn this assignment into an equality comparison
1168:info:build   for (i = 0; name = names[i]; i++)
1169:info:build                    ^
1170:info:build                    ==
1171:info:build no
1172:info:build checking minix/config.h presence... no
1173:info:build checking for minix/config.h... no
1174:info:build checking whether it is safe to define __EXTENSIONS__... yes
1175:info:build checking for strtoull... yes
1176:info:build checking for a BSD-compatible install... /usr/bin/install -c
1177:info:build checking how to print strings... printf
1178:info:build checking for a sed that does not truncate output... /opt/local/bin/gsed
1179:info:build checking for fgrep... /opt/local/bin/ggrep -F
1180:info:build checking for ld used by /usr/bin/clang... yes
1181:info:build /Library/Developer/CommandLineTools/usr/bin/ld
1182:info:build checking if the linker (/Library/Developer/CommandLineTools/usr/bin/ld) is GNU ld... checking for strverscmp... no
1183:info:build checking for BSD- or MS-compatible name lister (nm)... nm
1184:info:build checking the name lister (nm) interface... BSD nm
1185:info:build checking whether ln -s works... yes
1186:info:build checking the maximum length of command line arguments... 786432
1187:info:build checking whether the shell understands some XSI constructs... yes
1188:info:build checking whether the shell understands "+="... yes
1189:info:build no
1190:info:build 3 warnings generated.
1191:info:build checking for /Library/Developer/CommandLineTools/usr/bin/ld option to reload object files... -r
1192:info:build checking for tmpnam... checking for x86_64-apple-darwin20.1.0-objdump... objdump
1193:info:build checking how to recognize dependent libraries... pass_all
1194:info:build checking for x86_64-apple-darwin20.1.0-ar... (cached) ar
1195:info:build checking for x86_64-apple-darwin20.1.0-strip... no
1196:info:build checking for strip... strip
1197:info:build checking for x86_64-apple-darwin20.1.0-ranlib... (cached) ranlib
1198:info:build checking for gawk... gawk
1199:info:build checking command to parse nm output from /usr/bin/clang object... 4 warnings generated.
1200:info:build make[2]: Leaving directory `/opt/local/var/macports/build/_opt_local_var_macports_sources_rsync.macports.org_macports_release_tarballs_ports_cross_avr-gdb/avr-gdb/work/gdb-8.0/readline'
1201:info:build make[1]: *** [all-readline] Error 2
1202:info:build make[1]: *** Waiting for unfinished jobs....
1203:info:build yes
1204:info:build checking for vasprintf... yes
1205:info:build checking for vfprintf... yes
1206:info:build ok
1207:info:build checking for x86_64-apple-darwin20.1.0-dsymutil... checking for vprintf... no
1208:info:build checking for dsymutil... dsymutil
1209:info:build checking for x86_64-apple-darwin20.1.0-nmedit... no
1210:info:build checking for nmedit... nmedit
1211:info:build checking for x86_64-apple-darwin20.1.0-lipo... no
1212:info:build checking for lipo... lipo
1213:info:build checking for x86_64-apple-darwin20.1.0-otool... no
1214:info:build checking for otool... otool
1215:info:build checking for x86_64-apple-darwin20.1.0-otool64... no
1216:info:build checking for otool64... no
1217:info:build checking for -single_module linker flag... yes
1218:info:build checking for -exported_symbols_list linker flag... yes
1219:info:build checking for vsnprintf... yes
1220:info:build checking for -force_load linker flag... yes
1221:info:build checking for vsprintf... yes
1222:info:build yes
1223:info:build checking for dlfcn.h... checking for waitpid... yes
1224:info:build checking whether byte ordering is bigendian... yes
1225:info:build checking for setproctitle... no
1226:info:build checking whether alloca needs Cray hooks... no
1227:info:build checking for x86_64-apple-darwin20.1.0-ranlib... (cached) ranlib
1228:info:build checking dependency style of /usr/bin/clang... no
1229:info:build checking stack direction for C alloca... -1
1230:info:build checking for vfork.h... gcc3
1231:info:build checking for make... /Library/Developer/CommandLineTools/usr/bin/make
1232:info:build checking whether NLS is requested... yes
1233:info:build checking for catalogs to be installed...
1234:info:build checking for stdlib.h... (cached) yes
1235:info:build checking for string.h... (cached) yes
1236:info:build no
1237:info:build checking for fork... checking for strings.h... (cached) yes
1238:info:build checking for unistd.h... (cached) yes
1239:info:build checking time.h usability... yes
1240:info:build checking time.h presence... yes
1241:info:build checking for vfork... yes
1242:info:build checking for time.h... yes
1243:info:build checking sys/time.h usability... yes
1244:info:build yes
1245:info:build checking sys/time.h presence... checking for working fork... yes
1246:info:build checking for sys/time.h... yes
1247:info:build checking sys/times.h usability... yes
1248:info:build checking sys/times.h presence... yes
1249:info:build checking for sys/times.h... yes
1250:info:build checking sys/resource.h usability... yes
1251:info:build checking for working vfork... (cached) yes
1252:info:build checking for _doprnt... yes
1253:info:build checking sys/resource.h presence... yes
1254:info:build checking for sys/resource.h... yes
1255:info:build checking sys/mman.h usability... no
1256:info:build checking for sys_errlist... yes
1257:info:build checking sys/mman.h presence... yes
1258:info:build checking for sys/mman.h... yes
1259:info:build checking fcntl.h usability... yes
1260:info:build checking for sys_nerr... yes
1261:info:build checking fcntl.h presence... yes
1262:info:build checking for fcntl.h... yes
1263:info:build yes
1264:info:build checking fpu_control.h usability... checking for sys_siglist... no
1265:info:build checking fpu_control.h presence... yes
1266:info:build checking for external symbol _system_configuration... no
1267:info:build checking for fpu_control.h... no
1268:info:build checking for dlfcn.h... (cached) yes
1269:info:build checking errno.h usability... no
1270:info:build checking for __fsetlocking... yes
1271:info:build checking errno.h presence... yes
1272:info:build checking for errno.h... yes
1273:info:build checking for sys/stat.h... (cached) yes
1274:info:build no
1275:info:build checking for getrusage... checking for canonicalize_file_name... yes
1276:info:build no
1277:info:build checking for time... checking for dup3... yes
1278:info:build no
1279:info:build checking for sigaction... checking for getrlimit... yes
1280:info:build yes
1281:info:build checking for __setfpucw... checking for getrusage... yes
1282:info:build no
1283:info:build checking for getsysinfo... checking for mmap... yes
1284:info:build no
1285:info:build checking for munmap... checking for gettimeofday... (cached) yes
1286:info:build checking for on_exit... yes
1287:info:build checking for lstat... no
1288:info:build checking for psignal... yes
1289:info:build checking for truncate... yes
1290:info:build checking for pstat_getdynamic... yes
1291:info:build checking for ftruncate... no
1292:info:build checking for pstat_getstatic... yes
1293:info:build checking for posix_fallocate... no
1294:info:build checking for realpath... no
1295:info:build checking for struct stat.st_dev... yes
1296:info:build checking for setrlimit... yes
1297:info:build checking for struct stat.st_ino... yes
1298:info:build yes
1299:info:build checking for struct stat.st_mode... checking for sbrk... yes
1300:info:build checking for struct stat.st_nlink... yes
1301:info:build yes
1302:info:build checking for spawnve... checking for struct stat.st_uid... yes
1303:info:build checking for struct stat.st_gid... no
1304:info:build checking for spawnvpe... yes
1305:info:build checking for struct stat.st_rdev... yes
1306:info:build checking for struct stat.st_size... no
1307:info:build checking for strerror... yes
1308:info:build checking for struct stat.st_blksize... yes
1309:info:build checking for struct stat.st_blocks... yes
1310:info:build checking for strsignal... yes
1311:info:build checking for struct stat.st_atime... yes
1312:info:build checking for struct stat.st_mtime... yes
1313:info:build checking for sysconf... yes
1314:info:build checking for struct stat.st_ctime... yes
1315:info:build checking for socklen_t... yes
1316:info:build checking for sysctl... yes
1317:info:build yes
1318:info:build checking for bind in -lsocket... checking for sysmp... no
1319:info:build checking for gethostbyname in -lnsl... no
1320:info:build checking for table... no
1321:info:build checking for dlfcn.h... (cached) yes
1322:info:build checking for windows.h... no
1323:info:build checking for library containing dlopen... no
1324:info:build checking for times... none required
1325:info:build checking for objdir... yes
1326:info:build .libs
1327:info:build checking for wait3... yes
1328:info:build checking for wait4... checking if /usr/bin/clang supports -fno-rtti -fno-exceptions... yes
1329:info:build yes
1330:info:build checking for /usr/bin/clang option to produce PIC... -fno-common -DPIC
1331:info:build checking if /usr/bin/clang PIC flag -fno-common -DPIC works... checking whether basename is declared... yes
1332:info:build checking if /usr/bin/clang static flag -static works... no
1333:info:build checking whether ffs is declared... no
1334:info:build checking if /usr/bin/clang supports -c -o file.o... yes
1335:info:build checking whether asprintf is declared... yes
1336:info:build checking if /usr/bin/clang supports -c -o file.o... (cached) yes
1337:info:build checking whether the /usr/bin/clang linker (/Library/Developer/CommandLineTools/usr/bin/ld) supports shared libraries... yes
1338:info:build checking dynamic linker characteristics... yes
1339:info:build checking whether vasprintf is declared... darwin20.1.0 dyld
1340:info:build checking how to hardcode library paths into programs... immediate
1341:info:build checking for dlopen in -ldl... yes
1342:info:build checking whether snprintf is declared... yes
1343:info:build checking whether a program can dlopen itself... yes
1344:info:build checking whether vsnprintf is declared... yes
1345:info:build checking whether calloc is declared... yes
1346:info:build checking whether getenv is declared... yes
1347:info:build checking whether a statically linked program can dlopen itself... yes
1348:info:build checking whether getopt is declared... yes
1349:info:build checking whether malloc is declared... yes
1350:info:build checking whether stripping libraries is possible... yes
1351:info:build checking if libtool supports shared libraries... yes
1352:info:build checking whether to build shared libraries... yes
1353:info:build checking whether to build static libraries... yes
1354:info:build checking whether to enable maintainer-specific portions of Makefiles... no
1355:info:build checking for sim debug setting... 0
1356:info:build checking for sim stdio debug behavior... 0
1357:info:build checking for sim trace settings... ~TRACE_debug
1358:info:build checking for sim profile settings... -1
1359:info:build checking whether to enable sim asserts... 1
1360:info:build checking default sim environment setting... ALL_ENVIRONMENT
1361:info:build checking return type of signal handlers... yes
1362:info:build checking whether realloc is declared... void
1363:info:build checking compiler warning flags... yes
1364:info:build checking whether sbrk is declared... yes
1365:info:build checking whether strtol is declared... yes
1366:info:build checking whether strtoul is declared... yes
1367:info:build checking whether strtoll is declared... yes
1368:info:build checking whether strtoull is declared... yes
1369:info:build checking whether strverscmp is declared... no
1370:info:build checking whether strnlen is declared... yes
1371:info:build checking whether canonicalize_file_name must be declared... yes
1372:info:build checking for stdlib.h... (cached) yes
1373:info:build checking for unistd.h... (cached) yes
1374:info:build checking for getpagesize... (cached) yes
1375:info:build checking for working mmap...  -Wall -Wdeclaration-after-statement -Wpointer-arith -Wpointer-sign -Wno-unused -Wunused-value -Wunused-function -Wno-switch -Wno-char-subscripts -Wmissing-prototypes -Wdeclaration-after-statement -Wempty-body -Wmissing-parameter-type -Wold-style-declaration -Wold-style-definition -Wformat-nonliteral
1376:info:build configure: updating cache .././config.cache
1377:info:build configure: creating ./config.status
1378:info:build yes
1379:info:build checking for working strncmp... no
1380:info:build configure: updating cache ./config.cache
1381:info:build configure: creating ./config.status
1382:info:build config.status: creating Makefile
1383:info:build config.status: creating testsuite/Makefile
1384:info:build config.status: creating config.h
1385:info:build config.status: executing default commands
1386:info:build config.status: creating Makefile.sim
1387:info:build config.status: creating Make-common.sim
1388:info:build config.status: creating .gdbinit
1389:info:build config.status: creating config.h
1390:info:build config.status: executing depdir commands
1391:info:build mkdir .deps
1392:info:build config.status: executing libtool commands
1393:info:build config.status: executing Makefile commands
1394:info:build Merging Makefile.sim+Make-common.sim into Makefile ...
1395:info:build config.status: executing stamp-h commands
1396:info:build === configuring in testsuite (/opt/local/var/macports/build/_opt_local_var_macports_sources_rsync.macports.org_macports_release_tarballs_ports_cross_avr-gdb/avr-gdb/work/gdb-8.0/sim/testsuite)
1397:info:build configure: running /bin/sh ./configure --disable-option-checking '--prefix=/opt/local'  '--mandir=/opt/local/share/man' '--infodir=/opt/local/share/info' '--disable-werror' '--program-transform-name=s&^&avr-&' '--build=x86_64-apple-darwin20.1.0' '--host=x86_64-apple-darwin20.1.0' '--target=avr' 'build_alias=x86_64-apple-darwin20.1.0' 'host_alias=x86_64-apple-darwin20.1.0' 'target_alias=avr' 'CC=/usr/bin/clang' 'CFLAGS=-pipe -Os -isysroot/Library/Developer/CommandLineTools/SDKs/MacOSX11.0.sdk -arch x86_64' 'LDFLAGS=  -L/opt/local/lib -Wl,-headerpad_max_install_names -Wl,-syslibroot,/Library/Developer/CommandLineTools/SDKs/MacOSX11.0.sdk -arch x86_64' --cache-file=.././config.cache --srcdir=.
1398:info:build configure: loading cache .././config.cache
1399:info:build checking build system type... (cached) x86_64-apple-darwin20.1.0
1400:info:build checking host system type... (cached) x86_64-apple-darwin20.1.0
1401:info:build checking target system type... (cached) avr-unknown-none
1402:info:build configure: creating ./config.status
1403:info:build config.status: creating Makefile
1404:info:build make[1]: Leaving directory `/opt/local/var/macports/build/_opt_local_var_macports_sources_rsync.macports.org_macports_release_tarballs_ports_cross_avr-gdb/avr-gdb/work/gdb-8.0'
1405:info:build make: *** [all] Error 2
1406:info:build make: Leaving directory `/opt/local/var/macports/build/_opt_local_var_macports_sources_rsync.macports.org_macports_release_tarballs_ports_cross_avr-gdb/avr-gdb/work/gdb-8.0'
1407:info:build Command failed:  cd "/opt/local/var/macports/build/_opt_local_var_macports_sources_rsync.macports.org_macports_release_tarballs_ports_cross_avr-gdb/avr-gdb/work/gdb-8.0" && /usr/bin/make -j8 -w all
1408:info:build Exit code: 2
1409:error:build Failed to build avr-gdb: command execution failed
1410:debug:build Error code: CHILDSTATUS 59110 2
1411:debug:build Backtrace: command execution failed
1412:debug:build     while executing
1413:debug:build "system {*}$notty {*}$nice $fullcmdstring"
1414:debug:build     invoked from within
1415:debug:build "command_exec build"
1416:debug:build     (procedure "portbuild::build_main" line 8)
1417:debug:build     invoked from within
1418:debug:build "$procedure $targetname"
1419:error:build See /opt/local/var/macports/logs/_opt_local_var_macports_sources_rsync.macports.org_macports_release_tarballs_ports_cross_avr-gdb/avr-gdb/main.log for details.