Ticket #62061: main.log

File main.log, 53.1 KB (added by dbl001 (dbl), 3 months ago)
Line 
1version:1
2:debug:sysinfo OS X 10.11 (darwin/15.6.0) arch i386
3:debug:sysinfo MacPorts 2.6.4
4:debug:sysinfo Xcode 8.2.1
5:debug:sysinfo SDK 10.11
6:debug:sysinfo MACOSX_DEPLOYMENT_TARGET: 10.11
7:msg:clean --->  Computing dependencies for mesa:info:clean .:debug:clean mesa has no conflicts
8:debug:clean Searching for dependency: xz
9:debug:clean Found Dependency: receipt exists for xz
10:debug:clean Searching for dependency: pkgconfig
11:debug:clean Found Dependency: receipt exists for pkgconfig
12:debug:clean Searching for dependency: flex
13:debug:clean Found Dependency: receipt exists for flex
14:debug:clean Searching for dependency: bison
15:debug:clean Found Dependency: receipt exists for bison
16:debug:clean Searching for dependency: gindent
17:debug:clean Found Dependency: receipt exists for gindent
18:debug:clean Searching for dependency: autoconf
19:debug:clean Found Dependency: receipt exists for autoconf
20:debug:clean Searching for dependency: automake
21:debug:clean Found Dependency: receipt exists for automake
22:debug:clean Searching for dependency: libtool
23:debug:clean Found Dependency: receipt exists for libtool
24:debug:clean Searching for dependency: py27-libxml2
25:debug:clean Found Dependency: receipt exists for py27-libxml2
26:debug:clean Searching for dependency: expat
27:debug:clean Found Dependency: receipt exists for expat
28:debug:clean Searching for dependency: xorg-xorgproto
29:debug:clean Found Dependency: receipt exists for xorg-xorgproto
30:debug:clean Searching for dependency: xorg-libxcb
31:debug:clean Found Dependency: receipt exists for xorg-libxcb
32:debug:clean Searching for dependency: xorg-libX11
33:debug:clean Found Dependency: receipt exists for xorg-libX11
34:debug:clean Searching for dependency: xorg-libXext
35:debug:clean Found Dependency: receipt exists for xorg-libXext
36:debug:clean Searching for dependency: xorg-libXdamage
37:debug:clean Found Dependency: receipt exists for xorg-libXdamage
38:debug:clean Searching for dependency: xorg-libXfixes
39:debug:clean Found Dependency: receipt exists for xorg-libXfixes
40:debug:clean Searching for dependency: xorg-libXi
41:debug:clean Found Dependency: receipt exists for xorg-libXi
42:debug:clean Searching for dependency: xorg-libXmu
43:debug:clean Found Dependency: receipt exists for xorg-libXmu
44:debug:clean Searching for dependency: xorg-libXxf86vm
45:debug:clean Found Dependency: receipt exists for xorg-libXxf86vm
46:debug:main Executing org.macports.main (mesa)
47:debug:main dropping privileges: euid changed to 503, egid changed to 502.
48:debug:archivefetch archivefetch phase started at Thu Jan 14 03:46:45 PST 2021
49:msg:archivefetch --->  Fetching archive for mesa
50:debug:archivefetch Executing org.macports.archivefetch (mesa)
51:debug:archivefetch euid/egid changed to: 0/0
52:debug:archivefetch chowned /opt/local/var/macports/incoming to macports
53:debug:archivefetch euid/egid changed to: 503/502
54:info:archivefetch --->  mesa-19.0.8_0+osmesa+python27.darwin_15.x86_64.tbz2 doesn't seem to exist in /opt/local/var/macports/incoming/verified
55:msg:archivefetch --->  Attempting to fetch mesa-19.0.8_0+osmesa+python27.darwin_15.x86_64.tbz2 from https://ywg.ca.packages.macports.org/mirror/macports/packages/mesa
56:debug:archivefetch Fetching archive failed: The requested URL returned error: 404 Not Found
57:msg:archivefetch --->  Attempting to fetch mesa-19.0.8_0+osmesa+python27.darwin_15.x86_64.tbz2 from https://kmq.jp.packages.macports.org/mesa
58:debug:archivefetch Fetching archive failed: The requested URL returned error: 404 Not Found
59:msg:archivefetch --->  Attempting to fetch mesa-19.0.8_0+osmesa+python27.darwin_15.x86_64.tbz2 from https://cph.dk.packages.macports.org/mesa
60:debug:archivefetch Fetching archive failed: The requested URL returned error: 404 Not Found
61:debug:archivefetch Privilege de-escalation not attempted as not running as root.
62:debug:fetch fetch phase started at Thu Jan 14 03:46:47 PST 2021
63:notice:fetch --->  Fetching distfiles for mesa
64:debug:fetch elevating privileges for fetch: euid changed to 0, egid changed to 0.
65:debug:fetch dropping privileges: euid changed to 503, egid changed to 502.
66:debug:fetch Executing org.macports.fetch (mesa)
67:info:fetch --->  mesa-19.0.8.tar.xz does not exist in /opt/local/var/macports/distfiles/mesa
68:notice:fetch --->  Attempting to fetch mesa-19.0.8.tar.xz from https://ywg.ca.distfiles.macports.org/mirror/macports/distfiles/mesa
69:debug:fetch Privilege de-escalation not attempted as not running as root.
70:debug:checksum checksum phase started at Thu Jan 14 03:46:53 PST 2021
71:notice:checksum --->  Verifying checksums for mesa
72:debug:checksum Executing org.macports.checksum (mesa)
73:info:checksum --->  Checksumming mesa-19.0.8.tar.xz
74:debug:checksum Calculated (sha1) is 5fd340a6304f7501014e1bd7291e4cfa7a6efcdb
75:debug:checksum Correct (sha1) checksum for mesa-19.0.8.tar.xz
76:debug:checksum Calculated (rmd160) is c658d9e93d19bf2de694001c8c9886b8bb89ee2e
77:debug:checksum Correct (rmd160) checksum for mesa-19.0.8.tar.xz
78:debug:checksum Calculated (sha256) is d017eb53a810c32dabeedf6ca2238ae1e897ce9090e470e9ce1d6c9e3f1b0862
79:debug:checksum Correct (sha256) checksum for mesa-19.0.8.tar.xz
80:debug:checksum Calculated (size) is 11967592
81:debug:checksum Correct (size) checksum for mesa-19.0.8.tar.xz
82:debug:checksum Privilege de-escalation not attempted as not running as root.
83:debug:extract extract phase started at Thu Jan 14 03:46:53 PST 2021
84:notice:extract --->  Extracting mesa
85:debug:extract setting option extract.cmd to /opt/local/bin/xz
86:debug:extract Executing org.macports.extract (mesa)
87:info:extract --->  Extracting mesa-19.0.8.tar.xz
88:debug:extract setting option extract.args to '/opt/local/var/macports/distfiles/mesa/mesa-19.0.8.tar.xz'
89:debug:extract Environment:
90:debug:extract CC_PRINT_OPTIONS='YES'
91:debug:extract CC_PRINT_OPTIONS_FILE='/opt/local/var/macports/build/_opt_local_var_macports_sources_rsync.macports.org_release_tarballs_ports_x11_mesa/mesa/work/.CC_PRINT_OPTIONS'
92:debug:extract CPATH='/opt/local/include'
93:debug:extract DEVELOPER_DIR='/Library/Developer/CommandLineTools'
94:debug:extract LIBRARY_PATH='/opt/local/lib'
95:debug:extract MACOSX_DEPLOYMENT_TARGET='10.11'
96:info:extract Executing:  cd "/opt/local/var/macports/build/_opt_local_var_macports_sources_rsync.macports.org_release_tarballs_ports_x11_mesa/mesa/work" && /opt/local/bin/xz -dc '/opt/local/var/macports/distfiles/mesa/mesa-19.0.8.tar.xz' | /usr/bin/tar -xf -
97:debug:extract system:  cd "/opt/local/var/macports/build/_opt_local_var_macports_sources_rsync.macports.org_release_tarballs_ports_x11_mesa/mesa/work" && /opt/local/bin/xz -dc '/opt/local/var/macports/distfiles/mesa/mesa-19.0.8.tar.xz' | /usr/bin/tar -xf -
98:debug:extract euid/egid changed to: 0/0
99:debug:extract chowned /opt/local/var/macports/build/_opt_local_var_macports_sources_rsync.macports.org_release_tarballs_ports_x11_mesa/mesa/work to macports
100:debug:extract euid/egid changed to: 503/502
101:debug:extract Privilege de-escalation not attempted as not running as root.
102:debug:patch patch phase started at Thu Jan 14 03:46:57 PST 2021
103:debug:patch Executing org.macports.patch (mesa)
104:notice:patch --->  Applying patches to mesa
105:info:patch --->  Applying 0001-applegl-Provide-requirements-of-_SET_DrawBuffers.patch
106:debug:patch Environment:
107:debug:patch CC_PRINT_OPTIONS='YES'
108:debug:patch CC_PRINT_OPTIONS_FILE='/opt/local/var/macports/build/_opt_local_var_macports_sources_rsync.macports.org_release_tarballs_ports_x11_mesa/mesa/work/.CC_PRINT_OPTIONS'
109:debug:patch CPATH='/opt/local/include'
110:debug:patch DEVELOPER_DIR='/Library/Developer/CommandLineTools'
111:debug:patch LIBRARY_PATH='/opt/local/lib'
112:debug:patch MACOSX_DEPLOYMENT_TARGET='10.11'
113:info:patch Executing:  cd "/opt/local/var/macports/build/_opt_local_var_macports_sources_rsync.macports.org_release_tarballs_ports_x11_mesa/mesa/work/mesa-19.0.8" && /usr/bin/patch -p1 < '/opt/local/var/macports/sources/rsync.macports.org/release/tarballs/ports/x11/mesa/files/0001-applegl-Provide-requirements-of-_SET_DrawBuffers.patch'
114:debug:patch system:  cd "/opt/local/var/macports/build/_opt_local_var_macports_sources_rsync.macports.org_release_tarballs_ports_x11_mesa/mesa/work/mesa-19.0.8" && /usr/bin/patch -p1 < '/opt/local/var/macports/sources/rsync.macports.org/release/tarballs/ports/x11/mesa/files/0001-applegl-Provide-requirements-of-_SET_DrawBuffers.patch'
115:info:patch patching file src/glx/Makefile.am
116:info:patch Hunk #1 succeeded at 90 (offset -1 lines).
117:info:patch Hunk #2 succeeded at 133 (offset -1 lines).
118:info:patch patching file src/glx/apple/apple_glapi.c
119:info:patch --->  Applying 0002-Fall-back-on-clock_gettime-when-timespec_get-is-unav.patch
120:debug:patch Environment:
121:debug:patch CC_PRINT_OPTIONS='YES'
122:debug:patch CC_PRINT_OPTIONS_FILE='/opt/local/var/macports/build/_opt_local_var_macports_sources_rsync.macports.org_release_tarballs_ports_x11_mesa/mesa/work/.CC_PRINT_OPTIONS'
123:debug:patch CPATH='/opt/local/include'
124:debug:patch DEVELOPER_DIR='/Library/Developer/CommandLineTools'
125:debug:patch LIBRARY_PATH='/opt/local/lib'
126:debug:patch MACOSX_DEPLOYMENT_TARGET='10.11'
127:info:patch Executing:  cd "/opt/local/var/macports/build/_opt_local_var_macports_sources_rsync.macports.org_release_tarballs_ports_x11_mesa/mesa/work/mesa-19.0.8" && /usr/bin/patch -p1 < '/opt/local/var/macports/sources/rsync.macports.org/release/tarballs/ports/x11/mesa/files/0002-Fall-back-on-clock_gettime-when-timespec_get-is-unav.patch'
128:debug:patch system:  cd "/opt/local/var/macports/build/_opt_local_var_macports_sources_rsync.macports.org_release_tarballs_ports_x11_mesa/mesa/work/mesa-19.0.8" && /usr/bin/patch -p1 < '/opt/local/var/macports/sources/rsync.macports.org/release/tarballs/ports/x11/mesa/files/0002-Fall-back-on-clock_gettime-when-timespec_get-is-unav.patch'
129:info:patch patching file src/util/u_queue.c
130:debug:patch Privilege de-escalation not attempted as not running as root.
131:debug:configure configure phase started at Thu Jan 14 03:46:57 PST 2021
132:notice:configure --->  Configuring mesa
133:debug:configure Preferred compilers: clang macports-clang-9.0 macports-clang-8.0 macports-clang-7.0 macports-clang-6.0 macports-clang-5.0 macports-clang-3.7 macports-clang-3.4
134:debug:configure Using compiler 'Xcode Clang'
135:debug:configure Executing proc-pre-org.macports.configure-configure-0
136:debug:configure Executing org.macports.configure (mesa)
137:debug:configure Environment:
138:debug:configure CC_PRINT_OPTIONS='YES'
139:debug:configure CC_PRINT_OPTIONS_FILE='/opt/local/var/macports/build/_opt_local_var_macports_sources_rsync.macports.org_release_tarballs_ports_x11_mesa/mesa/work/.CC_PRINT_OPTIONS'
140:debug:configure CPATH='/opt/local/include'
141:debug:configure DEVELOPER_DIR='/Library/Developer/CommandLineTools'
142:debug:configure LIBRARY_PATH='/opt/local/lib'
143:debug:configure MACOSX_DEPLOYMENT_TARGET='10.11'
144:info:configure Executing:  cd "/opt/local/var/macports/build/_opt_local_var_macports_sources_rsync.macports.org_release_tarballs_ports_x11_mesa/mesa/work/mesa-19.0.8" && autoreconf -fvi
145:debug:configure system:  cd "/opt/local/var/macports/build/_opt_local_var_macports_sources_rsync.macports.org_release_tarballs_ports_x11_mesa/mesa/work/mesa-19.0.8" && autoreconf -fvi
146:info:configure autoreconf: Entering directory `.'
147:info:configure autoreconf: configure.ac: not using Gettext
148:info:configure autoreconf: running: /opt/local/bin/aclocal --force -I m4
149:info:configure autoreconf: configure.ac: tracing
150:info:configure autoreconf: running: /opt/local/bin/glibtoolize --copy --force
151:info:configure glibtoolize: putting auxiliary files in AC_CONFIG_AUX_DIR, 'bin'.
152:info:configure glibtoolize: copying file 'bin/ltmain.sh'
153:info:configure glibtoolize: putting macros in AC_CONFIG_MACRO_DIRS, 'm4'.
154:info:configure glibtoolize: copying file 'm4/libtool.m4'
155:info:configure glibtoolize: copying file 'm4/ltoptions.m4'
156:info:configure glibtoolize: copying file 'm4/ltsugar.m4'
157:info:configure glibtoolize: copying file 'm4/ltversion.m4'
158:info:configure glibtoolize: copying file 'm4/lt~obsolete.m4'
159:info:configure autoreconf: running: /opt/local/bin/autoconf --force
160:info:configure autoreconf: configure.ac: not using Autoheader
161:info:configure autoreconf: running: /opt/local/bin/automake --add-missing --copy --force-missing
162:info:configure configure.ac:74: installing 'bin/compile'
163:info:configure configure.ac:46: installing 'bin/missing'
164:info:configure src/Makefile.am: installing 'bin/depcomp'
165:info:configure autoreconf: Leaving directory `.'
166:debug:configure parse_environment: skipping invalid entry: 'export'
167:debug:configure Environment:
168:debug:configure CC='/usr/bin/clang'
169:debug:configure CC_PRINT_OPTIONS='YES'
170:debug:configure CC_PRINT_OPTIONS_FILE='/opt/local/var/macports/build/_opt_local_var_macports_sources_rsync.macports.org_release_tarballs_ports_x11_mesa/mesa/work/.CC_PRINT_OPTIONS'
171:debug:configure CFLAGS='-pipe -Os -arch x86_64'
172:debug:configure CPATH='/opt/local/include'
173:debug:configure CXX='/usr/bin/clang++'
174:debug:configure CXXFLAGS='-pipe -Os -stdlib=libc++ -arch x86_64'
175:debug:configure DEVELOPER_DIR='/Library/Developer/CommandLineTools'
176:debug:configure F90FLAGS='-pipe -Os -m64'
177:debug:configure FCFLAGS='-pipe -Os -m64'
178:debug:configure FFLAGS='-pipe -Os -m64'
179:debug:configure INDENT='/opt/local/bin/gindent'
180:debug:configure INSTALL='/usr/bin/install -c'
181:debug:configure LDFLAGS='-L/opt/local/lib -Wl,-headerpad_max_install_names -arch x86_64'
182:debug:configure LIBRARY_PATH='/opt/local/lib'
183:debug:configure MACOSX_DEPLOYMENT_TARGET='10.11'
184:debug:configure OBJC='/usr/bin/clang'
185:debug:configure OBJCFLAGS='-pipe -Os -arch x86_64'
186:debug:configure OBJCXX='/usr/bin/clang++'
187:debug:configure OBJCXXFLAGS='-pipe -Os -stdlib=libc++ -arch x86_64'
188:debug:configure PYTHON2='/opt/local/bin/python2.7'
189:debug:configure ac_cv_func_timespec_get='no'
190:info:configure Executing:  cd "/opt/local/var/macports/build/_opt_local_var_macports_sources_rsync.macports.org_release_tarballs_ports_x11_mesa/mesa/work/mesa-19.0.8" && ./configure --prefix=/opt/local --enable-autotools --disable-silent-rules --with-platforms=x11 --disable-egl --disable-gbm --disable-llvm-shared-libs --with-gallium-drivers= --enable-osmesa
191:debug:configure system:  cd "/opt/local/var/macports/build/_opt_local_var_macports_sources_rsync.macports.org_release_tarballs_ports_x11_mesa/mesa/work/mesa-19.0.8" && ./configure --prefix=/opt/local --enable-autotools --disable-silent-rules --with-platforms=x11 --disable-egl --disable-gbm --disable-llvm-shared-libs --with-gallium-drivers= --enable-osmesa
192:info:configure checking build system type... x86_64-apple-darwin15.6.0
193:info:configure checking host system type... x86_64-apple-darwin15.6.0
194:info:configure checking target system type... x86_64-apple-darwin15.6.0
195:info:configure checking for a BSD-compatible install... /usr/bin/install -c
196:info:configure checking whether build environment is sane... yes
197:info:configure checking for a thread-safe mkdir -p... /opt/local/bin/gmkdir -p
198:info:configure checking for gawk... gawk
199:info:configure checking whether make sets $(MAKE)... yes
200:info:configure checking whether make supports nested variables... yes
201:info:configure checking whether UID '503' is supported by ustar format... yes
202:info:configure checking whether GID '502' is supported by ustar format... yes
203:info:configure checking how to create a ustar tar archive... gnutar
204:info:configure checking whether make supports nested variables... (cached) yes
205:info:configure checking whether make supports the include directive... yes (GNU style)
206:info:configure checking for gcc... /usr/bin/clang
207:info:configure checking whether the C compiler works... yes
208:info:configure checking for C compiler default output file name... a.out
209:info:configure checking for suffix of executables...
210:info:configure checking whether we are cross compiling... no
211:info:configure checking for suffix of object files... o
212:info:configure checking whether we are using the GNU C compiler... yes
213:info:configure checking whether /usr/bin/clang accepts -g... yes
214:info:configure checking for /usr/bin/clang option to accept ISO C89... none needed
215:info:configure checking whether /usr/bin/clang understands -c and -o together... yes
216:info:configure checking dependency style of /usr/bin/clang... gcc3
217:info:configure checking for ar... ar
218:info:configure checking the archiver (ar) interface... ar
219:info:configure checking how to run the C preprocessor... /usr/bin/clang -E
220:info:configure checking for gcc... (cached) /usr/bin/clang
221:info:configure checking whether we are using the GNU C compiler... (cached) yes
222:info:configure checking whether /usr/bin/clang accepts -g... (cached) yes
223:info:configure checking for /usr/bin/clang option to accept ISO C89... (cached) none needed
224:info:configure checking whether /usr/bin/clang understands -c and -o together... (cached) yes
225:info:configure checking dependency style of /usr/bin/clang... (cached) gcc3
226:info:configure checking whether we are using the GNU C++ compiler... yes
227:info:configure checking whether /usr/bin/clang++ accepts -g... yes
228:info:configure checking dependency style of /usr/bin/clang++... gcc3
229:info:configure checking for grep that handles long lines and -e... /opt/local/bin/ggrep
230:info:configure checking for BSD- or MS-compatible name lister (nm)... /opt/local/bin/nm -B
231:info:configure checking the name lister (/opt/local/bin/nm -B) interface... BSD nm
232:info:configure checking dependency style of /usr/bin/clang... gcc3
233:info:configure checking for GNU make... make
234:info:configure checking for a Python interpreter with version >= 2.7... python
235:info:configure checking for python... /usr/bin/python
236:info:configure checking for python version... 2.7
237:info:configure checking for python platform... darwin
238:info:configure checking for python script directory... ${prefix}/lib/python2.7/site-packages
239:info:configure checking for python extension module directory... ${exec_prefix}/lib/python2.7/site-packages
240:info:configure checking for a sed that does not truncate output... /opt/local/bin/gsed
241:info:configure checking for special C compiler options needed for large files... no
242:info:configure checking for _FILE_OFFSET_BITS value needed for large files... no
243:info:configure checking how to print strings... printf
244:info:configure checking for a sed that does not truncate output... (cached) /opt/local/bin/gsed
245:info:configure checking for egrep... /opt/local/bin/ggrep -E
246:info:configure checking for fgrep... /opt/local/bin/ggrep -F
247:info:configure checking for ld used by /usr/bin/clang... /Library/Developer/CommandLineTools/usr/bin/ld
248:info:configure checking if the linker (/Library/Developer/CommandLineTools/usr/bin/ld) is GNU ld... no
249:info:configure checking whether ln -s works... yes
250:info:configure checking the maximum length of command line arguments... 196608
251:info:configure checking how to convert x86_64-apple-darwin15.6.0 file names to x86_64-apple-darwin15.6.0 format... func_convert_file_noop
252:info:configure checking how to convert x86_64-apple-darwin15.6.0 file names to toolchain format... func_convert_file_noop
253:info:configure checking for /Library/Developer/CommandLineTools/usr/bin/ld option to reload object files... -r
254:info:configure checking for objdump... no
255:info:configure checking how to recognize dependent libraries... pass_all
256:info:configure checking for dlltool... no
257:info:configure checking how to associate runtime and link libraries... printf %s\n
258:info:configure checking for archiver @FILE support... no
259:info:configure checking for strip... strip
260:info:configure checking for ranlib... ranlib
261:info:configure checking command to parse /opt/local/bin/nm -B output from /usr/bin/clang object... ok
262:info:configure checking for sysroot... no
263:info:configure checking for a working dd... /bin/dd
264:info:configure checking how to truncate binary pipes... /bin/dd bs=4096 count=1
265:info:configure checking for mt... no
266:info:configure checking if : is a manifest tool... no
267:info:configure checking for dsymutil... dsymutil
268:info:configure checking for nmedit... nmedit
269:info:configure checking for lipo... lipo
270:info:configure checking for otool... otool
271:info:configure checking for otool64... no
272:info:configure checking for -single_module linker flag... yes
273:info:configure checking for -exported_symbols_list linker flag... yes
274:info:configure checking for -force_load linker flag... yes
275:info:configure checking for ANSI C header files... yes
276:info:configure checking for sys/types.h... yes
277:info:configure checking for sys/stat.h... yes
278:info:configure checking for stdlib.h... yes
279:info:configure checking for string.h... yes
280:info:configure checking for memory.h... yes
281:info:configure checking for strings.h... yes
282:info:configure checking for inttypes.h... yes
283:info:configure checking for stdint.h... yes
284:info:configure checking for unistd.h... yes
285:info:configure checking for dlfcn.h... yes
286:info:configure checking for objdir... .libs
287:info:configure checking if /usr/bin/clang supports -fno-rtti -fno-exceptions... yes
288:info:configure checking for /usr/bin/clang option to produce PIC... -fno-common -DPIC
289:info:configure checking if /usr/bin/clang PIC flag -fno-common -DPIC works... yes
290:info:configure checking if /usr/bin/clang static flag -static works... no
291:info:configure checking if /usr/bin/clang supports -c -o file.o... yes
292:info:configure checking if /usr/bin/clang supports -c -o file.o... (cached) yes
293:info:configure checking whether the /usr/bin/clang linker (/Library/Developer/CommandLineTools/usr/bin/ld) supports shared libraries... yes
294:info:configure checking dynamic linker characteristics... darwin15.6.0 dyld
295:info:configure checking how to hardcode library paths into programs... immediate
296:info:configure checking whether stripping libraries is possible... yes
297:info:configure checking if libtool supports shared libraries... yes
298:info:configure checking whether to build shared libraries... yes
299:info:configure checking whether to build static libraries... no
300:info:configure checking how to run the C++ preprocessor... /usr/bin/clang++ -E
301:info:configure checking for ld used by /usr/bin/clang++... /Library/Developer/CommandLineTools/usr/bin/ld
302:info:configure checking if the linker (/Library/Developer/CommandLineTools/usr/bin/ld) is GNU ld... no
303:info:configure checking whether the /usr/bin/clang++ linker (/Library/Developer/CommandLineTools/usr/bin/ld) supports shared libraries... yes
304:info:configure checking for /usr/bin/clang++ option to produce PIC... -fno-common -DPIC
305:info:configure checking if /usr/bin/clang++ PIC flag -fno-common -DPIC works... yes
306:info:configure checking if /usr/bin/clang++ static flag -static works... no
307:info:configure checking if /usr/bin/clang++ supports -c -o file.o... yes
308:info:configure checking if /usr/bin/clang++ supports -c -o file.o... (cached) yes
309:info:configure checking whether the /usr/bin/clang++ linker (/Library/Developer/CommandLineTools/usr/bin/ld) supports shared libraries... yes
310:info:configure checking dynamic linker characteristics... darwin15.6.0 dyld
311:info:configure checking how to hardcode library paths into programs... immediate
312:info:configure checking for rm... rm -f
313:info:configure checking for bison... bison -y
314:info:configure checking if bison is the parser generator... yes
315:info:configure checking for flex... flex
316:info:configure checking lex output file root... lex.yy
317:info:configure checking lex library... -lfl
318:info:configure checking whether yytext is a pointer... yes
319:info:configure checking if flex is the lexer generator... yes
320:info:configure checking for indent... /opt/local/bin/gindent
321:info:configure indent: Command line: unknown parameter "--version"
322:info:configure checking if module mako in python is installed... No module named mako
323:info:configure no
324:info:configure checking if compiling with clang... yes
325:info:configure checking whether __SUNPRO_C is declared... no
326:info:configure checking for __builtin_bswap32... yes
327:info:configure checking for __builtin_bswap64... yes
328:info:configure checking for __builtin_clz... yes
329:info:configure checking for __builtin_clzll... yes
330:info:configure checking for __builtin_ctz... yes
331:info:configure checking for __builtin_expect... yes
332:info:configure checking for __builtin_ffs... yes
333:info:configure checking for __builtin_ffsll... yes
334:info:configure checking for __builtin_popcount... yes
335:info:configure checking for __builtin_popcountll... yes
336:info:configure checking for __builtin_unreachable... yes
337:info:configure checking for __attribute__((const))... yes
338:info:configure checking for __attribute__((flatten))... yes
339:info:configure checking for __attribute__((format))... yes
340:info:configure checking for __attribute__((malloc))... yes
341:info:configure checking for __attribute__((packed))... yes
342:info:configure checking for __attribute__((pure))... yes
343:info:configure checking for __attribute__((returns_nonnull))... yes
344:info:configure checking for __attribute__((unused))... yes
345:info:configure checking for __attribute__((visibility))... no
346:info:configure checking for __attribute__((warn_unused_result))... yes
347:info:configure checking for __attribute__((weak))... yes
348:info:configure checking for __attribute__((alias))... no
349:info:configure checking for __attribute__((noreturn))... yes
350:info:configure checking for pkg-config... /opt/local/bin/pkg-config
351:info:configure checking pkg-config is at least version 0.9.0... yes
352:info:configure checking whether C compiler accepts -Wall... yes
353:info:configure checking whether C compiler accepts -Werror=implicit-function-declaration... yes
354:info:configure checking whether C compiler accepts -Werror=missing-prototypes... yes
355:info:configure checking whether C compiler accepts -Wmissing-prototypes... yes
356:info:configure checking whether C compiler accepts -Wmissing-field-initializers... yes
357:info:configure checking whether C compiler accepts -Wformat-truncation... no
358:info:configure checking whether C compiler accepts -fno-math-errno... yes
359:info:configure checking whether C compiler accepts -fno-trapping-math... yes
360:info:configure checking whether C compiler accepts -fvisibility=hidden... yes
361:info:configure checking whether C++ compiler accepts -Wall... yes
362:info:configure checking whether C++ compiler accepts -fno-math-errno... yes
363:info:configure checking whether C++ compiler accepts -fno-trapping-math... yes
364:info:configure checking whether C++ compiler accepts -fvisibility=hidden... yes
365:info:configure checking whether C++ compiler accepts -Wmissing-field-initializers... yes
366:info:configure checking whether C++ compiler accepts -Wformat-truncation... no
367:info:configure checking whether C compiler accepts -Werror=pointer-arith... yes
368:info:configure checking whether C compiler accepts -Werror=vla... yes
369:info:configure checking whether C++ compiler accepts -Werror=pointer-arith... yes
370:info:configure checking whether C++ compiler accepts -Werror=vla... yes
371:info:configure checking whether c++11 is enabled by default... no
372:info:configure checking whether c++11 is enabled by via -std=c++11... yes
373:info:configure checking whether C compiler accepts -Woverride-init... no
374:info:configure checking whether C compiler accepts -Winitializer-overrides... yes
375:info:configure checking whether __atomic_load_n is supported... yes
376:info:configure checking whether __sync_add_and_fetch_8 is supported... yes
377:info:configure checking whether byte ordering is bigendian... no
378:info:configure checking whether gcc supports -mpower8-vector... no
379:info:configure checking if ld supports -Bsymbolic... no
380:info:configure checking whether ld supports --gc-sections... no
381:info:configure checking if the linker supports version-scripts... no
382:info:configure checking if the linker supports --dynamic-list... no
383:info:configure checking whether to enable assembly... no, platform not supported
384:info:configure checking whether sys/types.h defines makedev... yes
385:info:configure checking xlocale.h usability... yes
386:info:configure checking xlocale.h presence... yes
387:info:configure checking for xlocale.h... yes
388:info:configure checking sys/sysctl.h usability... yes
389:info:configure checking sys/sysctl.h presence... yes
390:info:configure checking for sys/sysctl.h... yes
391:info:configure checking endian.h usability... no
392:info:configure checking endian.h presence... no
393:info:configure checking for endian.h... no
394:info:configure checking for dlfcn.h... (cached) yes
395:info:configure checking for strtof... yes
396:info:configure checking for mkostemp... no
397:info:configure checking for timespec_get... (cached) no
398:info:configure checking for memfd_create... no
399:info:configure checking whether strtod has locale support... no
400:info:configure checking for dlopen... yes
401:info:configure checking for dladdr... yes
402:info:configure checking for dl_iterate_phdr... no
403:info:configure checking for posix_memalign... yes
404:info:configure checking for zlib >= 1.2.3... yes
405:info:configure checking whether pthreads work with -pthread... yes
406:info:configure checking for joinable pthread attribute... PTHREAD_CREATE_JOINABLE
407:info:configure checking if more special flags are required for pthreads... -D_THREAD_SAFE
408:info:configure checking for PTHREAD_PRIO_INHERIT... yes
409:info:configure checking whether pthread_setaffinity_np is supported... no
410:info:configure checking linux/futex.h usability... no
411:info:configure checking linux/futex.h presence... no
412:info:configure checking for linux/futex.h... no
413:info:configure checking for libelf... no
414:info:configure checking for elf_memory in -lelf... no
415:info:configure checking for llvm-config... no
416:info:configure checking for libdrm >= 2.4.75... no
417:info:configure checking for glproto >= 1.4.14... yes
418:info:configure checking for x11 xext xdamage >= 1.1 xfixes x11-xcb xcb xcb-glx >= 1.8.1... yes
419:info:configure checking for x11-xcb xcb xcb-dri2 >= 1.8 xcb-xfixes... yes
420:info:configure checking for expat... yes
421:info:configure Package libtizcore was not found in the pkg-config search path.
422:info:configure Perhaps you should add the directory containing `libtizcore.pc'
423:info:configure to the PKG_CONFIG_PATH environment variable
424:info:configure No package 'libtizcore' found
425:info:configure checking for valgrind... no
426:info:configure checking whether to enable Valgrind support... no
427:info:configure checking that generated files are newer than configure... done
428:info:configure configure: creating ./config.status
429:info:configure config.status: creating Makefile
430:info:configure config.status: creating src/Makefile
431:info:configure config.status: creating src/amd/Makefile
432:info:configure config.status: creating src/amd/vulkan/Makefile
433:info:configure config.status: creating src/broadcom/Makefile
434:info:configure config.status: creating src/compiler/Makefile
435:info:configure config.status: creating src/freedreno/Makefile
436:info:configure config.status: creating src/egl/Makefile
437:info:configure config.status: creating src/egl/main/egl.pc
438:info:configure config.status: creating src/egl/wayland/wayland-drm/Makefile
439:info:configure config.status: creating src/gallium/Makefile
440:info:configure config.status: creating src/gallium/auxiliary/Makefile
441:info:configure config.status: creating src/gallium/auxiliary/pipe-loader/Makefile
442:info:configure config.status: creating src/gallium/drivers/freedreno/Makefile
443:info:configure config.status: creating src/gallium/drivers/i915/Makefile
444:info:configure config.status: creating src/gallium/drivers/llvmpipe/Makefile
445:info:configure config.status: creating src/gallium/drivers/nouveau/Makefile
446:info:configure config.status: creating src/gallium/drivers/kmsro/Makefile
447:info:configure config.status: creating src/gallium/drivers/r300/Makefile
448:info:configure config.status: creating src/gallium/drivers/r600/Makefile
449:info:configure config.status: creating src/gallium/drivers/radeonsi/Makefile
450:info:configure config.status: creating src/gallium/drivers/softpipe/Makefile
451:info:configure config.status: creating src/gallium/drivers/svga/Makefile
452:info:configure config.status: creating src/gallium/drivers/swr/Makefile
453:info:configure config.status: creating src/gallium/drivers/tegra/Makefile
454:info:configure config.status: creating src/gallium/drivers/etnaviv/Makefile
455:info:configure config.status: creating src/gallium/drivers/v3d/Makefile
456:info:configure config.status: creating src/gallium/drivers/vc4/Makefile
457:info:configure config.status: creating src/gallium/drivers/virgl/Makefile
458:info:configure config.status: creating src/gallium/state_trackers/clover/Makefile
459:info:configure config.status: creating src/gallium/state_trackers/dri/Makefile
460:info:configure config.status: creating src/gallium/state_trackers/glx/xlib/Makefile
461:info:configure config.status: creating src/gallium/state_trackers/nine/Makefile
462:info:configure config.status: creating src/gallium/state_trackers/omx/Makefile
463:info:configure config.status: creating src/gallium/state_trackers/omx/bellagio/Makefile
464:info:configure config.status: creating src/gallium/state_trackers/omx/tizonia/Makefile
465:info:configure config.status: creating src/gallium/state_trackers/osmesa/Makefile
466:info:configure config.status: creating src/gallium/state_trackers/va/Makefile
467:info:configure config.status: creating src/gallium/state_trackers/vdpau/Makefile
468:info:configure config.status: creating src/gallium/state_trackers/xa/Makefile
469:info:configure config.status: creating src/gallium/state_trackers/xa/xa_tracker.h
470:info:configure config.status: creating src/gallium/state_trackers/xvmc/Makefile
471:info:configure config.status: creating src/gallium/targets/d3dadapter9/Makefile
472:info:configure config.status: creating src/gallium/targets/d3dadapter9/d3d.pc
473:info:configure config.status: creating src/gallium/targets/dri/Makefile
474:info:configure config.status: creating src/gallium/targets/libgl-xlib/Makefile
475:info:configure config.status: creating src/gallium/targets/omx/Makefile
476:info:configure config.status: creating src/gallium/targets/opencl/Makefile
477:info:configure config.status: creating src/gallium/targets/opencl/mesa.icd
478:info:configure config.status: creating src/gallium/targets/osmesa/Makefile
479:info:configure config.status: creating src/gallium/targets/osmesa/osmesa.pc
480:info:configure config.status: creating src/gallium/targets/pipe-loader/Makefile
481:info:configure config.status: creating src/gallium/targets/va/Makefile
482:info:configure config.status: creating src/gallium/targets/vdpau/Makefile
483:info:configure config.status: creating src/gallium/targets/xa/Makefile
484:info:configure config.status: creating src/gallium/targets/xa/xatracker.pc
485:info:configure config.status: creating src/gallium/targets/xvmc/Makefile
486:info:configure config.status: creating src/gallium/tests/trivial/Makefile
487:info:configure config.status: creating src/gallium/tests/unit/Makefile
488:info:configure config.status: creating src/gallium/winsys/etnaviv/drm/Makefile
489:info:configure config.status: creating src/gallium/winsys/freedreno/drm/Makefile
490:info:configure config.status: creating src/gallium/winsys/i915/drm/Makefile
491:info:configure config.status: creating src/gallium/winsys/nouveau/drm/Makefile
492:info:configure config.status: creating src/gallium/winsys/kmsro/drm/Makefile
493:info:configure config.status: creating src/gallium/winsys/radeon/drm/Makefile
494:info:configure config.status: creating src/gallium/winsys/amdgpu/drm/Makefile
495:info:configure config.status: creating src/gallium/winsys/svga/drm/Makefile
496:info:configure config.status: creating src/gallium/winsys/sw/dri/Makefile
497:info:configure config.status: creating src/gallium/winsys/sw/kms-dri/Makefile
498:info:configure config.status: creating src/gallium/winsys/sw/null/Makefile
499:info:configure config.status: creating src/gallium/winsys/sw/wrapper/Makefile
500:info:configure config.status: creating src/gallium/winsys/sw/xlib/Makefile
501:info:configure config.status: creating src/gallium/winsys/tegra/drm/Makefile
502:info:configure config.status: creating src/gallium/winsys/v3d/drm/Makefile
503:info:configure config.status: creating src/gallium/winsys/vc4/drm/Makefile
504:info:configure config.status: creating src/gallium/winsys/virgl/drm/Makefile
505:info:configure config.status: creating src/gallium/winsys/virgl/vtest/Makefile
506:info:configure config.status: creating src/gbm/Makefile
507:info:configure config.status: creating src/gbm/main/gbm.pc
508:info:configure config.status: creating src/glx/Makefile
509:info:configure config.status: creating src/glx/apple/Makefile
510:info:configure config.status: creating src/glx/tests/Makefile
511:info:configure config.status: creating src/glx/windows/Makefile
512:info:configure config.status: creating src/glx/windows/windowsdriproto.pc
513:info:configure config.status: creating src/gtest/Makefile
514:info:configure config.status: creating src/intel/Makefile
515:info:configure config.status: creating src/loader/Makefile
516:info:configure config.status: creating src/mapi/Makefile
517:info:configure config.status: creating src/mapi/es1api/glesv1_cm.pc
518:info:configure config.status: creating src/mapi/es2api/glesv2.pc
519:info:configure config.status: creating src/mapi/glapi/gen/Makefile
520:info:configure config.status: creating src/mesa/Makefile
521:info:configure config.status: creating src/mesa/gl.pc
522:info:configure config.status: creating src/mesa/drivers/dri/dri.pc
523:info:configure config.status: creating src/mesa/drivers/dri/common/Makefile
524:info:configure config.status: creating src/mesa/drivers/dri/i915/Makefile
525:info:configure config.status: creating src/mesa/drivers/dri/i965/Makefile
526:info:configure config.status: creating src/mesa/drivers/dri/Makefile
527:info:configure config.status: creating src/mesa/drivers/dri/nouveau/Makefile
528:info:configure config.status: creating src/mesa/drivers/dri/r200/Makefile
529:info:configure config.status: creating src/mesa/drivers/dri/radeon/Makefile
530:info:configure config.status: creating src/mesa/drivers/dri/swrast/Makefile
531:info:configure config.status: creating src/mesa/drivers/osmesa/Makefile
532:info:configure config.status: creating src/mesa/drivers/osmesa/osmesa.pc
533:info:configure config.status: creating src/mesa/drivers/x11/Makefile
534:info:configure config.status: creating src/mesa/main/tests/Makefile
535:info:configure config.status: creating src/mesa/state_tracker/tests/Makefile
536:info:configure config.status: creating src/util/Makefile
537:info:configure config.status: creating src/util/tests/fast_idiv_by_const/Makefile
538:info:configure config.status: creating src/util/tests/hash_table/Makefile
539:info:configure config.status: creating src/util/tests/set/Makefile
540:info:configure config.status: creating src/util/tests/string_buffer/Makefile
541:info:configure config.status: creating src/util/tests/vma/Makefile
542:info:configure config.status: creating src/util/xmlpool/Makefile
543:info:configure config.status: creating src/vulkan/Makefile
544:info:configure config.status: executing depfiles commands
545:info:configure config.status: executing libtool commands
546:info:configure         prefix:          /opt/local
547:info:configure         exec_prefix:     ${prefix}
548:info:configure         libdir:          ${exec_prefix}/lib
549:info:configure         includedir:      ${prefix}/include
550:info:configure         OpenGL:          yes (ES1: yes ES2: yes)
551:info:configure         OSMesa:          libOSMesa
552:info:configure         DRI platform:    apple
553:info:configure         DRI drivers:     swrast
554:info:configure         DRI driver dir:  ${libdir}/dri
555:info:configure         GLX:             DRI-based
556:info:configure         EGL:             no
557:info:configure         GBM:             no
558:info:configure         EGL/Vulkan/VL platforms:   x11
559:info:configure         Vulkan drivers:  no
560:info:configure         llvm:            no
561:info:configure         Gallium:         no
562:info:configure         HUD extra stats: no
563:info:configure         HUD lmsensors:   no
564:info:configure         Shared libs:     yes
565:info:configure         Static libs:     no
566:info:configure         Shared-glapi:    yes
567:info:configure         CFLAGS:          -pipe -Os -arch x86_64 -std=c99 -Qunused-arguments
568:info:configure         CXXFLAGS:        -pipe -Os -stdlib=libc++ -arch x86_64 -Wall -fno-math-errno -fno-trapping-math -Wno-missing-field-initializers -Qunused-arguments
569:info:configure         CXX11_CXXFLAGS:  -std=c++11
570:info:configure         LDFLAGS:         -L/opt/local/lib -Wl,-headerpad_max_install_names -arch x86_64
571:info:configure         Macros:          -D__STDC_CONSTANT_MACROS -D__STDC_FORMAT_MACROS -D__STDC_LIMIT_MACROS -DUSE_SSE41 -DUSE_GCC_ATOMIC_BUILTINS -DNDEBUG -DHAVE_XLOCALE_H -DHAVE_SYS_SYSCTL_H -DHAVE_DLFCN_H -DHAVE_STRTOF -DHAVE_POSIX_MEMALIGN -DHAVE_ZLIB -DGLX_USE_APPLEGL -DGLX_INDIRECT_RENDERING -DGLX_DIRECT_RENDERING -DGLX_USE_TLS -DHAVE_X11_PLATFORM -DBUILDING_MESA -DENABLE_SHADER_CACHE
572:info:configure         PYTHON:         /usr/bin/python
573:info:configure         Run 'make' to build Mesa
574:debug:configure Privilege de-escalation not attempted as not running as root.
575:debug:build build phase started at Thu Jan 14 03:49:07 PST 2021
576:notice:build --->  Building mesa
577:debug:build Executing org.macports.build (mesa)
578:debug:build Environment:
579:debug:build CC_PRINT_OPTIONS='YES'
580:debug:build CC_PRINT_OPTIONS_FILE='/opt/local/var/macports/build/_opt_local_var_macports_sources_rsync.macports.org_release_tarballs_ports_x11_mesa/mesa/work/.CC_PRINT_OPTIONS'
581:debug:build CPATH='/opt/local/include'
582:debug:build DEVELOPER_DIR='/Library/Developer/CommandLineTools'
583:debug:build LIBRARY_PATH='/opt/local/lib'
584:debug:build MACOSX_DEPLOYMENT_TARGET='10.11'
585:info:build Executing:  cd "/opt/local/var/macports/build/_opt_local_var_macports_sources_rsync.macports.org_release_tarballs_ports_x11_mesa/mesa/work/mesa-19.0.8" && /usr/bin/make -j2 -w all
586:debug:build system:  cd "/opt/local/var/macports/build/_opt_local_var_macports_sources_rsync.macports.org_release_tarballs_ports_x11_mesa/mesa/work/mesa-19.0.8" && /usr/bin/make -j2 -w all
587:info:build make: Entering directory `/opt/local/var/macports/build/_opt_local_var_macports_sources_rsync.macports.org_release_tarballs_ports_x11_mesa/mesa/work/mesa-19.0.8'
588:info:build Making all in src
589:info:build make[1]: Entering directory `/opt/local/var/macports/build/_opt_local_var_macports_sources_rsync.macports.org_release_tarballs_ports_x11_mesa/mesa/work/mesa-19.0.8/src'
590:info:build updating git_sha1.h
591:info:build /Library/Developer/CommandLineTools/usr/bin/make  all-recursive
592:info:build make[2]: Entering directory `/opt/local/var/macports/build/_opt_local_var_macports_sources_rsync.macports.org_release_tarballs_ports_x11_mesa/mesa/work/mesa-19.0.8/src'
593:info:build Making all in .
594:info:build make[3]: Entering directory `/opt/local/var/macports/build/_opt_local_var_macports_sources_rsync.macports.org_release_tarballs_ports_x11_mesa/mesa/work/mesa-19.0.8/src'
595:info:build depbase=`echo mesa/main/extensions_table.lo | sed 's|[^/]*$|.deps/&|;s|\.lo$||'`;\
596:info:build     /bin/sh ../libtool  --tag=CC   --mode=compile /usr/bin/clang -DPACKAGE_NAME=\"Mesa\" -DPACKAGE_TARNAME=\"mesa\" -DPACKAGE_VERSION=\"19.0.8\" -DPACKAGE_STRING=\"Mesa\ 19.0.8\" -DPACKAGE_BUGREPORT=\"https://bugs.freedesktop.org/enter_bug.cgi\?product=Mesa\" -DPACKAGE_URL=\"\" -DPACKAGE=\"mesa\" -DVERSION=\"19.0.8\" -DSTDC_HEADERS=1 -DHAVE_SYS_TYPES_H=1 -DHAVE_SYS_STAT_H=1 -DHAVE_STDLIB_H=1 -DHAVE_STRING_H=1 -DHAVE_MEMORY_H=1 -DHAVE_STRINGS_H=1 -DHAVE_INTTYPES_H=1 -DHAVE_STDINT_H=1 -DHAVE_UNISTD_H=1 -DHAVE_DLFCN_H=1 -DLT_OBJDIR=\".libs/\" -DYYTEXT_POINTER=1 -DHAVE___BUILTIN_BSWAP32=1 -DHAVE___BUILTIN_BSWAP64=1 -DHAVE___BUILTIN_CLZ=1 -DHAVE___BUILTIN_CLZLL=1 -DHAVE___BUILTIN_CTZ=1 -DHAVE___BUILTIN_EXPECT=1 -DHAVE___BUILTIN_FFS=1 -DHAVE___BUILTIN_FFSLL=1 -DHAVE___BUILTIN_POPCOUNT=1 -DHAVE___BUILTIN_POPCOUNTLL=1 -DHAVE___BUILTIN_UNREACHABLE=1 -DHAVE_FUNC_ATTRIBUTE_CONST=1 -DHAVE_FUNC_ATTRIBUTE_FLATTEN=1 -DHAVE_FUNC_ATTRIBUTE_FORMAT=1 -DHAVE_FUNC_ATTRIBUTE_MALLOC=1 -DHAVE_FUNC_ATTRIBUTE_PACKED=1 -DHAVE_FUNC_ATTRIBUTE_PURE=1 -DHAVE_FUNC_ATTRIBUTE_RETURNS_NONNULL=1 -DHAVE_FUNC_ATTRIBUTE_UNUSED=1 -DHAVE_FUNC_ATTRIBUTE_WARN_UNUSED_RESULT=1 -DHAVE_FUNC_ATTRIBUTE_WEAK=1 -DHAVE_FUNC_ATTRIBUTE_NORETURN=1 -DHAVE_DLADDR=1 -DHAVE_PTHREAD_PRIO_INHERIT=1 -DHAVE_PTHREAD=1 -DENABLE_ST_OMX_BELLAGIO=0 -DENABLE_ST_OMX_TIZONIA=0 -I.  -I../include/ -I../src/mapi/ -I../src/mesa/ -I../src/gallium/include -I../src/gallium/auxiliary -D__STDC_CONSTANT_MACROS -D__STDC_FORMAT_MACROS -D__STDC_LIMIT_MACROS -DUSE_SSE41 -DUSE_GCC_ATOMIC_BUILTINS -DNDEBUG -DHAVE_XLOCALE_H -DHAVE_SYS_SYSCTL_H -DHAVE_DLFCN_H -DHAVE_STRTOF -DHAVE_POSIX_MEMALIGN -DHAVE_ZLIB -DGLX_USE_APPLEGL -DGLX_INDIRECT_RENDERING -DGLX_DIRECT_RENDERING -DGLX_USE_TLS -DHAVE_X11_PLATFORM -DBUILDING_MESA -DENABLE_SHADER_CACHE  -fvisibility=hidden -pipe -Os -arch x86_64 -std=c99 -Qunused-arguments  -MT mesa/main/extensions_table.lo -MD -MP -MF $depbase.Tpo -c -o mesa/main/extensions_table.lo mesa/main/extensions_table.c &&\
597:info:build     mv -f $depbase.Tpo $depbase.Plo
598:info:build depbase=`echo mesa/main/imports.lo | sed 's|[^/]*$|.deps/&|;s|\.lo$||'`;\
599:info:build     /bin/sh ../libtool  --tag=CC   --mode=compile /usr/bin/clang -DPACKAGE_NAME=\"Mesa\" -DPACKAGE_TARNAME=\"mesa\" -DPACKAGE_VERSION=\"19.0.8\" -DPACKAGE_STRING=\"Mesa\ 19.0.8\" -DPACKAGE_BUGREPORT=\"https://bugs.freedesktop.org/enter_bug.cgi\?product=Mesa\" -DPACKAGE_URL=\"\" -DPACKAGE=\"mesa\" -DVERSION=\"19.0.8\" -DSTDC_HEADERS=1 -DHAVE_SYS_TYPES_H=1 -DHAVE_SYS_STAT_H=1 -DHAVE_STDLIB_H=1 -DHAVE_STRING_H=1 -DHAVE_MEMORY_H=1 -DHAVE_STRINGS_H=1 -DHAVE_INTTYPES_H=1 -DHAVE_STDINT_H=1 -DHAVE_UNISTD_H=1 -DHAVE_DLFCN_H=1 -DLT_OBJDIR=\".libs/\" -DYYTEXT_POINTER=1 -DHAVE___BUILTIN_BSWAP32=1 -DHAVE___BUILTIN_BSWAP64=1 -DHAVE___BUILTIN_CLZ=1 -DHAVE___BUILTIN_CLZLL=1 -DHAVE___BUILTIN_CTZ=1 -DHAVE___BUILTIN_EXPECT=1 -DHAVE___BUILTIN_FFS=1 -DHAVE___BUILTIN_FFSLL=1 -DHAVE___BUILTIN_POPCOUNT=1 -DHAVE___BUILTIN_POPCOUNTLL=1 -DHAVE___BUILTIN_UNREACHABLE=1 -DHAVE_FUNC_ATTRIBUTE_CONST=1 -DHAVE_FUNC_ATTRIBUTE_FLATTEN=1 -DHAVE_FUNC_ATTRIBUTE_FORMAT=1 -DHAVE_FUNC_ATTRIBUTE_MALLOC=1 -DHAVE_FUNC_ATTRIBUTE_PACKED=1 -DHAVE_FUNC_ATTRIBUTE_PURE=1 -DHAVE_FUNC_ATTRIBUTE_RETURNS_NONNULL=1 -DHAVE_FUNC_ATTRIBUTE_UNUSED=1 -DHAVE_FUNC_ATTRIBUTE_WARN_UNUSED_RESULT=1 -DHAVE_FUNC_ATTRIBUTE_WEAK=1 -DHAVE_FUNC_ATTRIBUTE_NORETURN=1 -DHAVE_DLADDR=1 -DHAVE_PTHREAD_PRIO_INHERIT=1 -DHAVE_PTHREAD=1 -DENABLE_ST_OMX_BELLAGIO=0 -DENABLE_ST_OMX_TIZONIA=0 -I.  -I../include/ -I../src/mapi/ -I../src/mesa/ -I../src/gallium/include -I../src/gallium/auxiliary -D__STDC_CONSTANT_MACROS -D__STDC_FORMAT_MACROS -D__STDC_LIMIT_MACROS -DUSE_SSE41 -DUSE_GCC_ATOMIC_BUILTINS -DNDEBUG -DHAVE_XLOCALE_H -DHAVE_SYS_SYSCTL_H -DHAVE_DLFCN_H -DHAVE_STRTOF -DHAVE_POSIX_MEMALIGN -DHAVE_ZLIB -DGLX_USE_APPLEGL -DGLX_INDIRECT_RENDERING -DGLX_DIRECT_RENDERING -DGLX_USE_TLS -DHAVE_X11_PLATFORM -DBUILDING_MESA -DENABLE_SHADER_CACHE  -fvisibility=hidden -pipe -Os -arch x86_64 -std=c99 -Qunused-arguments  -MT mesa/main/imports.lo -MD -MP -MF $depbase.Tpo -c -o mesa/main/imports.lo mesa/main/imports.c &&\
600:info:build     mv -f $depbase.Tpo $depbase.Plo
601:info:build libtool: compile:  /usr/bin/clang -DPACKAGE_NAME=\"Mesa\" -DPACKAGE_TARNAME=\"mesa\" -DPACKAGE_VERSION=\"19.0.8\" "-DPACKAGE_STRING=\"Mesa 19.0.8\"" "-DPACKAGE_BUGREPORT=\"https://bugs.freedesktop.org/enter_bug.cgi?product=Mesa\"" -DPACKAGE_URL=\"\" -DPACKAGE=\"mesa\" -DVERSION=\"19.0.8\" -DSTDC_HEADERS=1 -DHAVE_SYS_TYPES_H=1 -DHAVE_SYS_STAT_H=1 -DHAVE_STDLIB_H=1 -DHAVE_STRING_H=1 -DHAVE_MEMORY_H=1 -DHAVE_STRINGS_H=1 -DHAVE_INTTYPES_H=1 -DHAVE_STDINT_H=1 -DHAVE_UNISTD_H=1 -DHAVE_DLFCN_H=1 -DLT_OBJDIR=\".libs/\" -DYYTEXT_POINTER=1 -DHAVE___BUILTIN_BSWAP32=1 -DHAVE___BUILTIN_BSWAP64=1 -DHAVE___BUILTIN_CLZ=1 -DHAVE___BUILTIN_CLZLL=1 -DHAVE___BUILTIN_CTZ=1 -DHAVE___BUILTIN_EXPECT=1 -DHAVE___BUILTIN_FFS=1 -DHAVE___BUILTIN_FFSLL=1 -DHAVE___BUILTIN_POPCOUNT=1 -DHAVE___BUILTIN_POPCOUNTLL=1 -DHAVE___BUILTIN_UNREACHABLE=1 -DHAVE_FUNC_ATTRIBUTE_CONST=1 -DHAVE_FUNC_ATTRIBUTE_FLATTEN=1 -DHAVE_FUNC_ATTRIBUTE_FORMAT=1 -DHAVE_FUNC_ATTRIBUTE_MALLOC=1 -DHAVE_FUNC_ATTRIBUTE_PACKED=1 -DHAVE_FUNC_ATTRIBUTE_PURE=1 -DHAVE_FUNC_ATTRIBUTE_RETURNS_NONNULL=1 -DHAVE_FUNC_ATTRIBUTE_UNUSED=1 -DHAVE_FUNC_ATTRIBUTE_WARN_UNUSED_RESULT=1 -DHAVE_FUNC_ATTRIBUTE_WEAK=1 -DHAVE_FUNC_ATTRIBUTE_NORETURN=1 -DHAVE_DLADDR=1 -DHAVE_PTHREAD_PRIO_INHERIT=1 -DHAVE_PTHREAD=1 -DENABLE_ST_OMX_BELLAGIO=0 -DENABLE_ST_OMX_TIZONIA=0 -I. -I../include/ -I../src/mapi/ -I../src/mesa/ -I../src/gallium/include -I../src/gallium/auxiliary -D__STDC_CONSTANT_MACROS -D__STDC_FORMAT_MACROS -D__STDC_LIMIT_MACROS -DUSE_SSE41 -DUSE_GCC_ATOMIC_BUILTINS -DNDEBUG -DHAVE_XLOCALE_H -DHAVE_SYS_SYSCTL_H -DHAVE_DLFCN_H -DHAVE_STRTOF -DHAVE_POSIX_MEMALIGN -DHAVE_ZLIB -DGLX_USE_APPLEGL -DGLX_INDIRECT_RENDERING -DGLX_DIRECT_RENDERING -DGLX_USE_TLS -DHAVE_X11_PLATFORM -DBUILDING_MESA -DENABLE_SHADER_CACHE -fvisibility=hidden -pipe -Os -arch x86_64 -std=c99 -Qunused-arguments -MT mesa/main/extensions_table.lo -MD -MP -MF mesa/main/.deps/extensions_table.Tpo -c mesa/main/extensions_table.c  -fno-common -DPIC -o mesa/main/.libs/extensions_table.o
602:info:build libtool: compile:  /usr/bin/clang -DPACKAGE_NAME=\"Mesa\" -DPACKAGE_TARNAME=\"mesa\" -DPACKAGE_VERSION=\"19.0.8\" "-DPACKAGE_STRING=\"Mesa 19.0.8\"" "-DPACKAGE_BUGREPORT=\"https://bugs.freedesktop.org/enter_bug.cgi?product=Mesa\"" -DPACKAGE_URL=\"\" -DPACKAGE=\"mesa\" -DVERSION=\"19.0.8\" -DSTDC_HEADERS=1 -DHAVE_SYS_TYPES_H=1 -DHAVE_SYS_STAT_H=1 -DHAVE_STDLIB_H=1 -DHAVE_STRING_H=1 -DHAVE_MEMORY_H=1 -DHAVE_STRINGS_H=1 -DHAVE_INTTYPES_H=1 -DHAVE_STDINT_H=1 -DHAVE_UNISTD_H=1 -DHAVE_DLFCN_H=1 -DLT_OBJDIR=\".libs/\" -DYYTEXT_POINTER=1 -DHAVE___BUILTIN_BSWAP32=1 -DHAVE___BUILTIN_BSWAP64=1 -DHAVE___BUILTIN_CLZ=1 -DHAVE___BUILTIN_CLZLL=1 -DHAVE___BUILTIN_CTZ=1 -DHAVE___BUILTIN_EXPECT=1 -DHAVE___BUILTIN_FFS=1 -DHAVE___BUILTIN_FFSLL=1 -DHAVE___BUILTIN_POPCOUNT=1 -DHAVE___BUILTIN_POPCOUNTLL=1 -DHAVE___BUILTIN_UNREACHABLE=1 -DHAVE_FUNC_ATTRIBUTE_CONST=1 -DHAVE_FUNC_ATTRIBUTE_FLATTEN=1 -DHAVE_FUNC_ATTRIBUTE_FORMAT=1 -DHAVE_FUNC_ATTRIBUTE_MALLOC=1 -DHAVE_FUNC_ATTRIBUTE_PACKED=1 -DHAVE_FUNC_ATTRIBUTE_PURE=1 -DHAVE_FUNC_ATTRIBUTE_RETURNS_NONNULL=1 -DHAVE_FUNC_ATTRIBUTE_UNUSED=1 -DHAVE_FUNC_ATTRIBUTE_WARN_UNUSED_RESULT=1 -DHAVE_FUNC_ATTRIBUTE_WEAK=1 -DHAVE_FUNC_ATTRIBUTE_NORETURN=1 -DHAVE_DLADDR=1 -DHAVE_PTHREAD_PRIO_INHERIT=1 -DHAVE_PTHREAD=1 -DENABLE_ST_OMX_BELLAGIO=0 -DENABLE_ST_OMX_TIZONIA=0 -I. -I../include/ -I../src/mapi/ -I../src/mesa/ -I../src/gallium/include -I../src/gallium/auxiliary -D__STDC_CONSTANT_MACROS -D__STDC_FORMAT_MACROS -D__STDC_LIMIT_MACROS -DUSE_SSE41 -DUSE_GCC_ATOMIC_BUILTINS -DNDEBUG -DHAVE_XLOCALE_H -DHAVE_SYS_SYSCTL_H -DHAVE_DLFCN_H -DHAVE_STRTOF -DHAVE_POSIX_MEMALIGN -DHAVE_ZLIB -DGLX_USE_APPLEGL -DGLX_INDIRECT_RENDERING -DGLX_DIRECT_RENDERING -DGLX_USE_TLS -DHAVE_X11_PLATFORM -DBUILDING_MESA -DENABLE_SHADER_CACHE -fvisibility=hidden -pipe -Os -arch x86_64 -std=c99 -Qunused-arguments -MT mesa/main/imports.lo -MD -MP -MF mesa/main/.deps/imports.Tpo -c mesa/main/imports.c  -fno-common -DPIC -o mesa/main/.libs/imports.o
603:info:build In file included from mesa/main/extensions_table.c:26:
604:info:build In file included from ../src/mesa/main/extensions.h:39:
605:info:build In file included from mesa/main/mtypes.h:39:
606:info:build In file included from ../include/c11/threads.h:66:
607:info:build ../include/c11/threads_posix.h:391:9: warning: implicit declaration of function 'clock_gettime' is invalid in C99 [-Wimplicit-function-declaration]
608:info:build         clock_gettime(CLOCK_REALTIME, ts);
609:info:build         ^
610:info:build ../include/c11/threads_posix.h:391:23: error: use of undeclared identifier 'CLOCK_REALTIME'
611:info:build         clock_gettime(CLOCK_REALTIME, ts);
612:info:build                       ^
613:info:build In file included from mesa/main/imports.c:50:
614:info:build In file included from mesa/main/context.h:54:
615:info:build In file included from mesa/main/extensions.h:39:
616:info:build In file included from mesa/main/mtypes.h:39:
617:info:build In file included from ../include/c11/threads.h:66:
618:info:build ../include/c11/threads_posix.h:391:9: warning: implicit declaration of function 'clock_gettime' is invalid in C99 [-Wimplicit-function-declaration]
619:info:build         clock_gettime(CLOCK_REALTIME, ts);
620:info:build         ^
621:info:build ../include/c11/threads_posix.h:391:23: error: use of undeclared identifier 'CLOCK_REALTIME'
622:info:build         clock_gettime(CLOCK_REALTIME, ts);
623:info:build                       ^
624:info:build 1 warning and 1 error generated.
625:info:build make[3]: *** [mesa/main/imports.lo] Error 1
626:info:build make[3]: *** Waiting for unfinished jobs....
627:info:build 1 warning and 1 error generated.
628:info:build make[3]: *** [mesa/main/extensions_table.lo] Error 1
629:info:build make[3]: Leaving directory `/opt/local/var/macports/build/_opt_local_var_macports_sources_rsync.macports.org_release_tarballs_ports_x11_mesa/mesa/work/mesa-19.0.8/src'
630:info:build make[2]: *** [all-recursive] Error 1
631:info:build make[2]: Leaving directory `/opt/local/var/macports/build/_opt_local_var_macports_sources_rsync.macports.org_release_tarballs_ports_x11_mesa/mesa/work/mesa-19.0.8/src'
632:info:build make[1]: *** [all] Error 2
633:info:build make[1]: Leaving directory `/opt/local/var/macports/build/_opt_local_var_macports_sources_rsync.macports.org_release_tarballs_ports_x11_mesa/mesa/work/mesa-19.0.8/src'
634:info:build make: *** [all-recursive] Error 1
635:info:build make: Leaving directory `/opt/local/var/macports/build/_opt_local_var_macports_sources_rsync.macports.org_release_tarballs_ports_x11_mesa/mesa/work/mesa-19.0.8'
636:info:build Command failed:  cd "/opt/local/var/macports/build/_opt_local_var_macports_sources_rsync.macports.org_release_tarballs_ports_x11_mesa/mesa/work/mesa-19.0.8" && /usr/bin/make -j2 -w all
637:info:build Exit code: 2
638:error:build Failed to build mesa: command execution failed
639:debug:build Error code: CHILDSTATUS 27890 2
640:debug:build Backtrace: command execution failed
641:debug:build     while executing
642:debug:build "system {*}$notty {*}$nice $fullcmdstring"
643:debug:build     invoked from within
644:debug:build "command_exec build"
645:debug:build     (procedure "portbuild::build_main" line 8)
646:debug:build     invoked from within
647:debug:build "$procedure $targetname"
648:error:build See /opt/local/var/macports/logs/_opt_local_var_macports_sources_rsync.macports.org_release_tarballs_ports_x11_mesa/mesa/main.log for details.