Ticket #64784: main.log

File main.log, 23.9 KB (added by barracuda156, 11 months ago)
Line 
1version:1
2:debug:main Starting logging for brotli @1.0.9_2+universal
3:debug:sysinfo Mac OS X 10.5.8 (darwin/9.8.0) arch powerpc
4:debug:sysinfo MacPorts 2.7.1
5:debug:sysinfo Xcode 3.1.4
6:debug:sysinfo SDK 10.5
7:debug:sysinfo MACOSX_DEPLOYMENT_TARGET: 10.5
8:debug:main Attempting ln -sf /opt/local/var/macports/build/_opt_local_var_macports_sources_rsync.macports.org_macports_release_tarballs_ports_archivers_brotli/brotli/work /opt/local/var/macports/sources/rsync.macports.org/macports/release/tarballs/ports/archivers/brotli/work
9:debug:main dropping privileges: euid changed to 502, egid changed to 500.
10:debug:main Executing org.macports.main (brotli)
11:debug:main Privilege de-escalation not attempted as not running as root.
12:debug:archivefetch archivefetch phase started at Tue Mar  8 06:42:58 CST 2022
13:debug:archivefetch Executing org.macports.archivefetch (brotli)
14:debug:archivefetch Privilege de-escalation not attempted as not running as root.
15:debug:fetch fetch phase started at Tue Mar  8 06:42:58 CST 2022
16:notice:fetch --->  Fetching distfiles for brotli
17:debug:fetch Executing org.macports.fetch (brotli)
18:debug:fetch Privilege de-escalation not attempted as not running as root.
19:debug:checksum checksum phase started at Tue Mar  8 06:42:58 CST 2022
20:notice:checksum --->  Verifying checksums for brotli
21:debug:checksum Executing org.macports.checksum (brotli)
22:info:checksum --->  Checksumming brotli-1.0.9.tar.gz
23:debug:checksum Calculated (rmd160) is 3e2402d137fd75f898007d3730773b32025a4857
24:debug:checksum Correct (rmd160) checksum for brotli-1.0.9.tar.gz
25:debug:checksum Calculated (sha256) is b56a4371636e063ad3695f7c53aed5c18fc2303034564534981e7d6a11b75138
26:debug:checksum Correct (sha256) checksum for brotli-1.0.9.tar.gz
27:debug:checksum Calculated (size) is 487046
28:debug:checksum Correct (size) checksum for brotli-1.0.9.tar.gz
29:debug:checksum Privilege de-escalation not attempted as not running as root.
30:debug:extract extract phase started at Tue Mar  8 06:42:58 CST 2022
31:notice:extract --->  Extracting brotli
32:debug:extract Executing org.macports.extract (brotli)
33:info:extract --->  Extracting brotli-1.0.9.tar.gz
34:debug:extract setting option extract.args to '/opt/local/var/macports/distfiles/brotli/brotli-1.0.9.tar.gz'
35:debug:extract Environment:
36:debug:extract CC_PRINT_OPTIONS='YES'
37:debug:extract CC_PRINT_OPTIONS_FILE='/opt/local/var/macports/build/_opt_local_var_macports_sources_rsync.macports.org_macports_release_tarballs_ports_archivers_brotli/brotli/work/.CC_PRINT_OPTIONS'
38:debug:extract CPATH='/opt/local/include'
39:debug:extract DEVELOPER_DIR='/Developer'
40:debug:extract LIBRARY_PATH='/opt/local/lib'
41:debug:extract MACOSX_DEPLOYMENT_TARGET='10.5'
42:info:extract Executing:  cd "/opt/local/var/macports/build/_opt_local_var_macports_sources_rsync.macports.org_macports_release_tarballs_ports_archivers_brotli/brotli/work" && /usr/bin/gzip -dc '/opt/local/var/macports/distfiles/brotli/brotli-1.0.9.tar.gz' | /usr/bin/gnutar --no-same-owner -xf -
43:debug:extract system:  cd "/opt/local/var/macports/build/_opt_local_var_macports_sources_rsync.macports.org_macports_release_tarballs_ports_archivers_brotli/brotli/work" && /usr/bin/gzip -dc '/opt/local/var/macports/distfiles/brotli/brotli-1.0.9.tar.gz' | /usr/bin/gnutar --no-same-owner -xf -
44:debug:extract euid/egid changed to: 0/0
45:debug:extract chowned /opt/local/var/macports/build/_opt_local_var_macports_sources_rsync.macports.org_macports_release_tarballs_ports_archivers_brotli/brotli/work to macports
46:debug:extract euid/egid changed to: 502/500
47:debug:extract Symlink: /opt/local/var/macports/build/_opt_local_var_macports_sources_rsync.macports.org_macports_release_tarballs_ports_archivers_brotli/brotli/work/brotli-1.0.9 -> google-brotli-e61745a
48:debug:extract Executing proc-post-org.macports.extract-extract-0
49:debug:extract Privilege de-escalation not attempted as not running as root.
50:debug:patch patch phase started at Tue Mar  8 06:42:58 CST 2022
51:debug:patch Executing org.macports.patch (brotli)
52:notice:patch --->  Applying patches to brotli
53:info:patch --->  Applying no-runtime-linker-path-in-pc-files.patch
54:debug:patch Environment:
55:debug:patch CC_PRINT_OPTIONS='YES'
56:debug:patch CC_PRINT_OPTIONS_FILE='/opt/local/var/macports/build/_opt_local_var_macports_sources_rsync.macports.org_macports_release_tarballs_ports_archivers_brotli/brotli/work/.CC_PRINT_OPTIONS'
57:debug:patch CPATH='/opt/local/include'
58:debug:patch DEVELOPER_DIR='/Developer'
59:debug:patch LIBRARY_PATH='/opt/local/lib'
60:debug:patch MACOSX_DEPLOYMENT_TARGET='10.5'
61:info:patch Executing:  cd "/opt/local/var/macports/build/_opt_local_var_macports_sources_rsync.macports.org_macports_release_tarballs_ports_archivers_brotli/brotli/work/brotli-1.0.9" && /usr/bin/patch -p0 < '/opt/local/var/macports/sources/rsync.macports.org/macports/release/tarballs/ports/archivers/brotli/files/no-runtime-linker-path-in-pc-files.patch'
62:debug:patch system:  cd "/opt/local/var/macports/build/_opt_local_var_macports_sources_rsync.macports.org_macports_release_tarballs_ports_archivers_brotli/brotli/work/brotli-1.0.9" && /usr/bin/patch -p0 < '/opt/local/var/macports/sources/rsync.macports.org/macports/release/tarballs/ports/archivers/brotli/files/no-runtime-linker-path-in-pc-files.patch'
63:info:patch patching file scripts/libbrotlicommon.pc.in
64:info:patch patching file scripts/libbrotlidec.pc.in
65:info:patch patching file scripts/libbrotlienc.pc.in
66:debug:patch Privilege de-escalation not attempted as not running as root.
67:debug:configure configure phase started at Tue Mar  8 06:42:58 CST 2022
68:notice:configure --->  Configuring brotli
69:debug:configure Preferred compilers: gcc-4.2 llvm-gcc-4.2 apple-gcc-4.2 gcc-4.0 macports-gcc-7 macports-gcc-6 macports-gcc-5 macports-clang-7.0 macports-clang-6.0 macports-clang-5.0 macports-clang-3.7 macports-clang-3.4
70:debug:configure Using compiler 'Xcode GCC 4.2'
71:debug:configure Executing proc-pre-org.macports.configure-configure-0
72:debug:configure Executing proc-pre-org.macports.configure-configure-1
73:debug:configure Executing proc-pre-org.macports.configure-configure-2
74:debug:configure Executing org.macports.configure (brotli)
75:debug:configure Environment:
76:debug:configure CC='/usr/bin/gcc-4.2'
77:debug:configure CC_PRINT_OPTIONS='YES'
78:debug:configure CC_PRINT_OPTIONS_FILE='/opt/local/var/macports/build/_opt_local_var_macports_sources_rsync.macports.org_macports_release_tarballs_ports_archivers_brotli/brotli/work/.CC_PRINT_OPTIONS'
79:debug:configure CFLAGS='-pipe -Os'
80:debug:configure CPATH='/opt/local/include'
81:debug:configure CPPFLAGS='-I/opt/local/include'
82:debug:configure CXX='/usr/bin/g++-4.2'
83:debug:configure CXXFLAGS='-pipe -Os'
84:debug:configure DEVELOPER_DIR='/Developer'
85:debug:configure F90FLAGS='-pipe -Os'
86:debug:configure FCFLAGS='-pipe -Os'
87:debug:configure FFLAGS='-pipe -Os'
88:debug:configure INSTALL='/usr/bin/install -c'
89:debug:configure LDFLAGS='-L/opt/local/lib -Wl,-headerpad_max_install_names'
90:debug:configure LIBRARY_PATH='/opt/local/lib'
91:debug:configure MACOSX_DEPLOYMENT_TARGET='10.5'
92:debug:configure OBJC='/usr/bin/gcc-4.2'
93:debug:configure OBJCFLAGS='-pipe -Os'
94:debug:configure OBJCXX='/usr/bin/g++-4.2'
95:debug:configure OBJCXXFLAGS='-pipe -Os'
96:info:configure Executing:  cd "/opt/local/var/macports/build/_opt_local_var_macports_sources_rsync.macports.org_macports_release_tarballs_ports_archivers_brotli/brotli/work/brotli-1.0.9" && /opt/local/bin/cmake -DCMAKE_INSTALL_PREFIX='/opt/local' -DCMAKE_OSX_ARCHITECTURES="ppc;ppc64" -DCMAKE_BUILD_TYPE=Release -DCMAKE_BUILD_WITH_INSTALL_RPATH=ON -DCMAKE_C_COMPILER="$CC" -DCMAKE_COLOR_MAKEFILE=ON -DCMAKE_CXX_COMPILER="$CXX" -DCMAKE_FIND_FRAMEWORK=LAST -DCMAKE_INSTALL_NAME_DIR=/opt/local/lib -DCMAKE_INSTALL_RPATH=/opt/local/lib -DCMAKE_MAKE_PROGRAM=/usr/bin/make -DCMAKE_MODULE_PATH=/opt/local/share/cmake/Modules -DCMAKE_SYSTEM_PREFIX_PATH="/opt/local;/opt/local;/usr" -DCMAKE_VERBOSE_MAKEFILE=ON -DCMAKE_POLICY_DEFAULT_CMP0025=NEW -Wno-dev -DCMAKE_C_FLAGS_RELEASE="-DNDEBUG" -DCMAKE_CXX_FLAGS_RELEASE="-DNDEBUG" -DCMAKE_OSX_DEPLOYMENT_TARGET="10.5" -DCMAKE_OSX_SYSROOT="/" /opt/local/var/macports/build/_opt_local_var_macports_sources_rsync.macports.org_macports_release_tarballs_ports_archivers_brotli/brotli/work/brotli-1.0.9
97:debug:configure system:  cd "/opt/local/var/macports/build/_opt_local_var_macports_sources_rsync.macports.org_macports_release_tarballs_ports_archivers_brotli/brotli/work/brotli-1.0.9" && /opt/local/bin/cmake -DCMAKE_INSTALL_PREFIX='/opt/local' -DCMAKE_OSX_ARCHITECTURES="ppc;ppc64" -DCMAKE_BUILD_TYPE=Release -DCMAKE_BUILD_WITH_INSTALL_RPATH=ON -DCMAKE_C_COMPILER="$CC" -DCMAKE_COLOR_MAKEFILE=ON -DCMAKE_CXX_COMPILER="$CXX" -DCMAKE_FIND_FRAMEWORK=LAST -DCMAKE_INSTALL_NAME_DIR=/opt/local/lib -DCMAKE_INSTALL_RPATH=/opt/local/lib -DCMAKE_MAKE_PROGRAM=/usr/bin/make -DCMAKE_MODULE_PATH=/opt/local/share/cmake/Modules -DCMAKE_SYSTEM_PREFIX_PATH="/opt/local;/opt/local;/usr" -DCMAKE_VERBOSE_MAKEFILE=ON -DCMAKE_POLICY_DEFAULT_CMP0025=NEW -Wno-dev -DCMAKE_C_FLAGS_RELEASE="-DNDEBUG" -DCMAKE_CXX_FLAGS_RELEASE="-DNDEBUG" -DCMAKE_OSX_DEPLOYMENT_TARGET="10.5" -DCMAKE_OSX_SYSROOT="/" /opt/local/var/macports/build/_opt_local_var_macports_sources_rsync.macports.org_macports_release_tarballs_ports_archivers_brotli/brotli/work/brotli-1.0.9
98:info:configure -- The C compiler identification is GNU 4.2.1
99:info:configure -- Checking whether C compiler has -isysroot
100:info:configure -- Checking whether C compiler has -isysroot - yes
101:info:configure -- Checking whether C compiler supports OSX deployment target flag
102:info:configure -- Checking whether C compiler supports OSX deployment target flag - yes
103:info:configure -- Detecting C compiler ABI info
104:info:configure -- Detecting C compiler ABI info - done
105:info:configure -- Check for working C compiler: /usr/bin/gcc-4.2 - skipped
106:info:configure -- Detecting C compile features
107:info:configure -- Detecting C compile features - done
108:info:configure -- Build type is 'Release'
109:info:configure -- Performing Test BROTLI_EMSCRIPTEN
110:info:configure -- Performing Test BROTLI_EMSCRIPTEN - Failed
111:info:configure -- Compiler is not EMSCRIPTEN
112:info:configure -- Looking for log2
113:info:configure -- Looking for log2 - found
114:info:configure CMake Warning at CMakeLists.txt:319 (message):
115:info:configure   Test file tests/testdata/alice29.txt does not exist.
116:info:configure CMake Warning at CMakeLists.txt:319 (message):
117:info:configure   Test file tests/testdata/asyoulik.txt does not exist.
118:info:configure CMake Warning at CMakeLists.txt:319 (message):
119:info:configure   Test file tests/testdata/lcet10.txt does not exist.
120:info:configure CMake Warning at CMakeLists.txt:319 (message):
121:info:configure   Test file tests/testdata/plrabn12.txt does not exist.
122:info:configure -- Configuring done
123:info:configure -- Generating done
124:info:configure CMake Warning:
125:info:configure   Manually-specified variables were not used by the project:
126:info:configure     CMAKE_CXX_FLAGS_RELEASE
127:info:configure -- Build files have been written to: /opt/local/var/macports/build/_opt_local_var_macports_sources_rsync.macports.org_macports_release_tarballs_ports_archivers_brotli/brotli/work/brotli-1.0.9
128:debug:configure Executing proc-post-org.macports.configure-configure-0
129:debug:configure configure.ccache restored to no
130:debug:configure Executing portconfigure::configure_finish
131:debug:configure Privilege de-escalation not attempted as not running as root.
132:debug:build build phase started at Tue Mar  8 06:43:01 CST 2022
133:notice:build --->  Building brotli
134:debug:build Executing org.macports.build (brotli)
135:debug:build Environment:
136:debug:build CC_PRINT_OPTIONS='YES'
137:debug:build CC_PRINT_OPTIONS_FILE='/opt/local/var/macports/build/_opt_local_var_macports_sources_rsync.macports.org_macports_release_tarballs_ports_archivers_brotli/brotli/work/.CC_PRINT_OPTIONS'
138:debug:build CPATH='/opt/local/include'
139:debug:build DEVELOPER_DIR='/Developer'
140:debug:build LIBRARY_PATH='/opt/local/lib'
141:debug:build MACOSX_DEPLOYMENT_TARGET='10.5'
142:info:build Executing:  cd "/opt/local/var/macports/build/_opt_local_var_macports_sources_rsync.macports.org_macports_release_tarballs_ports_archivers_brotli/brotli/work/brotli-1.0.9" && /usr/bin/make -j4 -w all VERBOSE=ON
143:debug:build system:  cd "/opt/local/var/macports/build/_opt_local_var_macports_sources_rsync.macports.org_macports_release_tarballs_ports_archivers_brotli/brotli/work/brotli-1.0.9" && /usr/bin/make -j4 -w all VERBOSE=ON
144:info:build make: Entering directory `/opt/local/var/macports/build/_opt_local_var_macports_sources_rsync.macports.org_macports_release_tarballs_ports_archivers_brotli/brotli/work/google-brotli-e61745a'
145:info:build /opt/local/bin/cmake -S/opt/local/var/macports/build/_opt_local_var_macports_sources_rsync.macports.org_macports_release_tarballs_ports_archivers_brotli/brotli/work/brotli-1.0.9 -B/opt/local/var/macports/build/_opt_local_var_macports_sources_rsync.macports.org_macports_release_tarballs_ports_archivers_brotli/brotli/work/brotli-1.0.9 --check-build-system CMakeFiles/Makefile.cmake 0
146:info:build /opt/local/bin/cmake -E cmake_progress_start /opt/local/var/macports/build/_opt_local_var_macports_sources_rsync.macports.org_macports_release_tarballs_ports_archivers_brotli/brotli/work/brotli-1.0.9/CMakeFiles /opt/local/var/macports/build/_opt_local_var_macports_sources_rsync.macports.org_macports_release_tarballs_ports_archivers_brotli/brotli/work/brotli-1.0.9//CMakeFiles/progress.marks
147:info:build /usr/bin/make  -f CMakeFiles/Makefile2 all
148:info:build make[1]: Entering directory `/opt/local/var/macports/build/_opt_local_var_macports_sources_rsync.macports.org_macports_release_tarballs_ports_archivers_brotli/brotli/work/google-brotli-e61745a'
149:info:build /usr/bin/make  -f CMakeFiles/brotlicommon.dir/build.make CMakeFiles/brotlicommon.dir/depend
150:info:build /usr/bin/make  -f CMakeFiles/brotlicommon-static.dir/build.make CMakeFiles/brotlicommon-static.dir/depend
151:info:build make[2]: Entering directory `/opt/local/var/macports/build/_opt_local_var_macports_sources_rsync.macports.org_macports_release_tarballs_ports_archivers_brotli/brotli/work/google-brotli-e61745a'
152:info:build cd /opt/local/var/macports/build/_opt_local_var_macports_sources_rsync.macports.org_macports_release_tarballs_ports_archivers_brotli/brotli/work/brotli-1.0.9 && /opt/local/bin/cmake -E cmake_depends "Unix Makefiles" /opt/local/var/macports/build/_opt_local_var_macports_sources_rsync.macports.org_macports_release_tarballs_ports_archivers_brotli/brotli/work/brotli-1.0.9 /opt/local/var/macports/build/_opt_local_var_macports_sources_rsync.macports.org_macports_release_tarballs_ports_archivers_brotli/brotli/work/brotli-1.0.9 /opt/local/var/macports/build/_opt_local_var_macports_sources_rsync.macports.org_macports_release_tarballs_ports_archivers_brotli/brotli/work/brotli-1.0.9 /opt/local/var/macports/build/_opt_local_var_macports_sources_rsync.macports.org_macports_release_tarballs_ports_archivers_brotli/brotli/work/brotli-1.0.9 /opt/local/var/macports/build/_opt_local_var_macports_sources_rsync.macports.org_macports_release_tarballs_ports_archivers_brotli/brotli/work/brotli-1.0.9/CMakeFiles/brotlicommon.dir/DependInfo.cmake --color=
153:info:build make[2]: Entering directory `/opt/local/var/macports/build/_opt_local_var_macports_sources_rsync.macports.org_macports_release_tarballs_ports_archivers_brotli/brotli/work/google-brotli-e61745a'
154:info:build cd /opt/local/var/macports/build/_opt_local_var_macports_sources_rsync.macports.org_macports_release_tarballs_ports_archivers_brotli/brotli/work/brotli-1.0.9 && /opt/local/bin/cmake -E cmake_depends "Unix Makefiles" /opt/local/var/macports/build/_opt_local_var_macports_sources_rsync.macports.org_macports_release_tarballs_ports_archivers_brotli/brotli/work/brotli-1.0.9 /opt/local/var/macports/build/_opt_local_var_macports_sources_rsync.macports.org_macports_release_tarballs_ports_archivers_brotli/brotli/work/brotli-1.0.9 /opt/local/var/macports/build/_opt_local_var_macports_sources_rsync.macports.org_macports_release_tarballs_ports_archivers_brotli/brotli/work/brotli-1.0.9 /opt/local/var/macports/build/_opt_local_var_macports_sources_rsync.macports.org_macports_release_tarballs_ports_archivers_brotli/brotli/work/brotli-1.0.9 /opt/local/var/macports/build/_opt_local_var_macports_sources_rsync.macports.org_macports_release_tarballs_ports_archivers_brotli/brotli/work/brotli-1.0.9/CMakeFiles/brotlicommon-static.dir/DependInfo.cmake --color=
155:info:build make[2]: Leaving directory `/opt/local/var/macports/build/_opt_local_var_macports_sources_rsync.macports.org_macports_release_tarballs_ports_archivers_brotli/brotli/work/google-brotli-e61745a'
156:info:build make[2]: Leaving directory `/opt/local/var/macports/build/_opt_local_var_macports_sources_rsync.macports.org_macports_release_tarballs_ports_archivers_brotli/brotli/work/google-brotli-e61745a'
157:info:build /usr/bin/make  -f CMakeFiles/brotlicommon.dir/build.make CMakeFiles/brotlicommon.dir/build
158:info:build /usr/bin/make  -f CMakeFiles/brotlicommon-static.dir/build.make CMakeFiles/brotlicommon-static.dir/build
159:info:build make[2]: Entering directory `/opt/local/var/macports/build/_opt_local_var_macports_sources_rsync.macports.org_macports_release_tarballs_ports_archivers_brotli/brotli/work/google-brotli-e61745a'
160:info:build make[2]: Entering directory `/opt/local/var/macports/build/_opt_local_var_macports_sources_rsync.macports.org_macports_release_tarballs_ports_archivers_brotli/brotli/work/google-brotli-e61745a'
161:info:build [  1%] Building C object CMakeFiles/brotlicommon-static.dir/c/common/context.c.o
162:info:build [  3%] Building C object CMakeFiles/brotlicommon.dir/c/common/constants.c.o
163:info:build /usr/bin/gcc-4.2 -DBROTLI_HAVE_LOG2=1 -DOS_MACOSX -I/opt/local/var/macports/build/_opt_local_var_macports_sources_rsync.macports.org_macports_release_tarballs_ports_archivers_brotli/brotli/work/brotli-1.0.9/c/include -pipe -Os -DNDEBUG -arch ppc -arch ppc64 -mmacosx-version-min=10.5 -fPIC -MD -MT CMakeFiles/brotlicommon-static.dir/c/common/context.c.o -MF CMakeFiles/brotlicommon-static.dir/c/common/context.c.o.d -o CMakeFiles/brotlicommon-static.dir/c/common/context.c.o -c /opt/local/var/macports/build/_opt_local_var_macports_sources_rsync.macports.org_macports_release_tarballs_ports_archivers_brotli/brotli/work/brotli-1.0.9/c/common/context.c
164:info:build /usr/bin/gcc-4.2 -DBROTLICOMMON_SHARED_COMPILATION -DBROTLI_HAVE_LOG2=1 -DBROTLI_SHARED_COMPILATION -DOS_MACOSX -I/opt/local/var/macports/build/_opt_local_var_macports_sources_rsync.macports.org_macports_release_tarballs_ports_archivers_brotli/brotli/work/brotli-1.0.9/c/include -pipe -Os -DNDEBUG -arch ppc -arch ppc64 -mmacosx-version-min=10.5 -fPIC -MD -MT CMakeFiles/brotlicommon.dir/c/common/constants.c.o -MF CMakeFiles/brotlicommon.dir/c/common/constants.c.o.d -o CMakeFiles/brotlicommon.dir/c/common/constants.c.o -c /opt/local/var/macports/build/_opt_local_var_macports_sources_rsync.macports.org_macports_release_tarballs_ports_archivers_brotli/brotli/work/brotli-1.0.9/c/common/constants.c
165:info:build [  4%] Building C object CMakeFiles/brotlicommon.dir/c/common/context.c.o
166:info:build gcc-4.2: -E, -S, -save-temps and -M options are not allowed with multiple -arch flags
167:info:build make[2]: *** [CMakeFiles/brotlicommon-static.dir/c/common/context.c.o] Error 1
168:info:build make[2]: *** Waiting for unfinished jobs....
169:info:build gcc-4.2: -E, -S, -save-temps and -M options are not allowed with multiple -arch flags
170:info:build [  6%] Building C object CMakeFiles/brotlicommon-static.dir/c/common/constants.c.o
171:info:build make[2]: *** [CMakeFiles/brotlicommon.dir/c/common/constants.c.o] Error 1
172:info:build make[2]: *** Waiting for unfinished jobs....
173:info:build /usr/bin/gcc-4.2 -DBROTLICOMMON_SHARED_COMPILATION -DBROTLI_HAVE_LOG2=1 -DBROTLI_SHARED_COMPILATION -DOS_MACOSX -I/opt/local/var/macports/build/_opt_local_var_macports_sources_rsync.macports.org_macports_release_tarballs_ports_archivers_brotli/brotli/work/brotli-1.0.9/c/include -pipe -Os -DNDEBUG -arch ppc -arch ppc64 -mmacosx-version-min=10.5 -fPIC -MD -MT CMakeFiles/brotlicommon.dir/c/common/context.c.o -MF CMakeFiles/brotlicommon.dir/c/common/context.c.o.d -o CMakeFiles/brotlicommon.dir/c/common/context.c.o -c /opt/local/var/macports/build/_opt_local_var_macports_sources_rsync.macports.org_macports_release_tarballs_ports_archivers_brotli/brotli/work/brotli-1.0.9/c/common/context.c
174:info:build /usr/bin/gcc-4.2 -DBROTLI_HAVE_LOG2=1 -DOS_MACOSX -I/opt/local/var/macports/build/_opt_local_var_macports_sources_rsync.macports.org_macports_release_tarballs_ports_archivers_brotli/brotli/work/brotli-1.0.9/c/include -pipe -Os -DNDEBUG -arch ppc -arch ppc64 -mmacosx-version-min=10.5 -fPIC -MD -MT CMakeFiles/brotlicommon-static.dir/c/common/constants.c.o -MF CMakeFiles/brotlicommon-static.dir/c/common/constants.c.o.d -o CMakeFiles/brotlicommon-static.dir/c/common/constants.c.o -c /opt/local/var/macports/build/_opt_local_var_macports_sources_rsync.macports.org_macports_release_tarballs_ports_archivers_brotli/brotli/work/brotli-1.0.9/c/common/constants.c
175:info:build gcc-4.2: -E, -S, -save-temps and -M options are not allowed with multiple -arch flags
176:info:build make[2]: *** [CMakeFiles/brotlicommon.dir/c/common/context.c.o] Error 1
177:info:build gcc-4.2: -E, -S, -save-temps and -M options are not allowed with multiple -arch flags
178:info:build make[2]: *** [CMakeFiles/brotlicommon-static.dir/c/common/constants.c.o] Error 1
179:info:build make[2]: Leaving directory `/opt/local/var/macports/build/_opt_local_var_macports_sources_rsync.macports.org_macports_release_tarballs_ports_archivers_brotli/brotli/work/google-brotli-e61745a'
180:info:build make[1]: *** [CMakeFiles/brotlicommon-static.dir/all] Error 2
181:info:build make[1]: *** Waiting for unfinished jobs....
182:info:build [  7%] Building C object CMakeFiles/brotlicommon.dir/c/common/dictionary.c.o
183:info:build /usr/bin/gcc-4.2 -DBROTLICOMMON_SHARED_COMPILATION -DBROTLI_HAVE_LOG2=1 -DBROTLI_SHARED_COMPILATION -DOS_MACOSX -I/opt/local/var/macports/build/_opt_local_var_macports_sources_rsync.macports.org_macports_release_tarballs_ports_archivers_brotli/brotli/work/brotli-1.0.9/c/include -pipe -Os -DNDEBUG -arch ppc -arch ppc64 -mmacosx-version-min=10.5 -fPIC -MD -MT CMakeFiles/brotlicommon.dir/c/common/dictionary.c.o -MF CMakeFiles/brotlicommon.dir/c/common/dictionary.c.o.d -o CMakeFiles/brotlicommon.dir/c/common/dictionary.c.o -c /opt/local/var/macports/build/_opt_local_var_macports_sources_rsync.macports.org_macports_release_tarballs_ports_archivers_brotli/brotli/work/brotli-1.0.9/c/common/dictionary.c
184:info:build gcc-4.2: -E, -S, -save-temps and -M options are not allowed with multiple -arch flags
185:info:build make[2]: *** [CMakeFiles/brotlicommon.dir/c/common/dictionary.c.o] Error 1
186:info:build make[2]: Leaving directory `/opt/local/var/macports/build/_opt_local_var_macports_sources_rsync.macports.org_macports_release_tarballs_ports_archivers_brotli/brotli/work/google-brotli-e61745a'
187:info:build make[1]: *** [CMakeFiles/brotlicommon.dir/all] Error 2
188:info:build make[1]: Leaving directory `/opt/local/var/macports/build/_opt_local_var_macports_sources_rsync.macports.org_macports_release_tarballs_ports_archivers_brotli/brotli/work/google-brotli-e61745a'
189:info:build make: *** [all] Error 2
190:info:build make: Leaving directory `/opt/local/var/macports/build/_opt_local_var_macports_sources_rsync.macports.org_macports_release_tarballs_ports_archivers_brotli/brotli/work/google-brotli-e61745a'
191:info:build Command failed:  cd "/opt/local/var/macports/build/_opt_local_var_macports_sources_rsync.macports.org_macports_release_tarballs_ports_archivers_brotli/brotli/work/brotli-1.0.9" && /usr/bin/make -j4 -w all VERBOSE=ON
192:info:build Exit code: 2
193:error:build Failed to build brotli: command execution failed
194:debug:build Error code: CHILDSTATUS 75838 2
195:debug:build Backtrace: command execution failed
196:debug:build     while executing
197:debug:build "system {*}$notty {*}$callback {*}$nice $fullcmdstring"
198:debug:build     invoked from within
199:debug:build "command_exec -callback portprogress::target_progress_callback build"
200:debug:build     (procedure "portbuild::build_main" line 8)
201:debug:build     invoked from within
202:debug:build "$procedure $targetname"
203:error:build See /opt/local/var/macports/logs/_opt_local_var_macports_sources_rsync.macports.org_macports_release_tarballs_ports_archivers_brotli/brotli/main.log for details.