| 1 | version:1 |
|---|
| 2 | :debug:main Starting logging for usbredir @0.9.0_0+universal |
|---|
| 3 | :debug:sysinfo Mac OS X 10.5.8 (darwin/9.8.0) arch powerpc |
|---|
| 4 | :debug:sysinfo MacPorts 2.7.1 |
|---|
| 5 | :debug:sysinfo Xcode 3.1.4 |
|---|
| 6 | :debug:sysinfo SDK 10.5 |
|---|
| 7 | :debug:sysinfo MACOSX_DEPLOYMENT_TARGET: 10.5 |
|---|
| 8 | :debug:main epoch: in tree: 0 installed: 0 |
|---|
| 9 | :debug:main xz 5.2.5_0 exists in the ports tree |
|---|
| 10 | :debug:main xz 5.2.5_0 is the latest installed |
|---|
| 11 | :debug:main xz 5.2.5_0 +universal is active |
|---|
| 12 | :debug:main Merging existing requested variants '+universal' into variants |
|---|
| 13 | :debug:main new fully merged portvariants: universal + |
|---|
| 14 | :debug:main Changing to port directory: /opt/local/var/macports/sources/rsync.macports.org/macports/release/tarballs/ports/archivers/xz |
|---|
| 15 | :debug:main OS darwin/9.8.0 (macOS 10.5.8) arch powerpc |
|---|
| 16 | :debug:main Sourcing PortGroup clang_dependency 1.0 from /opt/local/var/macports/sources/rsync.macports.org/macports/release/tarballs/ports/_resources/port1.0/group/clang_dependency-1.0.tcl |
|---|
| 17 | :debug:main adding the default universal variant |
|---|
| 18 | :debug:main Reading variant descriptions from /opt/local/var/macports/sources/rsync.macports.org/macports/release/tarballs/ports/_resources/port1.0/variant_descriptions.conf |
|---|
| 19 | :debug:main Executing variant universal provides universal |
|---|
| 20 | :debug:main Running callback portconfigure::add_automatic_compiler_dependencies |
|---|
| 21 | :debug:main Finished running callback portconfigure::add_automatic_compiler_dependencies |
|---|
| 22 | :debug:main Running callback portbuild::add_automatic_buildsystem_dependencies |
|---|
| 23 | :debug:main Finished running callback portbuild::add_automatic_buildsystem_dependencies |
|---|
| 24 | :debug:main Running callback portstartupitem::add_notes |
|---|
| 25 | :debug:main Finished running callback portstartupitem::add_notes |
|---|
| 26 | :debug:main No need to upgrade! xz 5.2.5_0 >= xz 5.2.5_0 |
|---|
| 27 | :debug:main epoch: in tree: 0 installed: 0 |
|---|
| 28 | :debug:main libiconv 1.16_1 exists in the ports tree |
|---|
| 29 | :debug:main libiconv 1.16_1 is the latest installed |
|---|
| 30 | :debug:main libiconv 1.16_1 +universal is active |
|---|
| 31 | :debug:main Merging existing requested variants '+universal' into variants |
|---|
| 32 | :debug:main new fully merged portvariants: universal + |
|---|
| 33 | :debug:main Changing to port directory: /opt/local/var/macports/sources/rsync.macports.org/macports/release/tarballs/ports/textproc/libiconv |
|---|
| 34 | :debug:main OS darwin/9.8.0 (macOS 10.5.8) arch powerpc |
|---|
| 35 | :debug:main Sourcing PortGroup muniversal 1.0 from /opt/local/var/macports/sources/rsync.macports.org/macports/release/tarballs/ports/_resources/port1.0/group/muniversal-1.0.tcl |
|---|
| 36 | :debug:main Sourcing PortGroup clang_dependency 1.0 from /opt/local/var/macports/sources/rsync.macports.org/macports/release/tarballs/ports/_resources/port1.0/group/clang_dependency-1.0.tcl |
|---|
| 37 | :debug:main Sourcing PortGroup xcodeversion 1.0 from /opt/local/var/macports/sources/rsync.macports.org/macports/release/tarballs/ports/_resources/port1.0/group/xcodeversion-1.0.tcl |
|---|
| 38 | :debug:main muniversal: adding universal variant |
|---|
| 39 | :debug:main Reading variant descriptions from /opt/local/var/macports/sources/rsync.macports.org/macports/release/tarballs/ports/_resources/port1.0/variant_descriptions.conf |
|---|
| 40 | :debug:main Executing variant universal provides universal |
|---|
| 41 | :debug:main Running callback portconfigure::add_automatic_compiler_dependencies |
|---|
| 42 | :debug:main Finished running callback portconfigure::add_automatic_compiler_dependencies |
|---|
| 43 | :debug:main Running callback portbuild::add_automatic_buildsystem_dependencies |
|---|
| 44 | :debug:main Finished running callback portbuild::add_automatic_buildsystem_dependencies |
|---|
| 45 | :debug:main Running callback portstartupitem::add_notes |
|---|
| 46 | :debug:main Finished running callback portstartupitem::add_notes |
|---|
| 47 | :debug:main Running callback xcodeversions_run_check |
|---|
| 48 | :debug:main Finished running callback xcodeversions_run_check |
|---|
| 49 | :debug:main No need to upgrade! libiconv 1.16_1 >= libiconv 1.16_1 |
|---|
| 50 | :debug:main epoch: in tree: 0 installed: 0 |
|---|
| 51 | :debug:main gettext-runtime 0.21_0 exists in the ports tree |
|---|
| 52 | :debug:main gettext-runtime 0.21_0 is the latest installed |
|---|
| 53 | :debug:main gettext-runtime 0.21_0 +universal is active |
|---|
| 54 | :debug:main Merging existing requested variants '+universal' into variants |
|---|
| 55 | :debug:main new fully merged portvariants: universal + |
|---|
| 56 | :debug:main Changing to port directory: /opt/local/var/macports/sources/rsync.macports.org/macports/release/tarballs/ports/devel/gettext |
|---|
| 57 | :debug:main OS darwin/9.8.0 (macOS 10.5.8) arch powerpc |
|---|
| 58 | :debug:main Sourcing PortGroup compiler_blacklist_versions 1.0 from /opt/local/var/macports/sources/rsync.macports.org/macports/release/tarballs/ports/_resources/port1.0/group/compiler_blacklist_versions-1.0.tcl |
|---|
| 59 | :debug:main Sourcing PortGroup muniversal 1.0 from /opt/local/var/macports/sources/rsync.macports.org/macports/release/tarballs/ports/_resources/port1.0/group/muniversal-1.0.tcl |
|---|
| 60 | :debug:main Sourcing PortGroup clang_dependency 1.0 from /opt/local/var/macports/sources/rsync.macports.org/macports/release/tarballs/ports/_resources/port1.0/group/clang_dependency-1.0.tcl |
|---|
| 61 | :debug:main compiler clang blacklisted because it's not installed or it doesn't work |
|---|
| 62 | :debug:main muniversal: adding universal variant |
|---|
| 63 | :debug:main Reading variant descriptions from /opt/local/var/macports/sources/rsync.macports.org/macports/release/tarballs/ports/_resources/port1.0/variant_descriptions.conf |
|---|
| 64 | :debug:main Executing variant universal provides universal |
|---|
| 65 | :debug:main Running callback portconfigure::add_automatic_compiler_dependencies |
|---|
| 66 | :debug:main Finished running callback portconfigure::add_automatic_compiler_dependencies |
|---|
| 67 | :debug:main Running callback portbuild::add_automatic_buildsystem_dependencies |
|---|
| 68 | :debug:main Finished running callback portbuild::add_automatic_buildsystem_dependencies |
|---|
| 69 | :debug:main Running callback portstartupitem::add_notes |
|---|
| 70 | :debug:main Finished running callback portstartupitem::add_notes |
|---|
| 71 | :debug:main No need to upgrade! gettext-runtime 0.21_0 >= gettext-runtime 0.21_0 |
|---|
| 72 | :debug:main epoch: in tree: 0 installed: 0 |
|---|
| 73 | :debug:main pkgconfig 0.29.2_0 exists in the ports tree |
|---|
| 74 | :debug:main pkgconfig 0.29.2_0 is the latest installed |
|---|
| 75 | :debug:main pkgconfig 0.29.2_0 +universal is active |
|---|
| 76 | :debug:main Merging existing requested variants '+universal' into variants |
|---|
| 77 | :debug:main new fully merged portvariants: universal + |
|---|
| 78 | :debug:main Changing to port directory: /opt/local/var/macports/sources/rsync.macports.org/macports/release/tarballs/ports/devel/pkgconfig |
|---|
| 79 | :debug:main OS darwin/9.8.0 (macOS 10.5.8) arch powerpc |
|---|
| 80 | :debug:main Sourcing PortGroup clang_dependency 1.0 from /opt/local/var/macports/sources/rsync.macports.org/macports/release/tarballs/ports/_resources/port1.0/group/clang_dependency-1.0.tcl |
|---|
| 81 | :debug:main Sourcing PortGroup conflicts_build 1.0 from /opt/local/var/macports/sources/rsync.macports.org/macports/release/tarballs/ports/_resources/port1.0/group/conflicts_build-1.0.tcl |
|---|
| 82 | :debug:main adding the default universal variant |
|---|
| 83 | :debug:main Reading variant descriptions from /opt/local/var/macports/sources/rsync.macports.org/macports/release/tarballs/ports/_resources/port1.0/variant_descriptions.conf |
|---|
| 84 | :debug:main Executing variant universal provides universal |
|---|
| 85 | :debug:main Running callback portconfigure::add_automatic_compiler_dependencies |
|---|
| 86 | :debug:main Finished running callback portconfigure::add_automatic_compiler_dependencies |
|---|
| 87 | :debug:main Running callback portbuild::add_automatic_buildsystem_dependencies |
|---|
| 88 | :debug:main Finished running callback portbuild::add_automatic_buildsystem_dependencies |
|---|
| 89 | :debug:main Running callback portstartupitem::add_notes |
|---|
| 90 | :debug:main Finished running callback portstartupitem::add_notes |
|---|
| 91 | :debug:main No need to upgrade! pkgconfig 0.29.2_0 >= pkgconfig 0.29.2_0 |
|---|
| 92 | :debug:main epoch: in tree: 1 installed: 1 |
|---|
| 93 | :debug:main autoconf 2.71_1 exists in the ports tree |
|---|
| 94 | :debug:main autoconf 2.71_1 is the latest installed |
|---|
| 95 | :debug:main autoconf 2.71_1 is active |
|---|
| 96 | :debug:main Merging existing requested variants '' into variants |
|---|
| 97 | :debug:main new fully merged portvariants: universal + |
|---|
| 98 | :debug:main Changing to port directory: /opt/local/var/macports/sources/rsync.macports.org/macports/release/tarballs/ports/devel/autoconf |
|---|
| 99 | :debug:main OS darwin/9.8.0 (macOS 10.5.8) arch powerpc |
|---|
| 100 | :debug:main only one arch supported, so not adding the default universal variant |
|---|
| 101 | :debug:main Requested variant +universal is not provided by port autoconf. |
|---|
| 102 | :debug:main Running callback portconfigure::add_automatic_compiler_dependencies |
|---|
| 103 | :debug:main Finished running callback portconfigure::add_automatic_compiler_dependencies |
|---|
| 104 | :debug:main Running callback portbuild::add_automatic_buildsystem_dependencies |
|---|
| 105 | :debug:main Finished running callback portbuild::add_automatic_buildsystem_dependencies |
|---|
| 106 | :debug:main Running callback portstartupitem::add_notes |
|---|
| 107 | :debug:main Finished running callback portstartupitem::add_notes |
|---|
| 108 | :debug:main No need to upgrade! autoconf 2.71_1 >= autoconf 2.71_1 |
|---|
| 109 | :debug:main epoch: in tree: 2 installed: 2 |
|---|
| 110 | :debug:main gettext 0.21_0 exists in the ports tree |
|---|
| 111 | :debug:main gettext 0.21_0 is the latest installed |
|---|
| 112 | :debug:main gettext 0.21_0 +universal is active |
|---|
| 113 | :debug:main Merging existing requested variants '+universal' into variants |
|---|
| 114 | :debug:main new fully merged portvariants: universal + |
|---|
| 115 | :debug:main Changing to port directory: /opt/local/var/macports/sources/rsync.macports.org/macports/release/tarballs/ports/devel/gettext |
|---|
| 116 | :debug:main OS darwin/9.8.0 (macOS 10.5.8) arch powerpc |
|---|
| 117 | :debug:main Sourcing PortGroup compiler_blacklist_versions 1.0 from /opt/local/var/macports/sources/rsync.macports.org/macports/release/tarballs/ports/_resources/port1.0/group/compiler_blacklist_versions-1.0.tcl |
|---|
| 118 | :debug:main Sourcing PortGroup muniversal 1.0 from /opt/local/var/macports/sources/rsync.macports.org/macports/release/tarballs/ports/_resources/port1.0/group/muniversal-1.0.tcl |
|---|
| 119 | :debug:main Sourcing PortGroup clang_dependency 1.0 from /opt/local/var/macports/sources/rsync.macports.org/macports/release/tarballs/ports/_resources/port1.0/group/clang_dependency-1.0.tcl |
|---|
| 120 | :debug:main compiler clang blacklisted because it's not installed or it doesn't work |
|---|
| 121 | :debug:main muniversal: adding universal variant |
|---|
| 122 | :debug:main Reading variant descriptions from /opt/local/var/macports/sources/rsync.macports.org/macports/release/tarballs/ports/_resources/port1.0/variant_descriptions.conf |
|---|
| 123 | :debug:main Executing variant universal provides universal |
|---|
| 124 | :debug:main Running callback portconfigure::add_automatic_compiler_dependencies |
|---|
| 125 | :debug:main Finished running callback portconfigure::add_automatic_compiler_dependencies |
|---|
| 126 | :debug:main Running callback portbuild::add_automatic_buildsystem_dependencies |
|---|
| 127 | :debug:main Finished running callback portbuild::add_automatic_buildsystem_dependencies |
|---|
| 128 | :debug:main Running callback portstartupitem::add_notes |
|---|
| 129 | :debug:main Finished running callback portstartupitem::add_notes |
|---|
| 130 | :debug:main No need to upgrade! gettext 0.21_0 >= gettext 0.21_0 |
|---|
| 131 | :debug:main epoch: in tree: 0 installed: 0 |
|---|
| 132 | :debug:main libtextstyle 0.21_0 exists in the ports tree |
|---|
| 133 | :debug:main libtextstyle 0.21_0 is the latest installed |
|---|
| 134 | :debug:main libtextstyle 0.21_0 +universal is active |
|---|
| 135 | :debug:main Merging existing requested variants '+universal' into variants |
|---|
| 136 | :debug:main new fully merged portvariants: universal + |
|---|
| 137 | :debug:main Changing to port directory: /opt/local/var/macports/sources/rsync.macports.org/macports/release/tarballs/ports/devel/gettext |
|---|
| 138 | :debug:main OS darwin/9.8.0 (macOS 10.5.8) arch powerpc |
|---|
| 139 | :debug:main Sourcing PortGroup compiler_blacklist_versions 1.0 from /opt/local/var/macports/sources/rsync.macports.org/macports/release/tarballs/ports/_resources/port1.0/group/compiler_blacklist_versions-1.0.tcl |
|---|
| 140 | :debug:main Sourcing PortGroup muniversal 1.0 from /opt/local/var/macports/sources/rsync.macports.org/macports/release/tarballs/ports/_resources/port1.0/group/muniversal-1.0.tcl |
|---|
| 141 | :debug:main Sourcing PortGroup clang_dependency 1.0 from /opt/local/var/macports/sources/rsync.macports.org/macports/release/tarballs/ports/_resources/port1.0/group/clang_dependency-1.0.tcl |
|---|
| 142 | :debug:main compiler clang blacklisted because it's not installed or it doesn't work |
|---|
| 143 | :debug:main muniversal: adding universal variant |
|---|
| 144 | :debug:main Reading variant descriptions from /opt/local/var/macports/sources/rsync.macports.org/macports/release/tarballs/ports/_resources/port1.0/variant_descriptions.conf |
|---|
| 145 | :debug:main Executing variant universal provides universal |
|---|
| 146 | :debug:main Running callback portconfigure::add_automatic_compiler_dependencies |
|---|
| 147 | :debug:main Finished running callback portconfigure::add_automatic_compiler_dependencies |
|---|
| 148 | :debug:main Running callback portbuild::add_automatic_buildsystem_dependencies |
|---|
| 149 | :debug:main Finished running callback portbuild::add_automatic_buildsystem_dependencies |
|---|
| 150 | :debug:main Running callback portstartupitem::add_notes |
|---|
| 151 | :debug:main Finished running callback portstartupitem::add_notes |
|---|
| 152 | :debug:main No need to upgrade! libtextstyle 0.21_0 >= libtextstyle 0.21_0 |
|---|
| 153 | :debug:main epoch: in tree: 0 installed: 0 |
|---|
| 154 | :debug:main ncurses 6.3_0 exists in the ports tree |
|---|
| 155 | :debug:main ncurses 6.3_0 is the latest installed |
|---|
| 156 | :debug:main ncurses 6.3_0 +universal is active |
|---|
| 157 | :debug:main Merging existing requested variants '+universal' into variants |
|---|
| 158 | :debug:main new fully merged portvariants: universal + |
|---|
| 159 | :debug:main Changing to port directory: /opt/local/var/macports/sources/rsync.macports.org/macports/release/tarballs/ports/devel/ncurses |
|---|
| 160 | :debug:main OS darwin/9.8.0 (macOS 10.5.8) arch powerpc |
|---|
| 161 | :debug:main Sourcing PortGroup clang_dependency 1.0 from /opt/local/var/macports/sources/rsync.macports.org/macports/release/tarballs/ports/_resources/port1.0/group/clang_dependency-1.0.tcl |
|---|
| 162 | :debug:main adding the default universal variant |
|---|
| 163 | :debug:main Reading variant descriptions from /opt/local/var/macports/sources/rsync.macports.org/macports/release/tarballs/ports/_resources/port1.0/variant_descriptions.conf |
|---|
| 164 | :debug:main Executing variant universal provides universal |
|---|
| 165 | :debug:main Running callback portconfigure::add_automatic_compiler_dependencies |
|---|
| 166 | :debug:main Finished running callback portconfigure::add_automatic_compiler_dependencies |
|---|
| 167 | :debug:main Running callback portbuild::add_automatic_buildsystem_dependencies |
|---|
| 168 | :debug:main Finished running callback portbuild::add_automatic_buildsystem_dependencies |
|---|
| 169 | :debug:main Running callback portstartupitem::add_notes |
|---|
| 170 | :debug:main Finished running callback portstartupitem::add_notes |
|---|
| 171 | :debug:main No need to upgrade! ncurses 6.3_0 >= ncurses 6.3_0 |
|---|
| 172 | :debug:main epoch: in tree: 0 installed: 0 |
|---|
| 173 | :debug:main gettext-tools-libs 0.21_0 exists in the ports tree |
|---|
| 174 | :debug:main gettext-tools-libs 0.21_0 is the latest installed |
|---|
| 175 | :debug:main gettext-tools-libs 0.21_0 +universal is active |
|---|
| 176 | :debug:main Merging existing requested variants '+universal' into variants |
|---|
| 177 | :debug:main new fully merged portvariants: universal + |
|---|
| 178 | :debug:main Changing to port directory: /opt/local/var/macports/sources/rsync.macports.org/macports/release/tarballs/ports/devel/gettext |
|---|
| 179 | :debug:main OS darwin/9.8.0 (macOS 10.5.8) arch powerpc |
|---|
| 180 | :debug:main Sourcing PortGroup compiler_blacklist_versions 1.0 from /opt/local/var/macports/sources/rsync.macports.org/macports/release/tarballs/ports/_resources/port1.0/group/compiler_blacklist_versions-1.0.tcl |
|---|
| 181 | :debug:main Sourcing PortGroup muniversal 1.0 from /opt/local/var/macports/sources/rsync.macports.org/macports/release/tarballs/ports/_resources/port1.0/group/muniversal-1.0.tcl |
|---|
| 182 | :debug:main Sourcing PortGroup clang_dependency 1.0 from /opt/local/var/macports/sources/rsync.macports.org/macports/release/tarballs/ports/_resources/port1.0/group/clang_dependency-1.0.tcl |
|---|
| 183 | :debug:main compiler clang blacklisted because it's not installed or it doesn't work |
|---|
| 184 | :debug:main muniversal: adding universal variant |
|---|
| 185 | :debug:main Reading variant descriptions from /opt/local/var/macports/sources/rsync.macports.org/macports/release/tarballs/ports/_resources/port1.0/variant_descriptions.conf |
|---|
| 186 | :debug:main Executing variant universal provides universal |
|---|
| 187 | :debug:main Running callback portconfigure::add_automatic_compiler_dependencies |
|---|
| 188 | :debug:main Finished running callback portconfigure::add_automatic_compiler_dependencies |
|---|
| 189 | :debug:main Running callback portbuild::add_automatic_buildsystem_dependencies |
|---|
| 190 | :debug:main Finished running callback portbuild::add_automatic_buildsystem_dependencies |
|---|
| 191 | :debug:main Running callback portstartupitem::add_notes |
|---|
| 192 | :debug:main Finished running callback portstartupitem::add_notes |
|---|
| 193 | :debug:main No need to upgrade! gettext-tools-libs 0.21_0 >= gettext-tools-libs 0.21_0 |
|---|
| 194 | :debug:main epoch: in tree: 0 installed: 0 |
|---|
| 195 | :debug:main m4 1.4.19_1 exists in the ports tree |
|---|
| 196 | :debug:main m4 1.4.19_1 +universal is the latest installed |
|---|
| 197 | :debug:main m4 1.4.19_1 +universal is active |
|---|
| 198 | :debug:main Merging existing requested variants '+universal' into variants |
|---|
| 199 | :debug:main new fully merged portvariants: universal + |
|---|
| 200 | :debug:main Changing to port directory: /opt/local/var/macports/sources/rsync.macports.org/macports/release/tarballs/ports/devel/m4 |
|---|
| 201 | :debug:main OS darwin/9.8.0 (macOS 10.5.8) arch powerpc |
|---|
| 202 | :debug:main Sourcing PortGroup clang_dependency 1.0 from /opt/local/var/macports/sources/rsync.macports.org/macports/release/tarballs/ports/_resources/port1.0/group/clang_dependency-1.0.tcl |
|---|
| 203 | :debug:main Sourcing PortGroup muniversal 1.0 from /opt/local/var/macports/sources/rsync.macports.org/macports/release/tarballs/ports/_resources/port1.0/group/muniversal-1.0.tcl |
|---|
| 204 | :debug:main muniversal: adding universal variant |
|---|
| 205 | :debug:main Reading variant descriptions from /opt/local/var/macports/sources/rsync.macports.org/macports/release/tarballs/ports/_resources/port1.0/variant_descriptions.conf |
|---|
| 206 | :debug:main Executing variant universal provides universal |
|---|
| 207 | :debug:main Running callback portconfigure::add_automatic_compiler_dependencies |
|---|
| 208 | :debug:main Finished running callback portconfigure::add_automatic_compiler_dependencies |
|---|
| 209 | :debug:main Running callback portbuild::add_automatic_buildsystem_dependencies |
|---|
| 210 | :debug:main Finished running callback portbuild::add_automatic_buildsystem_dependencies |
|---|
| 211 | :debug:main Running callback portstartupitem::add_notes |
|---|
| 212 | :debug:main Finished running callback portstartupitem::add_notes |
|---|
| 213 | :debug:main No need to upgrade! m4 1.4.19_1 >= m4 1.4.19_1 |
|---|
| 214 | :debug:main epoch: in tree: 0 installed: 0 |
|---|
| 215 | :debug:main automake 1.16.5_0 exists in the ports tree |
|---|
| 216 | :debug:main automake 1.16.5_0 is the latest installed |
|---|
| 217 | :debug:main automake 1.16.5_0 is active |
|---|
| 218 | :debug:main Merging existing requested variants '' into variants |
|---|
| 219 | :debug:main new fully merged portvariants: universal + |
|---|
| 220 | :debug:main Changing to port directory: /opt/local/var/macports/sources/rsync.macports.org/macports/release/tarballs/ports/devel/automake |
|---|
| 221 | :debug:main OS darwin/9.8.0 (macOS 10.5.8) arch powerpc |
|---|
| 222 | :debug:main only one arch supported, so not adding the default universal variant |
|---|
| 223 | :debug:main Requested variant +universal is not provided by port automake. |
|---|
| 224 | :debug:main Running callback portconfigure::add_automatic_compiler_dependencies |
|---|
| 225 | :debug:main Finished running callback portconfigure::add_automatic_compiler_dependencies |
|---|
| 226 | :debug:main Running callback portbuild::add_automatic_buildsystem_dependencies |
|---|
| 227 | :debug:main Finished running callback portbuild::add_automatic_buildsystem_dependencies |
|---|
| 228 | :debug:main Running callback portstartupitem::add_notes |
|---|
| 229 | :debug:main Finished running callback portstartupitem::add_notes |
|---|
| 230 | :debug:main No need to upgrade! automake 1.16.5_0 >= automake 1.16.5_0 |
|---|
| 231 | :debug:main epoch: in tree: 0 installed: 0 |
|---|
| 232 | :debug:main libtool 2.4.6_13 exists in the ports tree |
|---|
| 233 | :debug:main libtool 2.4.6_13 +universal is the latest installed |
|---|
| 234 | :debug:main libtool 2.4.6_13 +universal is active |
|---|
| 235 | :debug:main Merging existing requested variants '+universal' into variants |
|---|
| 236 | :debug:main new fully merged portvariants: universal + |
|---|
| 237 | :debug:main Changing to port directory: /opt/local/var/macports/sources/rsync.macports.org/macports/release/tarballs/ports/devel/libtool |
|---|
| 238 | :debug:main OS darwin/9.8.0 (macOS 10.5.8) arch powerpc |
|---|
| 239 | :debug:main Sourcing PortGroup clang_dependency 1.0 from /opt/local/var/macports/sources/rsync.macports.org/macports/release/tarballs/ports/_resources/port1.0/group/clang_dependency-1.0.tcl |
|---|
| 240 | :debug:main adding the default universal variant |
|---|
| 241 | :debug:main Reading variant descriptions from /opt/local/var/macports/sources/rsync.macports.org/macports/release/tarballs/ports/_resources/port1.0/variant_descriptions.conf |
|---|
| 242 | :debug:main Executing variant universal provides universal |
|---|
| 243 | :debug:main Running callback portconfigure::add_automatic_compiler_dependencies |
|---|
| 244 | :debug:main Finished running callback portconfigure::add_automatic_compiler_dependencies |
|---|
| 245 | :debug:main Running callback portbuild::add_automatic_buildsystem_dependencies |
|---|
| 246 | :debug:main Finished running callback portbuild::add_automatic_buildsystem_dependencies |
|---|
| 247 | :debug:main Running callback portstartupitem::add_notes |
|---|
| 248 | :debug:main Finished running callback portstartupitem::add_notes |
|---|
| 249 | :debug:main No need to upgrade! libtool 2.4.6_13 >= libtool 2.4.6_13 |
|---|
| 250 | :error:main Cannot install usbredir for the archs 'ppc ppc64' because |
|---|
| 251 | :error:main its dependency libusb is only installed for the arch 'ppc' |
|---|
| 252 | :error:main and does not have a universal variant. |
|---|
| 253 | :debug:main architecture mismatch |
|---|
| 254 | :debug:main while executing |
|---|
| 255 | :debug:main "macports::_upgrade_mport_deps $mport $target" |
|---|
| 256 | :debug:main (procedure "mportexec" line 46) |
|---|
| 257 | :debug:main invoked from within |
|---|
| 258 | :debug:main "mportexec $workername $target" |
|---|
| 259 | :error:main Unable to execute port: architecture mismatch |
|---|
| 260 | version:1 |
|---|
| 261 | :debug:main Starting logging for usbredir @0.9.0_0+universal |
|---|
| 262 | :debug:sysinfo Mac OS X 10.5.8 (darwin/9.8.0) arch powerpc |
|---|
| 263 | :debug:sysinfo MacPorts 2.7.1 |
|---|
| 264 | :debug:sysinfo Xcode 3.1.4 |
|---|
| 265 | :debug:sysinfo SDK 10.5 |
|---|
| 266 | :debug:sysinfo MACOSX_DEPLOYMENT_TARGET: 10.5 |
|---|
| 267 | :msg:main ---> Computing dependencies for usbredir:info:main .:debug:main usbredir has no conflicts |
|---|
| 268 | :debug:main Searching for dependency: xz |
|---|
| 269 | :debug:main Found Dependency: receipt exists for xz |
|---|
| 270 | :debug:main Searching for dependency: pkgconfig |
|---|
| 271 | :debug:main Found Dependency: receipt exists for pkgconfig |
|---|
| 272 | :debug:main Searching for dependency: autoconf |
|---|
| 273 | :debug:main Found Dependency: receipt exists for autoconf |
|---|
| 274 | :debug:main Searching for dependency: automake |
|---|
| 275 | :debug:main Found Dependency: receipt exists for automake |
|---|
| 276 | :debug:main Searching for dependency: libtool |
|---|
| 277 | :debug:main Found Dependency: receipt exists for libtool |
|---|
| 278 | :debug:main Searching for dependency: libusb |
|---|
| 279 | :debug:main Found Dependency: receipt exists for libusb |
|---|
| 280 | :debug:main Executing org.macports.main (usbredir) |
|---|
| 281 | :debug:main dropping privileges: euid changed to 502, egid changed to 500. |
|---|
| 282 | :debug:archivefetch archivefetch phase started at Wed Apr 6 00:55:56 CST 2022 |
|---|
| 283 | :debug:archivefetch Executing org.macports.archivefetch (usbredir) |
|---|
| 284 | :debug:archivefetch Privilege de-escalation not attempted as not running as root. |
|---|
| 285 | :debug:fetch fetch phase started at Wed Apr 6 00:55:56 CST 2022 |
|---|
| 286 | :notice:fetch ---> Fetching distfiles for usbredir |
|---|
| 287 | :debug:fetch elevating privileges for fetch: euid changed to 0, egid changed to 0. |
|---|
| 288 | :debug:fetch dropping privileges: euid changed to 502, egid changed to 500. |
|---|
| 289 | :debug:fetch Executing org.macports.fetch (usbredir) |
|---|
| 290 | :info:fetch ---> usbredir-0.9.0.tar.xz does not exist in /opt/local/var/macports/distfiles/usbredir |
|---|
| 291 | :notice:fetch ---> Attempting to fetch usbredir-0.9.0.tar.xz from https://www.spice-space.org/download/usbredir/ |
|---|
| 292 | :debug:fetch Privilege de-escalation not attempted as not running as root. |
|---|
| 293 | :debug:checksum checksum phase started at Wed Apr 6 00:56:01 CST 2022 |
|---|
| 294 | :notice:checksum ---> Verifying checksums for usbredir |
|---|
| 295 | :debug:checksum Executing org.macports.checksum (usbredir) |
|---|
| 296 | :info:checksum ---> Checksumming usbredir-0.9.0.tar.xz |
|---|
| 297 | :debug:checksum Calculated (rmd160) is 1242253f935f292d1f62cdb0babb7f8a1b664276 |
|---|
| 298 | :debug:checksum Correct (rmd160) checksum for usbredir-0.9.0.tar.xz |
|---|
| 299 | :debug:checksum Calculated (sha256) is a3e167bf42bc7fe02c3c9db27d7767f1b8ce41b99ad14a4b0d0a60abe8bf56a6 |
|---|
| 300 | :debug:checksum Correct (sha256) checksum for usbredir-0.9.0.tar.xz |
|---|
| 301 | :debug:checksum Calculated (size) is 72224 |
|---|
| 302 | :debug:checksum Correct (size) checksum for usbredir-0.9.0.tar.xz |
|---|
| 303 | :debug:checksum Privilege de-escalation not attempted as not running as root. |
|---|
| 304 | :debug:extract extract phase started at Wed Apr 6 00:56:01 CST 2022 |
|---|
| 305 | :notice:extract ---> Extracting usbredir |
|---|
| 306 | :debug:extract setting option extract.cmd to /opt/local/bin/xz |
|---|
| 307 | :debug:extract Executing org.macports.extract (usbredir) |
|---|
| 308 | :info:extract ---> Extracting usbredir-0.9.0.tar.xz |
|---|
| 309 | :debug:extract setting option extract.args to '/opt/local/var/macports/distfiles/usbredir/usbredir-0.9.0.tar.xz' |
|---|
| 310 | :debug:extract Environment: |
|---|
| 311 | :debug:extract CC_PRINT_OPTIONS='YES' |
|---|
| 312 | :debug:extract CC_PRINT_OPTIONS_FILE='/opt/local/var/macports/build/_opt_local_var_macports_sources_rsync.macports.org_macports_release_tarballs_ports_devel_usbredir/usbredir/work/.CC_PRINT_OPTIONS' |
|---|
| 313 | :debug:extract CPATH='/opt/local/include' |
|---|
| 314 | :debug:extract DEVELOPER_DIR='/Developer' |
|---|
| 315 | :debug:extract LIBRARY_PATH='/opt/local/lib' |
|---|
| 316 | :debug:extract MACOSX_DEPLOYMENT_TARGET='10.5' |
|---|
| 317 | :info:extract Executing: cd "/opt/local/var/macports/build/_opt_local_var_macports_sources_rsync.macports.org_macports_release_tarballs_ports_devel_usbredir/usbredir/work" && /opt/local/bin/xz -dc '/opt/local/var/macports/distfiles/usbredir/usbredir-0.9.0.tar.xz' | /usr/bin/gnutar --no-same-owner -xf - |
|---|
| 318 | :debug:extract system: cd "/opt/local/var/macports/build/_opt_local_var_macports_sources_rsync.macports.org_macports_release_tarballs_ports_devel_usbredir/usbredir/work" && /opt/local/bin/xz -dc '/opt/local/var/macports/distfiles/usbredir/usbredir-0.9.0.tar.xz' | /usr/bin/gnutar --no-same-owner -xf - |
|---|
| 319 | :info:extract /usr/bin/gnutar: usbredir-0.9.0/COPYING: implausibly old time stamp 1970-01-01 08:00:00 |
|---|
| 320 | :info:extract /usr/bin/gnutar: usbredir-0.9.0/COPYING.LIB: implausibly old time stamp 1970-01-01 08:00:00 |
|---|
| 321 | :info:extract /usr/bin/gnutar: usbredir-0.9.0/ChangeLog.md: implausibly old time stamp 1970-01-01 08:00:00 |
|---|
| 322 | :info:extract /usr/bin/gnutar: usbredir-0.9.0/Makefile.am: implausibly old time stamp 1970-01-01 08:00:00 |
|---|
| 323 | :info:extract /usr/bin/gnutar: usbredir-0.9.0/README.md: implausibly old time stamp 1970-01-01 08:00:00 |
|---|
| 324 | :info:extract /usr/bin/gnutar: usbredir-0.9.0/TODO: implausibly old time stamp 1970-01-01 08:00:00 |
|---|
| 325 | :info:extract /usr/bin/gnutar: usbredir-0.9.0/autogen.sh: implausibly old time stamp 1970-01-01 08:00:00 |
|---|
| 326 | :info:extract /usr/bin/gnutar: usbredir-0.9.0/build-aux/msitool.py: implausibly old time stamp 1970-01-01 08:00:00 |
|---|
| 327 | :info:extract /usr/bin/gnutar: usbredir-0.9.0/build-aux/oss-fuzz.sh: implausibly old time stamp 1970-01-01 08:00:00 |
|---|
| 328 | :info:extract /usr/bin/gnutar: usbredir-0.9.0/build-aux: implausibly old time stamp 1970-01-01 08:00:00 |
|---|
| 329 | :info:extract /usr/bin/gnutar: usbredir-0.9.0/configure.ac: implausibly old time stamp 1970-01-01 08:00:00 |
|---|
| 330 | :info:extract /usr/bin/gnutar: usbredir-0.9.0/data/meson.build: implausibly old time stamp 1970-01-01 08:00:00 |
|---|
| 331 | :info:extract /usr/bin/gnutar: usbredir-0.9.0/data/usbredirect.wxs.in: implausibly old time stamp 1970-01-01 08:00:00 |
|---|
| 332 | :info:extract /usr/bin/gnutar: usbredir-0.9.0/data: implausibly old time stamp 1970-01-01 08:00:00 |
|---|
| 333 | :info:extract /usr/bin/gnutar: usbredir-0.9.0/docs/Makefile.am: implausibly old time stamp 1970-01-01 08:00:00 |
|---|
| 334 | :info:extract /usr/bin/gnutar: usbredir-0.9.0/docs/multi-thread.md: implausibly old time stamp 1970-01-01 08:00:00 |
|---|
| 335 | :info:extract /usr/bin/gnutar: usbredir-0.9.0/docs/usb-redirection-protocol.md: implausibly old time stamp 1970-01-01 08:00:00 |
|---|
| 336 | :info:extract /usr/bin/gnutar: usbredir-0.9.0/docs: implausibly old time stamp 1970-01-01 08:00:00 |
|---|
| 337 | :info:extract /usr/bin/gnutar: usbredir-0.9.0/fuzzing/Makefile.am: implausibly old time stamp 1970-01-01 08:00:00 |
|---|
| 338 | :info:extract /usr/bin/gnutar: usbredir-0.9.0/fuzzing/README.md: implausibly old time stamp 1970-01-01 08:00:00 |
|---|
| 339 | :info:extract /usr/bin/gnutar: usbredir-0.9.0/fuzzing/meson.build: implausibly old time stamp 1970-01-01 08:00:00 |
|---|
| 340 | :info:extract /usr/bin/gnutar: usbredir-0.9.0/fuzzing/standalone.c: implausibly old time stamp 1970-01-01 08:00:00 |
|---|
| 341 | :info:extract /usr/bin/gnutar: usbredir-0.9.0/fuzzing/usbredirparserfuzz.cc: implausibly old time stamp 1970-01-01 08:00:00 |
|---|
| 342 | :info:extract /usr/bin/gnutar: usbredir-0.9.0/fuzzing: implausibly old time stamp 1970-01-01 08:00:00 |
|---|
| 343 | :info:extract /usr/bin/gnutar: usbredir-0.9.0/git.mk: implausibly old time stamp 1970-01-01 08:00:00 |
|---|
| 344 | :info:extract /usr/bin/gnutar: usbredir-0.9.0/meson.build: implausibly old time stamp 1970-01-01 08:00:00 |
|---|
| 345 | :info:extract /usr/bin/gnutar: usbredir-0.9.0/meson_options.txt: implausibly old time stamp 1970-01-01 08:00:00 |
|---|
| 346 | :info:extract /usr/bin/gnutar: usbredir-0.9.0/tools/Makefile.am: implausibly old time stamp 1970-01-01 08:00:00 |
|---|
| 347 | :info:extract /usr/bin/gnutar: usbredir-0.9.0/tools/meson.build: implausibly old time stamp 1970-01-01 08:00:00 |
|---|
| 348 | :info:extract /usr/bin/gnutar: usbredir-0.9.0/tools/usbredirect.1: implausibly old time stamp 1970-01-01 08:00:00 |
|---|
| 349 | :info:extract /usr/bin/gnutar: usbredir-0.9.0/tools/usbredirect.c: implausibly old time stamp 1970-01-01 08:00:00 |
|---|
| 350 | :info:extract /usr/bin/gnutar: usbredir-0.9.0/tools: implausibly old time stamp 1970-01-01 08:00:00 |
|---|
| 351 | :info:extract /usr/bin/gnutar: usbredir-0.9.0/usbredirhost/Makefile.am: implausibly old time stamp 1970-01-01 08:00:00 |
|---|
| 352 | :info:extract /usr/bin/gnutar: usbredir-0.9.0/usbredirhost/libusbredirhost.pc.in: implausibly old time stamp 1970-01-01 08:00:00 |
|---|
| 353 | :info:extract /usr/bin/gnutar: usbredir-0.9.0/usbredirhost/meson.build: implausibly old time stamp 1970-01-01 08:00:00 |
|---|
| 354 | :info:extract /usr/bin/gnutar: usbredir-0.9.0/usbredirhost/usbredirhost.c: implausibly old time stamp 1970-01-01 08:00:00 |
|---|
| 355 | :info:extract /usr/bin/gnutar: usbredir-0.9.0/usbredirhost/usbredirhost.h: implausibly old time stamp 1970-01-01 08:00:00 |
|---|
| 356 | :info:extract /usr/bin/gnutar: usbredir-0.9.0/usbredirhost/usbredirhost.map: implausibly old time stamp 1970-01-01 08:00:00 |
|---|
| 357 | :info:extract /usr/bin/gnutar: usbredir-0.9.0/usbredirhost: implausibly old time stamp 1970-01-01 08:00:00 |
|---|
| 358 | :info:extract /usr/bin/gnutar: usbredir-0.9.0/usbredirparser/Makefile.am: implausibly old time stamp 1970-01-01 08:00:00 |
|---|
| 359 | :info:extract /usr/bin/gnutar: usbredir-0.9.0/usbredirparser/libusbredirparser-0.5.pc.in: implausibly old time stamp 1970-01-01 08:00:00 |
|---|
| 360 | :info:extract /usr/bin/gnutar: usbredir-0.9.0/usbredirparser/meson.build: implausibly old time stamp 1970-01-01 08:00:00 |
|---|
| 361 | :info:extract /usr/bin/gnutar: usbredir-0.9.0/usbredirparser/strtok_r.c: implausibly old time stamp 1970-01-01 08:00:00 |
|---|
| 362 | :info:extract /usr/bin/gnutar: usbredir-0.9.0/usbredirparser/strtok_r.h: implausibly old time stamp 1970-01-01 08:00:00 |
|---|
| 363 | :info:extract /usr/bin/gnutar: usbredir-0.9.0/usbredirparser/usbredirfilter.c: implausibly old time stamp 1970-01-01 08:00:00 |
|---|
| 364 | :info:extract /usr/bin/gnutar: usbredir-0.9.0/usbredirparser/usbredirfilter.h: implausibly old time stamp 1970-01-01 08:00:00 |
|---|
| 365 | :info:extract /usr/bin/gnutar: usbredir-0.9.0/usbredirparser/usbredirparser.c: implausibly old time stamp 1970-01-01 08:00:00 |
|---|
| 366 | :info:extract /usr/bin/gnutar: usbredir-0.9.0/usbredirparser/usbredirparser.h: implausibly old time stamp 1970-01-01 08:00:00 |
|---|
| 367 | :info:extract /usr/bin/gnutar: usbredir-0.9.0/usbredirparser/usbredirparser.map: implausibly old time stamp 1970-01-01 08:00:00 |
|---|
| 368 | :info:extract /usr/bin/gnutar: usbredir-0.9.0/usbredirparser/usbredirproto-compat.h: implausibly old time stamp 1970-01-01 08:00:00 |
|---|
| 369 | :info:extract /usr/bin/gnutar: usbredir-0.9.0/usbredirparser/usbredirproto.h: implausibly old time stamp 1970-01-01 08:00:00 |
|---|
| 370 | :info:extract /usr/bin/gnutar: usbredir-0.9.0/usbredirparser: implausibly old time stamp 1970-01-01 08:00:00 |
|---|
| 371 | :info:extract /usr/bin/gnutar: usbredir-0.9.0/usbredirserver/Makefile.am: implausibly old time stamp 1970-01-01 08:00:00 |
|---|
| 372 | :info:extract /usr/bin/gnutar: usbredir-0.9.0/usbredirserver/meson.build: implausibly old time stamp 1970-01-01 08:00:00 |
|---|
| 373 | :info:extract /usr/bin/gnutar: usbredir-0.9.0/usbredirserver/usbredirserver.1: implausibly old time stamp 1970-01-01 08:00:00 |
|---|
| 374 | :info:extract /usr/bin/gnutar: usbredir-0.9.0/usbredirserver/usbredirserver.c: implausibly old time stamp 1970-01-01 08:00:00 |
|---|
| 375 | :info:extract /usr/bin/gnutar: usbredir-0.9.0/usbredirserver: implausibly old time stamp 1970-01-01 08:00:00 |
|---|
| 376 | :info:extract /usr/bin/gnutar: usbredir-0.9.0/usbredirtestclient/Makefile.am: implausibly old time stamp 1970-01-01 08:00:00 |
|---|
| 377 | :info:extract /usr/bin/gnutar: usbredir-0.9.0/usbredirtestclient/meson.build: implausibly old time stamp 1970-01-01 08:00:00 |
|---|
| 378 | :info:extract /usr/bin/gnutar: usbredir-0.9.0/usbredirtestclient/usbredirtestclient.c: implausibly old time stamp 1970-01-01 08:00:00 |
|---|
| 379 | :info:extract /usr/bin/gnutar: usbredir-0.9.0/usbredirtestclient: implausibly old time stamp 1970-01-01 08:00:00 |
|---|
| 380 | :info:extract /usr/bin/gnutar: usbredir-0.9.0: implausibly old time stamp 1970-01-01 08:00:00 |
|---|
| 381 | :debug:extract euid/egid changed to: 0/0 |
|---|
| 382 | :debug:extract chowned /opt/local/var/macports/build/_opt_local_var_macports_sources_rsync.macports.org_macports_release_tarballs_ports_devel_usbredir/usbredir/work to macports |
|---|
| 383 | :debug:extract euid/egid changed to: 502/500 |
|---|
| 384 | :debug:extract Privilege de-escalation not attempted as not running as root. |
|---|
| 385 | :debug:patch patch phase started at Wed Apr 6 00:56:02 CST 2022 |
|---|
| 386 | :debug:patch Executing org.macports.patch (usbredir) |
|---|
| 387 | :notice:patch ---> Applying patches to usbredir |
|---|
| 388 | :info:patch ---> Applying no-Werror.patch |
|---|
| 389 | :debug:patch Environment: |
|---|
| 390 | :debug:patch CC_PRINT_OPTIONS='YES' |
|---|
| 391 | :debug:patch CC_PRINT_OPTIONS_FILE='/opt/local/var/macports/build/_opt_local_var_macports_sources_rsync.macports.org_macports_release_tarballs_ports_devel_usbredir/usbredir/work/.CC_PRINT_OPTIONS' |
|---|
| 392 | :debug:patch CPATH='/opt/local/include' |
|---|
| 393 | :debug:patch DEVELOPER_DIR='/Developer' |
|---|
| 394 | :debug:patch LIBRARY_PATH='/opt/local/lib' |
|---|
| 395 | :debug:patch MACOSX_DEPLOYMENT_TARGET='10.5' |
|---|
| 396 | :info:patch Executing: cd "/opt/local/var/macports/build/_opt_local_var_macports_sources_rsync.macports.org_macports_release_tarballs_ports_devel_usbredir/usbredir/work/usbredir-0.9.0" && /usr/bin/patch -p0 < '/opt/local/var/macports/sources/rsync.macports.org/macports/release/tarballs/ports/devel/usbredir/files/no-Werror.patch' |
|---|
| 397 | :debug:patch system: cd "/opt/local/var/macports/build/_opt_local_var_macports_sources_rsync.macports.org_macports_release_tarballs_ports_devel_usbredir/usbredir/work/usbredir-0.9.0" && /usr/bin/patch -p0 < '/opt/local/var/macports/sources/rsync.macports.org/macports/release/tarballs/ports/devel/usbredir/files/no-Werror.patch' |
|---|
| 398 | :info:patch patching file configure.ac |
|---|
| 399 | :debug:patch Privilege de-escalation not attempted as not running as root. |
|---|
| 400 | :debug:configure configure phase started at Wed Apr 6 00:56:02 CST 2022 |
|---|
| 401 | :notice:configure ---> Configuring usbredir |
|---|
| 402 | :debug:configure Preferred compilers: gcc-4.2 llvm-gcc-4.2 apple-gcc-4.2 gcc-4.0 macports-gcc-7 macports-gcc-6 macports-gcc-5 |
|---|
| 403 | :debug:configure Using compiler 'Xcode GCC 4.2' |
|---|
| 404 | :debug:configure Executing org.macports.configure (usbredir) |
|---|
| 405 | :debug:configure Environment: |
|---|
| 406 | :debug:configure CC_PRINT_OPTIONS='YES' |
|---|
| 407 | :debug:configure CC_PRINT_OPTIONS_FILE='/opt/local/var/macports/build/_opt_local_var_macports_sources_rsync.macports.org_macports_release_tarballs_ports_devel_usbredir/usbredir/work/.CC_PRINT_OPTIONS' |
|---|
| 408 | :debug:configure CPATH='/opt/local/include' |
|---|
| 409 | :debug:configure DEVELOPER_DIR='/Developer' |
|---|
| 410 | :debug:configure LIBRARY_PATH='/opt/local/lib' |
|---|
| 411 | :debug:configure MACOSX_DEPLOYMENT_TARGET='10.5' |
|---|
| 412 | :info:configure Executing: cd "/opt/local/var/macports/build/_opt_local_var_macports_sources_rsync.macports.org_macports_release_tarballs_ports_devel_usbredir/usbredir/work/usbredir-0.9.0" && autoreconf -fvi |
|---|
| 413 | :debug:configure system: cd "/opt/local/var/macports/build/_opt_local_var_macports_sources_rsync.macports.org_macports_release_tarballs_ports_devel_usbredir/usbredir/work/usbredir-0.9.0" && autoreconf -fvi |
|---|
| 414 | :info:configure autoreconf: export WARNINGS= |
|---|
| 415 | :info:configure autoreconf: Entering directory '.' |
|---|
| 416 | :info:configure autoreconf: configure.ac: not using Gettext |
|---|
| 417 | :info:configure autoreconf: running: /opt/local/bin/aclocal --force |
|---|
| 418 | :info:configure autoreconf: configure.ac: tracing |
|---|
| 419 | :info:configure autoreconf: running: /opt/local/bin/glibtoolize --copy --force |
|---|
| 420 | :info:configure glibtoolize: putting auxiliary files in '.'. |
|---|
| 421 | :info:configure glibtoolize: copying file './ltmain.sh' |
|---|
| 422 | :info:configure glibtoolize: Consider adding 'AC_CONFIG_MACRO_DIRS([m4])' to configure.ac, |
|---|
| 423 | :info:configure glibtoolize: and rerunning glibtoolize and aclocal. |
|---|
| 424 | :info:configure glibtoolize: Consider adding '-I m4' to ACLOCAL_AMFLAGS in Makefile.am. |
|---|
| 425 | :info:configure autoreconf: configure.ac: not using Intltool |
|---|
| 426 | :info:configure autoreconf: configure.ac: not using Gtkdoc |
|---|
| 427 | :info:configure autoreconf: running: /opt/local/bin/aclocal --force |
|---|
| 428 | :info:configure autoreconf: running: /opt/local/bin/autoconf --force |
|---|
| 429 | :info:configure configure.ac:5: warning: 'AM_CONFIG_HEADER': this macro is obsolete. |
|---|
| 430 | :info:configure configure.ac:5: You should use the 'AC_CONFIG_HEADERS' macro instead. |
|---|
| 431 | :info:configure ./lib/autoconf/general.m4:2434: AC_DIAGNOSE is expanded from... |
|---|
| 432 | :info:configure aclocal.m4:10045: AM_CONFIG_HEADER is expanded from... |
|---|
| 433 | :info:configure configure.ac:5: the top level |
|---|
| 434 | :info:configure configure.ac:24: warning: The macro `AC_HEADER_STDC' is obsolete. |
|---|
| 435 | :info:configure configure.ac:24: You should run autoupdate. |
|---|
| 436 | :info:configure ./lib/autoconf/headers.m4:704: AC_HEADER_STDC is expanded from... |
|---|
| 437 | :info:configure configure.ac:24: the top level |
|---|
| 438 | :info:configure autoreconf: running: /opt/local/bin/autoheader --force |
|---|
| 439 | :info:configure autoreconf: running: /opt/local/bin/automake --add-missing --copy --force-missing |
|---|
| 440 | :info:configure configure.ac:22: installing './compile' |
|---|
| 441 | :info:configure configure.ac:27: installing './config.guess' |
|---|
| 442 | :info:configure configure.ac:27: installing './config.sub' |
|---|
| 443 | :info:configure configure.ac:19: installing './install-sh' |
|---|
| 444 | :info:configure configure.ac:19: installing './missing' |
|---|
| 445 | :info:configure fuzzing/Makefile.am: installing './depcomp' |
|---|
| 446 | :info:configure autoreconf: Leaving directory '.' |
|---|
| 447 | :debug:configure Environment: |
|---|
| 448 | :debug:configure CC='/usr/bin/gcc-4.2' |
|---|
| 449 | :debug:configure CC_PRINT_OPTIONS='YES' |
|---|
| 450 | :debug:configure CC_PRINT_OPTIONS_FILE='/opt/local/var/macports/build/_opt_local_var_macports_sources_rsync.macports.org_macports_release_tarballs_ports_devel_usbredir/usbredir/work/.CC_PRINT_OPTIONS' |
|---|
| 451 | :debug:configure CFLAGS='-pipe -Os -arch ppc -arch ppc64' |
|---|
| 452 | :debug:configure CPATH='/opt/local/include' |
|---|
| 453 | :debug:configure CPPFLAGS='-I/opt/local/include' |
|---|
| 454 | :debug:configure CXX='/usr/bin/g++-4.2' |
|---|
| 455 | :debug:configure CXXFLAGS='-pipe -Os -arch ppc -arch ppc64' |
|---|
| 456 | :debug:configure DEVELOPER_DIR='/Developer' |
|---|
| 457 | :debug:configure F90FLAGS='-pipe -Os' |
|---|
| 458 | :debug:configure FCFLAGS='-pipe -Os' |
|---|
| 459 | :debug:configure FFLAGS='-pipe -Os' |
|---|
| 460 | :debug:configure INSTALL='/usr/bin/install -c' |
|---|
| 461 | :debug:configure LDFLAGS='-L/opt/local/lib -Wl,-headerpad_max_install_names -arch ppc -arch ppc64' |
|---|
| 462 | :debug:configure LIBRARY_PATH='/opt/local/lib' |
|---|
| 463 | :debug:configure MACOSX_DEPLOYMENT_TARGET='10.5' |
|---|
| 464 | :debug:configure OBJC='/usr/bin/gcc-4.2' |
|---|
| 465 | :debug:configure OBJCFLAGS='-pipe -Os -arch ppc -arch ppc64' |
|---|
| 466 | :debug:configure OBJCXX='/usr/bin/g++-4.2' |
|---|
| 467 | :debug:configure OBJCXXFLAGS='-pipe -Os -arch ppc -arch ppc64' |
|---|
| 468 | :info:configure Executing: cd "/opt/local/var/macports/build/_opt_local_var_macports_sources_rsync.macports.org_macports_release_tarballs_ports_devel_usbredir/usbredir/work/usbredir-0.9.0" && ./configure --prefix=/opt/local --disable-dependency-tracking --disable-silent-rules |
|---|
| 469 | :debug:configure system: cd "/opt/local/var/macports/build/_opt_local_var_macports_sources_rsync.macports.org_macports_release_tarballs_ports_devel_usbredir/usbredir/work/usbredir-0.9.0" && ./configure --prefix=/opt/local --disable-dependency-tracking --disable-silent-rules |
|---|
| 470 | :info:configure checking for a BSD-compatible install... /usr/bin/install -c |
|---|
| 471 | :info:configure checking whether build environment is sane... yes |
|---|
| 472 | :info:configure checking for a race-free mkdir -p... /opt/local/bin/gmkdir -p |
|---|
| 473 | :info:configure checking for gawk... gawk |
|---|
| 474 | :info:configure checking whether make sets $(MAKE)... yes |
|---|
| 475 | :info:configure checking whether make supports nested variables... yes |
|---|
| 476 | :info:configure checking whether make supports nested variables... (cached) yes |
|---|
| 477 | :info:configure checking for gcc... /usr/bin/gcc-4.2 |
|---|
| 478 | :info:configure checking whether the C compiler works... yes |
|---|
| 479 | :info:configure checking for C compiler default output file name... a.out |
|---|
| 480 | :info:configure checking for suffix of executables... |
|---|
| 481 | :info:configure checking whether we are cross compiling... no |
|---|
| 482 | :info:configure checking for suffix of object files... o |
|---|
| 483 | :info:configure checking whether the compiler supports GNU C... yes |
|---|
| 484 | :info:configure checking whether /usr/bin/gcc-4.2 accepts -g... yes |
|---|
| 485 | :info:configure checking for /usr/bin/gcc-4.2 option to enable C11 features... unsupported |
|---|
| 486 | :info:configure checking for /usr/bin/gcc-4.2 option to enable C99 features... -std=gnu99 |
|---|
| 487 | :info:configure checking whether /usr/bin/gcc-4.2 -std=gnu99 understands -c and -o together... yes |
|---|
| 488 | :info:configure checking whether make supports the include directive... yes (GNU style) |
|---|
| 489 | :info:configure checking dependency style of /usr/bin/gcc-4.2 -std=gnu99... none |
|---|
| 490 | :info:configure checking whether the compiler supports GNU C++... yes |
|---|
| 491 | :info:configure checking whether /usr/bin/g++-4.2 accepts -g... yes |
|---|
| 492 | :info:configure checking for /usr/bin/g++-4.2 option to enable C++11 features... none needed |
|---|
| 493 | :info:configure checking dependency style of /usr/bin/g++-4.2... none |
|---|
| 494 | :info:configure checking for stdio.h... yes |
|---|
| 495 | :info:configure checking for stdlib.h... yes |
|---|
| 496 | :info:configure checking for string.h... yes |
|---|
| 497 | :info:configure checking for inttypes.h... yes |
|---|
| 498 | :info:configure checking for stdint.h... yes |
|---|
| 499 | :info:configure checking for strings.h... yes |
|---|
| 500 | :info:configure checking for sys/stat.h... yes |
|---|
| 501 | :info:configure checking for sys/types.h... yes |
|---|
| 502 | :info:configure checking for unistd.h... yes |
|---|
| 503 | :info:configure checking for grep that handles long lines and -e... /opt/local/bin/ggrep |
|---|
| 504 | :info:configure checking for egrep... /opt/local/bin/ggrep -E |
|---|
| 505 | :info:configure checking whether ln -s works... yes |
|---|
| 506 | :info:configure checking build system type... powerpc-apple-darwin9.8.0 |
|---|
| 507 | :info:configure checking host system type... powerpc-apple-darwin9.8.0 |
|---|
| 508 | :info:configure checking how to print strings... printf |
|---|
| 509 | :info:configure checking for a sed that does not truncate output... /opt/local/bin/gsed |
|---|
| 510 | :info:configure checking for fgrep... /opt/local/bin/ggrep -F |
|---|
| 511 | :info:configure checking for ld used by /usr/bin/gcc-4.2 -std=gnu99... /usr/libexec/gcc/powerpc-apple-darwin9/4.2.1/ld |
|---|
| 512 | :info:configure checking if the linker (/usr/libexec/gcc/powerpc-apple-darwin9/4.2.1/ld) is GNU ld... no |
|---|
| 513 | :info:configure checking for BSD- or MS-compatible name lister (nm)... /usr/bin/nm -p |
|---|
| 514 | :info:configure checking the name lister (/usr/bin/nm -p) interface... BSD nm |
|---|
| 515 | :info:configure checking the maximum length of command line arguments... 196608 |
|---|
| 516 | :info:configure checking how to convert powerpc-apple-darwin9.8.0 file names to powerpc-apple-darwin9.8.0 format... func_convert_file_noop |
|---|
| 517 | :info:configure checking how to convert powerpc-apple-darwin9.8.0 file names to toolchain format... func_convert_file_noop |
|---|
| 518 | :info:configure checking for /usr/libexec/gcc/powerpc-apple-darwin9/4.2.1/ld option to reload object files... -r |
|---|
| 519 | :info:configure checking for objdump... no |
|---|
| 520 | :info:configure checking how to recognize dependent libraries... pass_all |
|---|
| 521 | :info:configure checking for dlltool... no |
|---|
| 522 | :info:configure checking how to associate runtime and link libraries... printf %s\n |
|---|
| 523 | :info:configure checking for ar... ar |
|---|
| 524 | :info:configure checking for archiver @FILE support... no |
|---|
| 525 | :info:configure checking for strip... strip |
|---|
| 526 | :info:configure checking for ranlib... ranlib |
|---|
| 527 | :info:configure checking command to parse /usr/bin/nm -p output from /usr/bin/gcc-4.2 -std=gnu99 object... ok |
|---|
| 528 | :info:configure checking for sysroot... no |
|---|
| 529 | :info:configure checking for a working dd... /bin/dd |
|---|
| 530 | :info:configure checking how to truncate binary pipes... /bin/dd bs=4096 count=1 |
|---|
| 531 | :info:configure checking for mt... no |
|---|
| 532 | :info:configure checking if : is a manifest tool... no |
|---|
| 533 | :info:configure checking for dsymutil... dsymutil |
|---|
| 534 | :info:configure checking for nmedit... nmedit |
|---|
| 535 | :info:configure checking for lipo... lipo |
|---|
| 536 | :info:configure checking for otool... otool |
|---|
| 537 | :info:configure checking for otool64... no |
|---|
| 538 | :info:configure checking for -single_module linker flag... yes |
|---|
| 539 | :info:configure checking for -exported_symbols_list linker flag... yes |
|---|
| 540 | :info:configure checking for -force_load linker flag... ld: unknown option: -force_load |
|---|
| 541 | :info:configure ld: unknown option: -force_load |
|---|
| 542 | :info:configure no |
|---|
| 543 | :info:configure checking for dlfcn.h... yes |
|---|
| 544 | :info:configure checking for objdir... .libs |
|---|
| 545 | :info:configure checking if /usr/bin/gcc-4.2 -std=gnu99 supports -fno-rtti -fno-exceptions... no |
|---|
| 546 | :info:configure checking for /usr/bin/gcc-4.2 -std=gnu99 option to produce PIC... -fno-common -DPIC |
|---|
| 547 | :info:configure checking if /usr/bin/gcc-4.2 -std=gnu99 PIC flag -fno-common -DPIC works... yes |
|---|
| 548 | :info:configure checking if /usr/bin/gcc-4.2 -std=gnu99 static flag -static works... no |
|---|
| 549 | :info:configure checking if /usr/bin/gcc-4.2 -std=gnu99 supports -c -o file.o... yes |
|---|
| 550 | :info:configure checking if /usr/bin/gcc-4.2 -std=gnu99 supports -c -o file.o... (cached) yes |
|---|
| 551 | :info:configure checking whether the /usr/bin/gcc-4.2 -std=gnu99 linker (/usr/libexec/gcc/powerpc-apple-darwin9/4.2.1/ld) supports shared libraries... yes |
|---|
| 552 | :info:configure checking dynamic linker characteristics... darwin9.8.0 dyld |
|---|
| 553 | :info:configure checking how to hardcode library paths into programs... immediate |
|---|
| 554 | :info:configure checking whether stripping libraries is possible... yes |
|---|
| 555 | :info:configure checking if libtool supports shared libraries... yes |
|---|
| 556 | :info:configure checking whether to build shared libraries... yes |
|---|
| 557 | :info:configure checking whether to build static libraries... yes |
|---|
| 558 | :info:configure checking how to run the C++ preprocessor... /usr/bin/g++-4.2 -E |
|---|
| 559 | :info:configure checking for ld used by /usr/bin/g++-4.2... /usr/libexec/gcc/powerpc-apple-darwin9/4.2.1/ld |
|---|
| 560 | :info:configure checking if the linker (/usr/libexec/gcc/powerpc-apple-darwin9/4.2.1/ld) is GNU ld... no |
|---|
| 561 | :info:configure checking whether the /usr/bin/g++-4.2 linker (/usr/libexec/gcc/powerpc-apple-darwin9/4.2.1/ld) supports shared libraries... yes |
|---|
| 562 | :info:configure checking for /usr/bin/g++-4.2 option to produce PIC... -fno-common -DPIC |
|---|
| 563 | :info:configure checking if /usr/bin/g++-4.2 PIC flag -fno-common -DPIC works... yes |
|---|
| 564 | :info:configure checking if /usr/bin/g++-4.2 static flag -static works... no |
|---|
| 565 | :info:configure checking if /usr/bin/g++-4.2 supports -c -o file.o... yes |
|---|
| 566 | :info:configure checking if /usr/bin/g++-4.2 supports -c -o file.o... (cached) yes |
|---|
| 567 | :info:configure checking whether the /usr/bin/g++-4.2 linker (/usr/libexec/gcc/powerpc-apple-darwin9/4.2.1/ld) supports shared libraries... yes |
|---|
| 568 | :info:configure checking dynamic linker characteristics... darwin9.8.0 dyld |
|---|
| 569 | :info:configure checking how to hardcode library paths into programs... immediate |
|---|
| 570 | :info:configure checking for native Win32... host is powerpc-apple-darwin9.8.0 |
|---|
| 571 | :info:configure no |
|---|
| 572 | :info:configure checking whether /usr/bin/gcc-4.2 -std=gnu99 supports -Wall... yes |
|---|
| 573 | :info:configure checking whether /usr/bin/gcc-4.2 -std=gnu99 supports -Wp,-D_FORTIFY_SOURCE=2... yes |
|---|
| 574 | :info:configure checking whether /usr/bin/gcc-4.2 -std=gnu99 supports -fstack-protector... yes |
|---|
| 575 | :info:configure checking whether /usr/bin/gcc-4.2 -std=gnu99 supports --param=ssp-buffer-size=4... yes |
|---|
| 576 | :info:configure checking for pkg-config... /opt/local/bin/pkg-config |
|---|
| 577 | :info:configure checking pkg-config is at least version 0.9.0... yes |
|---|
| 578 | :info:configure checking for libusb-1.0 >= 1.0.9... yes |
|---|
| 579 | :info:configure checking for gio-unix-2.0 >= 2.44... yes |
|---|
| 580 | :info:configure checking that generated files are newer than configure... done |
|---|
| 581 | :info:configure configure: creating ./config.status |
|---|
| 582 | :info:configure config.status: creating Makefile |
|---|
| 583 | :info:configure config.status: creating docs/Makefile |
|---|
| 584 | :info:configure config.status: creating tools/Makefile |
|---|
| 585 | :info:configure config.status: creating usbredirhost/Makefile |
|---|
| 586 | :info:configure config.status: creating usbredirhost/libusbredirhost.pc |
|---|
| 587 | :info:configure config.status: creating usbredirparser/Makefile |
|---|
| 588 | :info:configure config.status: creating usbredirparser/libusbredirparser-0.5.pc |
|---|
| 589 | :info:configure config.status: creating usbredirserver/Makefile |
|---|
| 590 | :info:configure config.status: creating usbredirtestclient/Makefile |
|---|
| 591 | :info:configure config.status: creating fuzzing/Makefile |
|---|
| 592 | :info:configure config.status: creating config.h |
|---|
| 593 | :info:configure config.status: executing depfiles commands |
|---|
| 594 | :info:configure config.status: executing libtool commands |
|---|
| 595 | :debug:configure Executing portconfigure::configure_finish |
|---|
| 596 | :debug:configure Privilege de-escalation not attempted as not running as root. |
|---|
| 597 | :debug:build build phase started at Wed Apr 6 00:56:43 CST 2022 |
|---|
| 598 | :notice:build ---> Building usbredir |
|---|
| 599 | :debug:build Executing org.macports.build (usbredir) |
|---|
| 600 | :debug:build Environment: |
|---|
| 601 | :debug:build CC_PRINT_OPTIONS='YES' |
|---|
| 602 | :debug:build CC_PRINT_OPTIONS_FILE='/opt/local/var/macports/build/_opt_local_var_macports_sources_rsync.macports.org_macports_release_tarballs_ports_devel_usbredir/usbredir/work/.CC_PRINT_OPTIONS' |
|---|
| 603 | :debug:build CPATH='/opt/local/include' |
|---|
| 604 | :debug:build DEVELOPER_DIR='/Developer' |
|---|
| 605 | :debug:build LIBRARY_PATH='/opt/local/lib' |
|---|
| 606 | :debug:build MACOSX_DEPLOYMENT_TARGET='10.5' |
|---|
| 607 | :info:build Executing: cd "/opt/local/var/macports/build/_opt_local_var_macports_sources_rsync.macports.org_macports_release_tarballs_ports_devel_usbredir/usbredir/work/usbredir-0.9.0" && /usr/bin/make -j4 -w all |
|---|
| 608 | :debug:build system: cd "/opt/local/var/macports/build/_opt_local_var_macports_sources_rsync.macports.org_macports_release_tarballs_ports_devel_usbredir/usbredir/work/usbredir-0.9.0" && /usr/bin/make -j4 -w all |
|---|
| 609 | :info:build make: Entering directory `/opt/local/var/macports/build/_opt_local_var_macports_sources_rsync.macports.org_macports_release_tarballs_ports_devel_usbredir/usbredir/work/usbredir-0.9.0' |
|---|
| 610 | :info:build git.mk: Generating .gitignore |
|---|
| 611 | :info:build configure.ac:5: warning: 'AM_CONFIG_HEADER': this macro is obsolete. |
|---|
| 612 | :info:build configure.ac:5: You should use the 'AC_CONFIG_HEADERS' macro instead. |
|---|
| 613 | :info:build ./lib/autoconf/general.m4:2434: AC_DIAGNOSE is expanded from... |
|---|
| 614 | :info:build aclocal.m4:10045: AM_CONFIG_HEADER is expanded from... |
|---|
| 615 | :info:build configure.ac:5: the top level |
|---|
| 616 | :info:build configure.ac:24: warning: The macro `AC_HEADER_STDC' is obsolete. |
|---|
| 617 | :info:build configure.ac:24: You should run autoupdate. |
|---|
| 618 | :info:build ./lib/autoconf/headers.m4:704: AC_HEADER_STDC is expanded from... |
|---|
| 619 | :info:build configure.ac:24: the top level |
|---|
| 620 | :info:build configure.ac:5: warning: 'AM_CONFIG_HEADER': this macro is obsolete. |
|---|
| 621 | :info:build configure.ac:5: You should use the 'AC_CONFIG_HEADERS' macro instead. |
|---|
| 622 | :info:build ./lib/autoconf/general.m4:2434: AC_DIAGNOSE is expanded from... |
|---|
| 623 | :info:build aclocal.m4:10045: AM_CONFIG_HEADER is expanded from... |
|---|
| 624 | :info:build configure.ac:5: the top level |
|---|
| 625 | :info:build configure.ac:24: warning: The macro `AC_HEADER_STDC' is obsolete. |
|---|
| 626 | :info:build configure.ac:24: You should run autoupdate. |
|---|
| 627 | :info:build ./lib/autoconf/headers.m4:704: AC_HEADER_STDC is expanded from... |
|---|
| 628 | :info:build configure.ac:24: the top level |
|---|
| 629 | :info:build configure.ac:5: warning: 'AM_CONFIG_HEADER': this macro is obsolete. |
|---|
| 630 | :info:build configure.ac:5: You should use the 'AC_CONFIG_HEADERS' macro instead. |
|---|
| 631 | :info:build ./lib/autoconf/general.m4:2434: AC_DIAGNOSE is expanded from... |
|---|
| 632 | :info:build aclocal.m4:10045: AM_CONFIG_HEADER is expanded from... |
|---|
| 633 | :info:build configure.ac:5: the top level |
|---|
| 634 | :info:build configure.ac:24: warning: The macro `AC_HEADER_STDC' is obsolete. |
|---|
| 635 | :info:build configure.ac:24: You should run autoupdate. |
|---|
| 636 | :info:build ./lib/autoconf/headers.m4:704: AC_HEADER_STDC is expanded from... |
|---|
| 637 | :info:build configure.ac:24: the top level |
|---|
| 638 | :info:build configure.ac:5: warning: 'AM_CONFIG_HEADER': this macro is obsolete. |
|---|
| 639 | :info:build configure.ac:5: You should use the 'AC_CONFIG_HEADERS' macro instead. |
|---|
| 640 | :info:build ./lib/autoconf/general.m4:2434: AC_DIAGNOSE is expanded from... |
|---|
| 641 | :info:build aclocal.m4:10045: AM_CONFIG_HEADER is expanded from... |
|---|
| 642 | :info:build configure.ac:5: the top level |
|---|
| 643 | :info:build configure.ac:24: warning: The macro `AC_HEADER_STDC' is obsolete. |
|---|
| 644 | :info:build configure.ac:24: You should run autoupdate. |
|---|
| 645 | :info:build ./lib/autoconf/headers.m4:704: AC_HEADER_STDC is expanded from... |
|---|
| 646 | :info:build configure.ac:24: the top level |
|---|
| 647 | :info:build /usr/bin/make all-recursive |
|---|
| 648 | :info:build make[1]: Entering directory `/opt/local/var/macports/build/_opt_local_var_macports_sources_rsync.macports.org_macports_release_tarballs_ports_devel_usbredir/usbredir/work/usbredir-0.9.0' |
|---|
| 649 | :info:build Making all in usbredirparser |
|---|
| 650 | :info:build make[2]: Entering directory `/opt/local/var/macports/build/_opt_local_var_macports_sources_rsync.macports.org_macports_release_tarballs_ports_devel_usbredir/usbredir/work/usbredir-0.9.0/usbredirparser' |
|---|
| 651 | :info:build /bin/sh ../libtool --tag=CC --mode=compile /usr/bin/gcc-4.2 -std=gnu99 -DHAVE_CONFIG_H -I. -I.. -I/opt/local/include -pipe -Os -arch ppc -arch ppc64 -Wall -Wp,-D_FORTIFY_SOURCE=2 -fstack-protector --param=ssp-buffer-size=4 -c -o usbredirparser.lo usbredirparser.c |
|---|
| 652 | :info:build /bin/sh ../libtool --tag=CC --mode=compile /usr/bin/gcc-4.2 -std=gnu99 -DHAVE_CONFIG_H -I. -I.. -I/opt/local/include -pipe -Os -arch ppc -arch ppc64 -Wall -Wp,-D_FORTIFY_SOURCE=2 -fstack-protector --param=ssp-buffer-size=4 -c -o usbredirfilter.lo usbredirfilter.c |
|---|
| 653 | :info:build git.mk: Generating .gitignore |
|---|
| 654 | :info:build libtool: compile: /usr/bin/gcc-4.2 -std=gnu99 -DHAVE_CONFIG_H -I. -I.. -I/opt/local/include -pipe -Os -arch ppc -arch ppc64 -Wall -Wp,-D_FORTIFY_SOURCE=2 -fstack-protector --param=ssp-buffer-size=4 -c usbredirparser.c -fno-common -DPIC -o .libs/usbredirparser.o |
|---|
| 655 | :info:build libtool: compile: /usr/bin/gcc-4.2 -std=gnu99 -DHAVE_CONFIG_H -I. -I.. -I/opt/local/include -pipe -Os -arch ppc -arch ppc64 -Wall -Wp,-D_FORTIFY_SOURCE=2 -fstack-protector --param=ssp-buffer-size=4 -c usbredirfilter.c -fno-common -DPIC -o .libs/usbredirfilter.o |
|---|
| 656 | :info:build libtool: compile: /usr/bin/gcc-4.2 -std=gnu99 -DHAVE_CONFIG_H -I. -I.. -I/opt/local/include -pipe -Os -arch ppc -arch ppc64 -Wall -Wp,-D_FORTIFY_SOURCE=2 -fstack-protector --param=ssp-buffer-size=4 -c usbredirfilter.c -o usbredirfilter.o >/dev/null 2>&1 |
|---|
| 657 | :info:build libtool: compile: /usr/bin/gcc-4.2 -std=gnu99 -DHAVE_CONFIG_H -I. -I.. -I/opt/local/include -pipe -Os -arch ppc -arch ppc64 -Wall -Wp,-D_FORTIFY_SOURCE=2 -fstack-protector --param=ssp-buffer-size=4 -c usbredirparser.c -o usbredirparser.o >/dev/null 2>&1 |
|---|
| 658 | :info:build /bin/sh ../libtool --tag=CC --mode=link /usr/bin/gcc-4.2 -std=gnu99 -pipe -Os -arch ppc -arch ppc64 -Wall -Wp,-D_FORTIFY_SOURCE=2 -fstack-protector --param=ssp-buffer-size=4 -version-info 1:2:0 -no-undefined -export-symbols-regex '^usbredir' -L/opt/local/lib -Wl,-headerpad_max_install_names -arch ppc -arch ppc64 -o libusbredirparser.la -rpath /opt/local/lib usbredirparser.lo usbredirfilter.lo |
|---|
| 659 | :info:build libtool: link: /usr/bin/nm -p .libs/usbredirparser.o .libs/usbredirfilter.o | sed -n -e 's/^.*[ ]\([BCDEGRST][BCDEGRST]*\)[ ][ ]*_\([_A-Za-z][_A-Za-z0-9]*\)$/\1 _\2 \2/p' | sed '/ __gnu_lto/d' | /opt/local/bin/gsed 's/.* //' | sort | uniq > .libs/libusbredirparser.exp |
|---|
| 660 | :info:build libtool: link: /opt/local/bin/ggrep -E -e "^usbredir" ".libs/libusbredirparser.exp" > ".libs/libusbredirparser.expT" |
|---|
| 661 | :info:build libtool: link: mv -f ".libs/libusbredirparser.expT" ".libs/libusbredirparser.exp" |
|---|
| 662 | :info:build libtool: link: sed 's|^|_|' < .libs/libusbredirparser.exp > .libs/libusbredirparser-symbols.expsym |
|---|
| 663 | :info:build libtool: link: /usr/bin/gcc-4.2 -std=gnu99 -dynamiclib -o .libs/libusbredirparser.1.dylib .libs/usbredirparser.o .libs/usbredirfilter.o -L/opt/local/lib -Os -arch ppc -arch ppc64 -fstack-protector -Wl,-headerpad_max_install_names -arch ppc -arch ppc64 -install_name /opt/local/lib/libusbredirparser.1.dylib -compatibility_version 2 -current_version 2.2 -Wl,-single_module -Wl,-exported_symbols_list,.libs/libusbredirparser-symbols.expsym |
|---|
| 664 | :info:build libtool: link: dsymutil .libs/libusbredirparser.1.dylib || : |
|---|
| 665 | :info:build warning: no debug symbols in executable (-arch ppc7400) |
|---|
| 666 | :info:build warning: no debug symbols in executable (-arch ppc64) |
|---|
| 667 | :info:build libtool: link: (cd ".libs" && rm -f "libusbredirparser.dylib" && ln -s "libusbredirparser.1.dylib" "libusbredirparser.dylib") |
|---|
| 668 | :info:build libtool: link: ar cru .libs/libusbredirparser.a usbredirparser.o usbredirfilter.o |
|---|
| 669 | :info:build /opt/local/bin/ranlib: archive member: .libs/libusbredirparser.a(usbredirparser.o) fat object file's offset in archive not a multiple of 8) (must be since member is a 64-bit object file) |
|---|
| 670 | :info:build libtool: link: ranlib .libs/libusbredirparser.a |
|---|
| 671 | :info:build ranlib: archive member: .libs/libusbredirparser.a(usbredirparser.o) fat object file's offset in archive not a multiple of 8) (must be since member is a 64-bit object file) |
|---|
| 672 | :info:build libtool: link: ( cd ".libs" && rm -f "libusbredirparser.la" && ln -s "../libusbredirparser.la" "libusbredirparser.la" ) |
|---|
| 673 | :info:build make[2]: Leaving directory `/opt/local/var/macports/build/_opt_local_var_macports_sources_rsync.macports.org_macports_release_tarballs_ports_devel_usbredir/usbredir/work/usbredir-0.9.0/usbredirparser' |
|---|
| 674 | :info:build Making all in usbredirhost |
|---|
| 675 | :info:build make[2]: Entering directory `/opt/local/var/macports/build/_opt_local_var_macports_sources_rsync.macports.org_macports_release_tarballs_ports_devel_usbredir/usbredir/work/usbredir-0.9.0/usbredirhost' |
|---|
| 676 | :info:build /bin/sh ../libtool --tag=CC --mode=compile /usr/bin/gcc-4.2 -std=gnu99 -DHAVE_CONFIG_H -I. -I.. -I/opt/local/include -I/opt/local/include/libusb-1.0 -I../usbredirparser -pipe -Os -arch ppc -arch ppc64 -Wall -Wp,-D_FORTIFY_SOURCE=2 -fstack-protector --param=ssp-buffer-size=4 -c -o libusbredirhost_la-usbredirhost.lo `test -f 'usbredirhost.c' || echo './'`usbredirhost.c |
|---|
| 677 | :info:build git.mk: Generating .gitignore |
|---|
| 678 | :info:build libtool: compile: /usr/bin/gcc-4.2 -std=gnu99 -DHAVE_CONFIG_H -I. -I.. -I/opt/local/include -I/opt/local/include/libusb-1.0 -I../usbredirparser -pipe -Os -arch ppc -arch ppc64 -Wall -Wp,-D_FORTIFY_SOURCE=2 -fstack-protector --param=ssp-buffer-size=4 -c usbredirhost.c -fno-common -DPIC -o .libs/libusbredirhost_la-usbredirhost.o |
|---|
| 679 | :info:build libtool: compile: /usr/bin/gcc-4.2 -std=gnu99 -DHAVE_CONFIG_H -I. -I.. -I/opt/local/include -I/opt/local/include/libusb-1.0 -I../usbredirparser -pipe -Os -arch ppc -arch ppc64 -Wall -Wp,-D_FORTIFY_SOURCE=2 -fstack-protector --param=ssp-buffer-size=4 -c usbredirhost.c -o libusbredirhost_la-usbredirhost.o >/dev/null 2>&1 |
|---|
| 680 | :info:build /bin/sh ../libtool --tag=CC --mode=link /usr/bin/gcc-4.2 -std=gnu99 -I/opt/local/include/libusb-1.0 -I../usbredirparser -pipe -Os -arch ppc -arch ppc64 -Wall -Wp,-D_FORTIFY_SOURCE=2 -fstack-protector --param=ssp-buffer-size=4 -version-info 1:2:0 -no-undefined -L/opt/local/lib -Wl,-headerpad_max_install_names -arch ppc -arch ppc64 -o libusbredirhost.la -rpath /opt/local/lib libusbredirhost_la-usbredirhost.lo -L/opt/local/lib -lusb-1.0 ../usbredirparser/libusbredirparser.la |
|---|
| 681 | :info:build libtool: link: /usr/bin/gcc-4.2 -std=gnu99 -dynamiclib -o .libs/libusbredirhost.1.dylib .libs/libusbredirhost_la-usbredirhost.o -L/opt/local/lib /opt/local/lib/libusb-1.0.dylib ../usbredirparser/.libs/libusbredirparser.dylib -Os -arch ppc -arch ppc64 -fstack-protector -Wl,-headerpad_max_install_names -arch ppc -arch ppc64 -pthread -install_name /opt/local/lib/libusbredirhost.1.dylib -compatibility_version 2 -current_version 2.2 -Wl,-single_module |
|---|
| 682 | :info:build libtool: link: dsymutil .libs/libusbredirhost.1.dylib || : |
|---|
| 683 | :info:build warning: no debug symbols in executable (-arch ppc7400) |
|---|
| 684 | :info:build warning: no debug symbols in executable (-arch ppc64) |
|---|
| 685 | :info:build libtool: link: (cd ".libs" && rm -f "libusbredirhost.dylib" && ln -s "libusbredirhost.1.dylib" "libusbredirhost.dylib") |
|---|
| 686 | :info:build libtool: link: ar cru .libs/libusbredirhost.a libusbredirhost_la-usbredirhost.o |
|---|
| 687 | :info:build libtool: link: ranlib .libs/libusbredirhost.a |
|---|
| 688 | :info:build libtool: link: ( cd ".libs" && rm -f "libusbredirhost.la" && ln -s "../libusbredirhost.la" "libusbredirhost.la" ) |
|---|
| 689 | :info:build make[2]: Leaving directory `/opt/local/var/macports/build/_opt_local_var_macports_sources_rsync.macports.org_macports_release_tarballs_ports_devel_usbredir/usbredir/work/usbredir-0.9.0/usbredirhost' |
|---|
| 690 | :info:build Making all in docs |
|---|
| 691 | :info:build make[2]: Entering directory `/opt/local/var/macports/build/_opt_local_var_macports_sources_rsync.macports.org_macports_release_tarballs_ports_devel_usbredir/usbredir/work/usbredir-0.9.0/docs' |
|---|
| 692 | :info:build git.mk: Generating .gitignore |
|---|
| 693 | :info:build configure.ac:5: warning: 'AM_CONFIG_HEADER': this macro is obsolete. |
|---|
| 694 | :info:build configure.ac:5: You should use the 'AC_CONFIG_HEADERS' macro instead. |
|---|
| 695 | :info:build ./lib/autoconf/general.m4:2434: AC_DIAGNOSE is expanded from... |
|---|
| 696 | :info:build aclocal.m4:10045: AM_CONFIG_HEADER is expanded from... |
|---|
| 697 | :info:build configure.ac:5: the top level |
|---|
| 698 | :info:build configure.ac:24: warning: The macro `AC_HEADER_STDC' is obsolete. |
|---|
| 699 | :info:build configure.ac:24: You should run autoupdate. |
|---|
| 700 | :info:build ./lib/autoconf/headers.m4:704: AC_HEADER_STDC is expanded from... |
|---|
| 701 | :info:build configure.ac:24: the top level |
|---|
| 702 | :info:build configure.ac:5: warning: 'AM_CONFIG_HEADER': this macro is obsolete. |
|---|
| 703 | :info:build configure.ac:5: You should use the 'AC_CONFIG_HEADERS' macro instead. |
|---|
| 704 | :info:build ./lib/autoconf/general.m4:2434: AC_DIAGNOSE is expanded from... |
|---|
| 705 | :info:build aclocal.m4:10045: AM_CONFIG_HEADER is expanded from... |
|---|
| 706 | :info:build configure.ac:5: the top level |
|---|
| 707 | :info:build configure.ac:24: warning: The macro `AC_HEADER_STDC' is obsolete. |
|---|
| 708 | :info:build configure.ac:24: You should run autoupdate. |
|---|
| 709 | :info:build ./lib/autoconf/headers.m4:704: AC_HEADER_STDC is expanded from... |
|---|
| 710 | :info:build configure.ac:24: the top level |
|---|
| 711 | :info:build configure.ac:5: warning: 'AM_CONFIG_HEADER': this macro is obsolete. |
|---|
| 712 | :info:build configure.ac:5: You should use the 'AC_CONFIG_HEADERS' macro instead. |
|---|
| 713 | :info:build ./lib/autoconf/general.m4:2434: AC_DIAGNOSE is expanded from... |
|---|
| 714 | :info:build aclocal.m4:10045: AM_CONFIG_HEADER is expanded from... |
|---|
| 715 | :info:build configure.ac:5: the top level |
|---|
| 716 | :info:build configure.ac:24: warning: The macro `AC_HEADER_STDC' is obsolete. |
|---|
| 717 | :info:build configure.ac:24: You should run autoupdate. |
|---|
| 718 | :info:build ./lib/autoconf/headers.m4:704: AC_HEADER_STDC is expanded from... |
|---|
| 719 | :info:build configure.ac:24: the top level |
|---|
| 720 | :info:build configure.ac:5: warning: 'AM_CONFIG_HEADER': this macro is obsolete. |
|---|
| 721 | :info:build configure.ac:5: You should use the 'AC_CONFIG_HEADERS' macro instead. |
|---|
| 722 | :info:build ./lib/autoconf/general.m4:2434: AC_DIAGNOSE is expanded from... |
|---|
| 723 | :info:build aclocal.m4:10045: AM_CONFIG_HEADER is expanded from... |
|---|
| 724 | :info:build configure.ac:5: the top level |
|---|
| 725 | :info:build configure.ac:24: warning: The macro `AC_HEADER_STDC' is obsolete. |
|---|
| 726 | :info:build configure.ac:24: You should run autoupdate. |
|---|
| 727 | :info:build ./lib/autoconf/headers.m4:704: AC_HEADER_STDC is expanded from... |
|---|
| 728 | :info:build configure.ac:24: the top level |
|---|
| 729 | :info:build make[2]: Leaving directory `/opt/local/var/macports/build/_opt_local_var_macports_sources_rsync.macports.org_macports_release_tarballs_ports_devel_usbredir/usbredir/work/usbredir-0.9.0/docs' |
|---|
| 730 | :info:build Making all in fuzzing |
|---|
| 731 | :info:build make[2]: Entering directory `/opt/local/var/macports/build/_opt_local_var_macports_sources_rsync.macports.org_macports_release_tarballs_ports_devel_usbredir/usbredir/work/usbredir-0.9.0/fuzzing' |
|---|
| 732 | :info:build git.mk: Generating .gitignore |
|---|
| 733 | :info:build make[2]: Leaving directory `/opt/local/var/macports/build/_opt_local_var_macports_sources_rsync.macports.org_macports_release_tarballs_ports_devel_usbredir/usbredir/work/usbredir-0.9.0/fuzzing' |
|---|
| 734 | :info:build Making all in tools |
|---|
| 735 | :info:build make[2]: Entering directory `/opt/local/var/macports/build/_opt_local_var_macports_sources_rsync.macports.org_macports_release_tarballs_ports_devel_usbredir/usbredir/work/usbredir-0.9.0/tools' |
|---|
| 736 | :info:build /usr/bin/gcc-4.2 -std=gnu99 -DHAVE_CONFIG_H -I. -I.. -I/opt/local/include -I/opt/local/include/libusb-1.0 -I/opt/local/include/gio-unix-2.0 -I/opt/local/include/glib-2.0 -I/opt/local/lib/glib-2.0/include -I../usbredirhost -I../usbredirparser -pipe -Os -arch ppc -arch ppc64 -Wall -Wp,-D_FORTIFY_SOURCE=2 -fstack-protector --param=ssp-buffer-size=4 -c -o usbredirect-usbredirect.o `test -f 'usbredirect.c' || echo './'`usbredirect.c |
|---|
| 737 | :info:build In file included from /opt/local/include/glib-2.0/glib/gthread.h:34, |
|---|
| 738 | :info:build from /opt/local/include/glib-2.0/glib/gasyncqueue.h:32, |
|---|
| 739 | :info:build from /opt/local/include/glib-2.0/glib.h:32, |
|---|
| 740 | :info:build from usbredirect.c:8: |
|---|
| 741 | :info:build /opt/local/include/glib-2.0/glib/gutils.h:336: warning: ‘GVoidFunc’ is deprecated |
|---|
| 742 | :info:build In file included from /opt/local/include/glib-2.0/glib.h:32, |
|---|
| 743 | :info:build from usbredirect.c:8: |
|---|
| 744 | :info:build /opt/local/include/glib-2.0/glib/gasyncqueue.h:116: warning: ‘GTimeVal’ is deprecated |
|---|
| 745 | :info:build /opt/local/include/glib-2.0/glib/gasyncqueue.h:119: warning: ‘GTimeVal’ is deprecated |
|---|
| 746 | :info:build In file included from /opt/local/include/glib-2.0/glib.h:43, |
|---|
| 747 | :info:build from usbredirect.c:8: |
|---|
| 748 | :info:build /opt/local/include/glib-2.0/glib/gdate.h:201: warning: ‘GTimeVal’ is deprecated |
|---|
| 749 | :info:build /opt/local/include/glib-2.0/glib/gdate.h:204: warning: ‘GTime’ is deprecated |
|---|
| 750 | :info:build In file included from /opt/local/include/glib-2.0/glib.h:44, |
|---|
| 751 | :info:build from usbredirect.c:8: |
|---|
| 752 | :info:build /opt/local/include/glib-2.0/glib/gdatetime.h:118: warning: ‘GTimeVal’ is deprecated |
|---|
| 753 | :info:build /opt/local/include/glib-2.0/glib/gdatetime.h:120: warning: ‘GTimeVal’ is deprecated |
|---|
| 754 | :info:build /opt/local/include/glib-2.0/glib/gdatetime.h:246: warning: ‘GTimeVal’ is deprecated |
|---|
| 755 | :info:build In file included from /opt/local/include/glib-2.0/glib/giochannel.h:33, |
|---|
| 756 | :info:build from /opt/local/include/glib-2.0/glib.h:54, |
|---|
| 757 | :info:build from usbredirect.c:8: |
|---|
| 758 | :info:build /opt/local/include/glib-2.0/glib/gmain.h:654: warning: ‘GTimeVal’ is deprecated |
|---|
| 759 | :info:build /opt/local/include/glib-2.0/glib/gmain.h:679: warning: ‘GTimeVal’ is deprecated |
|---|
| 760 | :info:build In file included from /opt/local/include/glib-2.0/glib.h:85, |
|---|
| 761 | :info:build from usbredirect.c:8: |
|---|
| 762 | :info:build /opt/local/include/glib-2.0/glib/gtestutils.h:379: warning: ‘GTestTrapFlags’ is deprecated |
|---|
| 763 | :info:build In file included from /opt/local/include/glib-2.0/glib.h:88, |
|---|
| 764 | :info:build from usbredirect.c:8: |
|---|
| 765 | :info:build /opt/local/include/glib-2.0/glib/gtimer.h:67: warning: ‘GTimeVal’ is deprecated |
|---|
| 766 | :info:build /opt/local/include/glib-2.0/glib/gtimer.h:71: warning: ‘GTimeVal’ is deprecated |
|---|
| 767 | :info:build /opt/local/include/glib-2.0/glib/gtimer.h:73: warning: ‘GTimeVal’ is deprecated |
|---|
| 768 | :info:build In file included from /opt/local/include/glib-2.0/glib.h:90, |
|---|
| 769 | :info:build from usbredirect.c:8: |
|---|
| 770 | :info:build /opt/local/include/glib-2.0/glib/gtrashstack.h:41: warning: ‘GTrashStack’ is deprecated |
|---|
| 771 | :info:build /opt/local/include/glib-2.0/glib/gtrashstack.h:45: warning: ‘GTrashStack’ is deprecated |
|---|
| 772 | :info:build /opt/local/include/glib-2.0/glib/gtrashstack.h:48: warning: ‘GTrashStack’ is deprecated |
|---|
| 773 | :info:build /opt/local/include/glib-2.0/glib/gtrashstack.h:50: warning: ‘GTrashStack’ is deprecated |
|---|
| 774 | :info:build /opt/local/include/glib-2.0/glib/gtrashstack.h:52: warning: ‘GTrashStack’ is deprecated |
|---|
| 775 | :info:build In file included from /opt/local/include/glib-2.0/glib.h:107, |
|---|
| 776 | :info:build from usbredirect.c:8: |
|---|
| 777 | :info:build /opt/local/include/glib-2.0/glib/deprecated/gcache.h:47: warning: ‘GCacheNewFunc’ is deprecated |
|---|
| 778 | :info:build /opt/local/include/glib-2.0/glib/deprecated/gcache.h:48: warning: ‘GCacheDestroyFunc’ is deprecated |
|---|
| 779 | :info:build /opt/local/include/glib-2.0/glib/deprecated/gcache.h:49: warning: ‘GCacheDupFunc’ is deprecated |
|---|
| 780 | :info:build /opt/local/include/glib-2.0/glib/deprecated/gcache.h:50: warning: ‘GCacheDestroyFunc’ is deprecated |
|---|
| 781 | :info:build /opt/local/include/glib-2.0/glib/deprecated/gcache.h:55: warning: ‘GCache’ is deprecated |
|---|
| 782 | :info:build /opt/local/include/glib-2.0/glib/deprecated/gcache.h:57: warning: ‘GCache’ is deprecated |
|---|
| 783 | :info:build /opt/local/include/glib-2.0/glib/deprecated/gcache.h:60: warning: ‘GCache’ is deprecated |
|---|
| 784 | :info:build /opt/local/include/glib-2.0/glib/deprecated/gcache.h:63: warning: ‘GCache’ is deprecated |
|---|
| 785 | :info:build /opt/local/include/glib-2.0/glib/deprecated/gcache.h:67: warning: ‘GCache’ is deprecated |
|---|
| 786 | :info:build In file included from /opt/local/include/glib-2.0/glib.h:111, |
|---|
| 787 | :info:build from usbredirect.c:8: |
|---|
| 788 | :info:build /opt/local/include/glib-2.0/glib/deprecated/gthread.h:52: warning: ‘GThreadPriority’ is deprecated |
|---|
| 789 | :info:build /opt/local/include/glib-2.0/glib/deprecated/gthread.h:70: warning: ‘GTimeVal’ is deprecated |
|---|
| 790 | :info:build /opt/local/include/glib-2.0/glib/deprecated/gthread.h:81: warning: ‘GThreadPriority’ is deprecated |
|---|
| 791 | :info:build /opt/local/include/glib-2.0/glib/deprecated/gthread.h:88: warning: ‘GThreadPriority’ is deprecated |
|---|
| 792 | :info:build /opt/local/include/glib-2.0/glib/deprecated/gthread.h:94: warning: ‘GThreadFunctions’ is deprecated |
|---|
| 793 | :info:build /opt/local/include/glib-2.0/glib/deprecated/gthread.h:111: warning: ‘GThreadPriority’ is deprecated |
|---|
| 794 | :info:build /opt/local/include/glib-2.0/glib/deprecated/gthread.h:116: warning: ‘GThreadPriority’ is deprecated |
|---|
| 795 | :info:build In file included from /opt/local/include/glib-2.0/glib.h:111, |
|---|
| 796 | :info:build from usbredirect.c:8: |
|---|
| 797 | :info:build /opt/local/include/glib-2.0/glib/deprecated/gthread.h:146: warning: ‘GStaticMutex’ is deprecated |
|---|
| 798 | :info:build /opt/local/include/glib-2.0/glib/deprecated/gthread.h:148: warning: ‘GStaticMutex’ is deprecated |
|---|
| 799 | :info:build /opt/local/include/glib-2.0/glib/deprecated/gthread.h:150: warning: ‘GStaticMutex’ is deprecated |
|---|
| 800 | :info:build /opt/local/include/glib-2.0/glib/deprecated/gthread.h:156: warning: ‘GStaticMutex’ is deprecated |
|---|
| 801 | :info:build /opt/local/include/glib-2.0/glib/deprecated/gthread.h:172: warning: ‘GStaticRecMutex’ is deprecated |
|---|
| 802 | :info:build /opt/local/include/glib-2.0/glib/deprecated/gthread.h:175: warning: ‘GStaticRecMutex’ is deprecated |
|---|
| 803 | :info:build /opt/local/include/glib-2.0/glib/deprecated/gthread.h:178: warning: ‘GStaticRecMutex’ is deprecated |
|---|
| 804 | :info:build /opt/local/include/glib-2.0/glib/deprecated/gthread.h:181: warning: ‘GStaticRecMutex’ is deprecated |
|---|
| 805 | :info:build /opt/local/include/glib-2.0/glib/deprecated/gthread.h:184: warning: ‘GStaticRecMutex’ is deprecated |
|---|
| 806 | :info:build /opt/local/include/glib-2.0/glib/deprecated/gthread.h:188: warning: ‘GStaticRecMutex’ is deprecated |
|---|
| 807 | :info:build /opt/local/include/glib-2.0/glib/deprecated/gthread.h:191: warning: ‘GStaticRecMutex’ is deprecated |
|---|
| 808 | :info:build /opt/local/include/glib-2.0/glib/deprecated/gthread.h:197: warning: ‘GStaticMutex’ is deprecated |
|---|
| 809 | :info:build /opt/local/include/glib-2.0/glib/deprecated/gthread.h:209: warning: ‘GStaticRWLock’ is deprecated |
|---|
| 810 | :info:build /opt/local/include/glib-2.0/glib/deprecated/gthread.h:212: warning: ‘GStaticRWLock’ is deprecated |
|---|
| 811 | :info:build /opt/local/include/glib-2.0/glib/deprecated/gthread.h:215: warning: ‘GStaticRWLock’ is deprecated |
|---|
| 812 | :info:build /opt/local/include/glib-2.0/glib/deprecated/gthread.h:218: warning: ‘GStaticRWLock’ is deprecated |
|---|
| 813 | :info:build /opt/local/include/glib-2.0/glib/deprecated/gthread.h:221: warning: ‘GStaticRWLock’ is deprecated |
|---|
| 814 | :info:build /opt/local/include/glib-2.0/glib/deprecated/gthread.h:224: warning: ‘GStaticRWLock’ is deprecated |
|---|
| 815 | :info:build /opt/local/include/glib-2.0/glib/deprecated/gthread.h:227: warning: ‘GStaticRWLock’ is deprecated |
|---|
| 816 | :info:build /opt/local/include/glib-2.0/glib/deprecated/gthread.h:230: warning: ‘GStaticRWLock’ is deprecated |
|---|
| 817 | :info:build /opt/local/include/glib-2.0/glib/deprecated/gthread.h:244: warning: ‘GStaticPrivate’ is deprecated |
|---|
| 818 | :info:build /opt/local/include/glib-2.0/glib/deprecated/gthread.h:247: warning: ‘GStaticPrivate’ is deprecated |
|---|
| 819 | :info:build /opt/local/include/glib-2.0/glib/deprecated/gthread.h:250: warning: ‘GStaticPrivate’ is deprecated |
|---|
| 820 | :info:build /opt/local/include/glib-2.0/glib/deprecated/gthread.h:255: warning: ‘GStaticPrivate’ is deprecated |
|---|
| 821 | :info:build /opt/local/include/glib-2.0/glib/deprecated/gthread.h:283: warning: ‘GTimeVal’ is deprecated |
|---|
| 822 | :info:build In file included from /opt/local/include/glib-2.0/gobject/gobject.h:24, |
|---|
| 823 | :info:build from /opt/local/include/glib-2.0/gobject/gbinding.h:29, |
|---|
| 824 | :info:build from /opt/local/include/glib-2.0/glib-object.h:22, |
|---|
| 825 | :info:build from /opt/local/include/glib-2.0/gio/gioenums.h:28, |
|---|
| 826 | :info:build from /opt/local/include/glib-2.0/gio/giotypes.h:28, |
|---|
| 827 | :info:build from /opt/local/include/glib-2.0/gio/gio.h:26, |
|---|
| 828 | :info:build from usbredirect.c:9: |
|---|
| 829 | :info:build /opt/local/include/glib-2.0/gobject/gtype.h:693: warning: ‘GTypeDebugFlags’ is deprecated |
|---|
| 830 | :info:build In file included from /opt/local/include/glib-2.0/gobject/gbinding.h:29, |
|---|
| 831 | :info:build from /opt/local/include/glib-2.0/glib-object.h:22, |
|---|
| 832 | :info:build from /opt/local/include/glib-2.0/gio/gioenums.h:28, |
|---|
| 833 | :info:build from /opt/local/include/glib-2.0/gio/giotypes.h:28, |
|---|
| 834 | :info:build from /opt/local/include/glib-2.0/gio/gio.h:26, |
|---|
| 835 | :info:build from usbredirect.c:9: |
|---|
| 836 | :info:build /opt/local/include/glib-2.0/gobject/gobject.h:433: warning: ‘GParameter’ is deprecated |
|---|
| 837 | :info:build In file included from /opt/local/include/glib-2.0/gio/gasyncinitable.h:29, |
|---|
| 838 | :info:build from /opt/local/include/glib-2.0/gio/gio.h:35, |
|---|
| 839 | :info:build from usbredirect.c:9: |
|---|
| 840 | :info:build /opt/local/include/glib-2.0/gio/ginitable.h:89: warning: ‘GParameter’ is deprecated |
|---|
| 841 | :info:build In file included from /opt/local/include/glib-2.0/gio/gio.h:35, |
|---|
| 842 | :info:build from usbredirect.c:9: |
|---|
| 843 | :info:build /opt/local/include/glib-2.0/gio/gasyncinitable.h:104: warning: ‘GParameter’ is deprecated |
|---|
| 844 | :info:build In file included from /opt/local/include/glib-2.0/gio/gdtlsclientconnection.h:27, |
|---|
| 845 | :info:build from /opt/local/include/glib-2.0/gio/gio.h:73, |
|---|
| 846 | :info:build from usbredirect.c:9: |
|---|
| 847 | :info:build /opt/local/include/glib-2.0/gio/gdtlsconnection.h:135: warning: ‘GTlsRehandshakeMode’ is deprecated |
|---|
| 848 | :info:build In file included from /opt/local/include/glib-2.0/gio/gio.h:81, |
|---|
| 849 | :info:build from usbredirect.c:9: |
|---|
| 850 | :info:build /opt/local/include/glib-2.0/gio/gfileinfo.h:1054: warning: ‘GTimeVal’ is deprecated |
|---|
| 851 | :info:build /opt/local/include/glib-2.0/gio/gfileinfo.h:1105: warning: ‘GTimeVal’ is deprecated |
|---|
| 852 | :info:build In file included from /opt/local/include/glib-2.0/gio/gtlsclientconnection.h:26, |
|---|
| 853 | :info:build from /opt/local/include/glib-2.0/gio/gio.h:160, |
|---|
| 854 | :info:build from usbredirect.c:9: |
|---|
| 855 | :info:build /opt/local/include/glib-2.0/gio/gtlsconnection.h:115: warning: ‘GTlsRehandshakeMode’ is deprecated |
|---|
| 856 | :info:build In file included from /opt/local/include/glib-2.0/glib/gthread.h:34, |
|---|
| 857 | :info:build from /opt/local/include/glib-2.0/glib/gasyncqueue.h:32, |
|---|
| 858 | :info:build from /opt/local/include/glib-2.0/glib.h:32, |
|---|
| 859 | :info:build from usbredirect.c:8: |
|---|
| 860 | :info:build /opt/local/include/glib-2.0/glib/gutils.h:336: warning: ‘GVoidFunc’ is deprecated |
|---|
| 861 | :info:build In file included from /opt/local/include/glib-2.0/glib.h:32, |
|---|
| 862 | :info:build from usbredirect.c:8: |
|---|
| 863 | :info:build /opt/local/include/glib-2.0/glib/gasyncqueue.h:116: warning: ‘GTimeVal’ is deprecated |
|---|
| 864 | :info:build /opt/local/include/glib-2.0/glib/gasyncqueue.h:119: warning: ‘GTimeVal’ is deprecated |
|---|
| 865 | :info:build In file included from /opt/local/include/glib-2.0/glib.h:43, |
|---|
| 866 | :info:build from usbredirect.c:8: |
|---|
| 867 | :info:build /opt/local/include/glib-2.0/glib/gdate.h:201: warning: ‘GTimeVal’ is deprecated |
|---|
| 868 | :info:build /opt/local/include/glib-2.0/glib/gdate.h:204: warning: ‘GTime’ is deprecated |
|---|
| 869 | :info:build In file included from /opt/local/include/glib-2.0/glib.h:44, |
|---|
| 870 | :info:build from usbredirect.c:8: |
|---|
| 871 | :info:build /opt/local/include/glib-2.0/glib/gdatetime.h:118: warning: ‘GTimeVal’ is deprecated |
|---|
| 872 | :info:build /opt/local/include/glib-2.0/glib/gdatetime.h:120: warning: ‘GTimeVal’ is deprecated |
|---|
| 873 | :info:build /opt/local/include/glib-2.0/glib/gdatetime.h:246: warning: ‘GTimeVal’ is deprecated |
|---|
| 874 | :info:build In file included from /opt/local/include/glib-2.0/glib/giochannel.h:33, |
|---|
| 875 | :info:build from /opt/local/include/glib-2.0/glib.h:54, |
|---|
| 876 | :info:build from usbredirect.c:8: |
|---|
| 877 | :info:build /opt/local/include/glib-2.0/glib/gmain.h:654: warning: ‘GTimeVal’ is deprecated |
|---|
| 878 | :info:build /opt/local/include/glib-2.0/glib/gmain.h:679: warning: ‘GTimeVal’ is deprecated |
|---|
| 879 | :info:build In file included from /opt/local/include/glib-2.0/glib.h:85, |
|---|
| 880 | :info:build from usbredirect.c:8: |
|---|
| 881 | :info:build /opt/local/include/glib-2.0/glib/gtestutils.h:379: warning: ‘GTestTrapFlags’ is deprecated |
|---|
| 882 | :info:build In file included from /opt/local/include/glib-2.0/glib.h:88, |
|---|
| 883 | :info:build from usbredirect.c:8: |
|---|
| 884 | :info:build /opt/local/include/glib-2.0/glib/gtimer.h:67: warning: ‘GTimeVal’ is deprecated |
|---|
| 885 | :info:build /opt/local/include/glib-2.0/glib/gtimer.h:71: warning: ‘GTimeVal’ is deprecated |
|---|
| 886 | :info:build /opt/local/include/glib-2.0/glib/gtimer.h:73: warning: ‘GTimeVal’ is deprecated |
|---|
| 887 | :info:build In file included from /opt/local/include/glib-2.0/glib.h:90, |
|---|
| 888 | :info:build from usbredirect.c:8: |
|---|
| 889 | :info:build /opt/local/include/glib-2.0/glib/gtrashstack.h:41: warning: ‘GTrashStack’ is deprecated |
|---|
| 890 | :info:build /opt/local/include/glib-2.0/glib/gtrashstack.h:45: warning: ‘GTrashStack’ is deprecated |
|---|
| 891 | :info:build /opt/local/include/glib-2.0/glib/gtrashstack.h:48: warning: ‘GTrashStack’ is deprecated |
|---|
| 892 | :info:build /opt/local/include/glib-2.0/glib/gtrashstack.h:50: warning: ‘GTrashStack’ is deprecated |
|---|
| 893 | :info:build /opt/local/include/glib-2.0/glib/gtrashstack.h:52: warning: ‘GTrashStack’ is deprecated |
|---|
| 894 | :info:build In file included from /opt/local/include/glib-2.0/glib.h:107, |
|---|
| 895 | :info:build from usbredirect.c:8: |
|---|
| 896 | :info:build /opt/local/include/glib-2.0/glib/deprecated/gcache.h:47: warning: ‘GCacheNewFunc’ is deprecated |
|---|
| 897 | :info:build /opt/local/include/glib-2.0/glib/deprecated/gcache.h:48: warning: ‘GCacheDestroyFunc’ is deprecated |
|---|
| 898 | :info:build /opt/local/include/glib-2.0/glib/deprecated/gcache.h:49: warning: ‘GCacheDupFunc’ is deprecated |
|---|
| 899 | :info:build /opt/local/include/glib-2.0/glib/deprecated/gcache.h:50: warning: ‘GCacheDestroyFunc’ is deprecated |
|---|
| 900 | :info:build /opt/local/include/glib-2.0/glib/deprecated/gcache.h:55: warning: ‘GCache’ is deprecated |
|---|
| 901 | :info:build /opt/local/include/glib-2.0/glib/deprecated/gcache.h:57: warning: ‘GCache’ is deprecated |
|---|
| 902 | :info:build /opt/local/include/glib-2.0/glib/deprecated/gcache.h:60: warning: ‘GCache’ is deprecated |
|---|
| 903 | :info:build /opt/local/include/glib-2.0/glib/deprecated/gcache.h:63: warning: ‘GCache’ is deprecated |
|---|
| 904 | :info:build /opt/local/include/glib-2.0/glib/deprecated/gcache.h:67: warning: ‘GCache’ is deprecated |
|---|
| 905 | :info:build In file included from /opt/local/include/glib-2.0/glib.h:111, |
|---|
| 906 | :info:build from usbredirect.c:8: |
|---|
| 907 | :info:build /opt/local/include/glib-2.0/glib/deprecated/gthread.h:52: warning: ‘GThreadPriority’ is deprecated |
|---|
| 908 | :info:build /opt/local/include/glib-2.0/glib/deprecated/gthread.h:70: warning: ‘GTimeVal’ is deprecated |
|---|
| 909 | :info:build /opt/local/include/glib-2.0/glib/deprecated/gthread.h:81: warning: ‘GThreadPriority’ is deprecated |
|---|
| 910 | :info:build /opt/local/include/glib-2.0/glib/deprecated/gthread.h:88: warning: ‘GThreadPriority’ is deprecated |
|---|
| 911 | :info:build /opt/local/include/glib-2.0/glib/deprecated/gthread.h:94: warning: ‘GThreadFunctions’ is deprecated |
|---|
| 912 | :info:build /opt/local/include/glib-2.0/glib/deprecated/gthread.h:111: warning: ‘GThreadPriority’ is deprecated |
|---|
| 913 | :info:build /opt/local/include/glib-2.0/glib/deprecated/gthread.h:116: warning: ‘GThreadPriority’ is deprecated |
|---|
| 914 | :info:build In file included from /opt/local/include/glib-2.0/glib.h:111, |
|---|
| 915 | :info:build from usbredirect.c:8: |
|---|
| 916 | :info:build /opt/local/include/glib-2.0/glib/deprecated/gthread.h:146: warning: ‘GStaticMutex’ is deprecated |
|---|
| 917 | :info:build /opt/local/include/glib-2.0/glib/deprecated/gthread.h:148: warning: ‘GStaticMutex’ is deprecated |
|---|
| 918 | :info:build /opt/local/include/glib-2.0/glib/deprecated/gthread.h:150: warning: ‘GStaticMutex’ is deprecated |
|---|
| 919 | :info:build /opt/local/include/glib-2.0/glib/deprecated/gthread.h:156: warning: ‘GStaticMutex’ is deprecated |
|---|
| 920 | :info:build /opt/local/include/glib-2.0/glib/deprecated/gthread.h:172: warning: ‘GStaticRecMutex’ is deprecated |
|---|
| 921 | :info:build /opt/local/include/glib-2.0/glib/deprecated/gthread.h:175: warning: ‘GStaticRecMutex’ is deprecated |
|---|
| 922 | :info:build /opt/local/include/glib-2.0/glib/deprecated/gthread.h:178: warning: ‘GStaticRecMutex’ is deprecated |
|---|
| 923 | :info:build /opt/local/include/glib-2.0/glib/deprecated/gthread.h:181: warning: ‘GStaticRecMutex’ is deprecated |
|---|
| 924 | :info:build /opt/local/include/glib-2.0/glib/deprecated/gthread.h:184: warning: ‘GStaticRecMutex’ is deprecated |
|---|
| 925 | :info:build /opt/local/include/glib-2.0/glib/deprecated/gthread.h:188: warning: ‘GStaticRecMutex’ is deprecated |
|---|
| 926 | :info:build /opt/local/include/glib-2.0/glib/deprecated/gthread.h:191: warning: ‘GStaticRecMutex’ is deprecated |
|---|
| 927 | :info:build /opt/local/include/glib-2.0/glib/deprecated/gthread.h:197: warning: ‘GStaticMutex’ is deprecated |
|---|
| 928 | :info:build /opt/local/include/glib-2.0/glib/deprecated/gthread.h:209: warning: ‘GStaticRWLock’ is deprecated |
|---|
| 929 | :info:build /opt/local/include/glib-2.0/glib/deprecated/gthread.h:212: warning: ‘GStaticRWLock’ is deprecated |
|---|
| 930 | :info:build /opt/local/include/glib-2.0/glib/deprecated/gthread.h:215: warning: ‘GStaticRWLock’ is deprecated |
|---|
| 931 | :info:build /opt/local/include/glib-2.0/glib/deprecated/gthread.h:218: warning: ‘GStaticRWLock’ is deprecated |
|---|
| 932 | :info:build /opt/local/include/glib-2.0/glib/deprecated/gthread.h:221: warning: ‘GStaticRWLock’ is deprecated |
|---|
| 933 | :info:build /opt/local/include/glib-2.0/glib/deprecated/gthread.h:224: warning: ‘GStaticRWLock’ is deprecated |
|---|
| 934 | :info:build /opt/local/include/glib-2.0/glib/deprecated/gthread.h:227: warning: ‘GStaticRWLock’ is deprecated |
|---|
| 935 | :info:build /opt/local/include/glib-2.0/glib/deprecated/gthread.h:230: warning: ‘GStaticRWLock’ is deprecated |
|---|
| 936 | :info:build /opt/local/include/glib-2.0/glib/deprecated/gthread.h:244: warning: ‘GStaticPrivate’ is deprecated |
|---|
| 937 | :info:build /opt/local/include/glib-2.0/glib/deprecated/gthread.h:247: warning: ‘GStaticPrivate’ is deprecated |
|---|
| 938 | :info:build /opt/local/include/glib-2.0/glib/deprecated/gthread.h:250: warning: ‘GStaticPrivate’ is deprecated |
|---|
| 939 | :info:build /opt/local/include/glib-2.0/glib/deprecated/gthread.h:255: warning: ‘GStaticPrivate’ is deprecated |
|---|
| 940 | :info:build /opt/local/include/glib-2.0/glib/deprecated/gthread.h:283: warning: ‘GTimeVal’ is deprecated |
|---|
| 941 | :info:build In file included from /opt/local/include/glib-2.0/gobject/gobject.h:24, |
|---|
| 942 | :info:build from /opt/local/include/glib-2.0/gobject/gbinding.h:29, |
|---|
| 943 | :info:build from /opt/local/include/glib-2.0/glib-object.h:22, |
|---|
| 944 | :info:build from /opt/local/include/glib-2.0/gio/gioenums.h:28, |
|---|
| 945 | :info:build from /opt/local/include/glib-2.0/gio/giotypes.h:28, |
|---|
| 946 | :info:build from /opt/local/include/glib-2.0/gio/gio.h:26, |
|---|
| 947 | :info:build from usbredirect.c:9: |
|---|
| 948 | :info:build /opt/local/include/glib-2.0/gobject/gtype.h:693: warning: ‘GTypeDebugFlags’ is deprecated |
|---|
| 949 | :info:build In file included from /opt/local/include/glib-2.0/gobject/gbinding.h:29, |
|---|
| 950 | :info:build from /opt/local/include/glib-2.0/glib-object.h:22, |
|---|
| 951 | :info:build from /opt/local/include/glib-2.0/gio/gioenums.h:28, |
|---|
| 952 | :info:build from /opt/local/include/glib-2.0/gio/giotypes.h:28, |
|---|
| 953 | :info:build from /opt/local/include/glib-2.0/gio/gio.h:26, |
|---|
| 954 | :info:build from usbredirect.c:9: |
|---|
| 955 | :info:build /opt/local/include/glib-2.0/gobject/gobject.h:433: warning: ‘GParameter’ is deprecated |
|---|
| 956 | :info:build In file included from /opt/local/include/glib-2.0/gio/gasyncinitable.h:29, |
|---|
| 957 | :info:build from /opt/local/include/glib-2.0/gio/gio.h:35, |
|---|
| 958 | :info:build from usbredirect.c:9: |
|---|
| 959 | :info:build /opt/local/include/glib-2.0/gio/ginitable.h:89: warning: ‘GParameter’ is deprecated |
|---|
| 960 | :info:build In file included from /opt/local/include/glib-2.0/gio/gio.h:35, |
|---|
| 961 | :info:build from usbredirect.c:9: |
|---|
| 962 | :info:build /opt/local/include/glib-2.0/gio/gasyncinitable.h:104: warning: ‘GParameter’ is deprecated |
|---|
| 963 | :info:build In file included from /opt/local/include/glib-2.0/gio/gdtlsclientconnection.h:27, |
|---|
| 964 | :info:build from /opt/local/include/glib-2.0/gio/gio.h:73, |
|---|
| 965 | :info:build from usbredirect.c:9: |
|---|
| 966 | :info:build /opt/local/include/glib-2.0/gio/gdtlsconnection.h:135: warning: ‘GTlsRehandshakeMode’ is deprecated |
|---|
| 967 | :info:build In file included from /opt/local/include/glib-2.0/gio/gio.h:81, |
|---|
| 968 | :info:build from usbredirect.c:9: |
|---|
| 969 | :info:build /opt/local/include/glib-2.0/gio/gfileinfo.h:1054: warning: ‘GTimeVal’ is deprecated |
|---|
| 970 | :info:build /opt/local/include/glib-2.0/gio/gfileinfo.h:1105: warning: ‘GTimeVal’ is deprecated |
|---|
| 971 | :info:build In file included from /opt/local/include/glib-2.0/gio/gtlsclientconnection.h:26, |
|---|
| 972 | :info:build from /opt/local/include/glib-2.0/gio/gio.h:160, |
|---|
| 973 | :info:build from usbredirect.c:9: |
|---|
| 974 | :info:build /opt/local/include/glib-2.0/gio/gtlsconnection.h:115: warning: ‘GTlsRehandshakeMode’ is deprecated |
|---|
| 975 | :info:build /bin/sh ../libtool --tag=CC --mode=link /usr/bin/gcc-4.2 -std=gnu99 -I/opt/local/include/libusb-1.0 -I/opt/local/include/gio-unix-2.0 -I/opt/local/include/glib-2.0 -I/opt/local/lib/glib-2.0/include -I../usbredirhost -I../usbredirparser -pipe -Os -arch ppc -arch ppc64 -Wall -Wp,-D_FORTIFY_SOURCE=2 -fstack-protector --param=ssp-buffer-size=4 -L/opt/local/lib -Wl,-headerpad_max_install_names -arch ppc -arch ppc64 -o usbredirect usbredirect-usbredirect.o -L/opt/local/lib -lusb-1.0 -L/opt/local/lib -lgio-2.0 -lgobject-2.0 -lglib-2.0 -lintl ../usbredirhost/libusbredirhost.la |
|---|
| 976 | :info:build libtool: link: /usr/bin/gcc-4.2 -std=gnu99 -I/opt/local/include/libusb-1.0 -I/opt/local/include/gio-unix-2.0 -I/opt/local/include/glib-2.0 -I/opt/local/lib/glib-2.0/include -I../usbredirhost -I../usbredirparser -pipe -Os -arch ppc -arch ppc64 -Wall -Wp,-D_FORTIFY_SOURCE=2 -fstack-protector --param=ssp-buffer-size=4 -Wl,-headerpad_max_install_names -arch ppc -arch ppc64 -o .libs/usbredirect usbredirect-usbredirect.o -L/opt/local/lib -lgio-2.0 -lgobject-2.0 -lglib-2.0 /opt/local/lib/libintl.dylib ../usbredirhost/.libs/libusbredirhost.dylib /opt/local/lib/libusb-1.0.dylib /opt/local/var/macports/build/_opt_local_var_macports_sources_rsync.macports.org_macports_release_tarballs_ports_devel_usbredir/usbredir/work/usbredir-0.9.0/usbredirparser/.libs/libusbredirparser.dylib -pthread |
|---|
| 977 | :info:build ld warning: in /opt/local/lib/libgio-2.0.dylib, file is not of required architecture |
|---|
| 978 | :info:build ld warning: in /opt/local/lib/libgobject-2.0.dylib, file is not of required architecture |
|---|
| 979 | :info:build ld warning: in /opt/local/lib/libglib-2.0.dylib, file is not of required architecture |
|---|
| 980 | :info:build Undefined symbols for architecture ppc: |
|---|
| 981 | :info:build "_g_mutex_init", referenced from: |
|---|
| 982 | :info:build _usbredir_alloc_lock in usbredirect-usbredirect.o |
|---|
| 983 | :info:build "_g_type_check_instance_cast", referenced from: |
|---|
| 984 | :info:build _main in usbredirect-usbredirect.o |
|---|
| 985 | :info:build _usbredir_write_cb in usbredirect-usbredirect.o |
|---|
| 986 | :info:build _usbredir_write_cb in usbredirect-usbredirect.o |
|---|
| 987 | :info:build _usbredir_read_cb in usbredirect-usbredirect.o |
|---|
| 988 | :info:build _usbredir_read_cb in usbredirect-usbredirect.o |
|---|
| 989 | :info:build "_g_inet_socket_address_new", referenced from: |
|---|
| 990 | :info:build _main in usbredirect-usbredirect.o |
|---|
| 991 | :info:build "_g_socket_connection_get_socket", referenced from: |
|---|
| 992 | :info:build _main in usbredirect-usbredirect.o |
|---|
| 993 | :info:build _connection_incoming_cb in usbredirect-usbredirect.o |
|---|
| 994 | :info:build "_g_object_unref", referenced from: |
|---|
| 995 | :info:build _main in usbredirect-usbredirect.o |
|---|
| 996 | :info:build _main in usbredirect-usbredirect.o |
|---|
| 997 | :info:build _main in usbredirect-usbredirect.o |
|---|
| 998 | :info:build "_g_signal_connect_data", referenced from: |
|---|
| 999 | :info:build _main in usbredirect-usbredirect.o |
|---|
| 1000 | :info:build "_g_atomic_int_get", referenced from: |
|---|
| 1001 | :info:build _thread_handle_libusb_events in usbredirect-usbredirect.o |
|---|
| 1002 | :info:build "_g_pollable_input_stream_get_type", referenced from: |
|---|
| 1003 | :info:build _usbredir_read_cb in usbredirect-usbredirect.o |
|---|
| 1004 | :info:build "_g_option_context_new", referenced from: |
|---|
| 1005 | :info:build _main in usbredirect-usbredirect.o |
|---|
| 1006 | :info:build "_g_socket_listener_get_type", referenced from: |
|---|
| 1007 | :info:build _main in usbredirect-usbredirect.o |
|---|
| 1008 | :info:build "_g_strsplit", referenced from: |
|---|
| 1009 | :info:build _parse_opt_uri in usbredirect-usbredirect.o |
|---|
| 1010 | :info:build _main in usbredirect-usbredirect.o |
|---|
| 1011 | :info:build _main in usbredirect-usbredirect.o |
|---|
| 1012 | :info:build "_g_object_ref", referenced from: |
|---|
| 1013 | :info:build _connection_incoming_cb in usbredirect-usbredirect.o |
|---|
| 1014 | :info:build "_g_malloc0", referenced from: |
|---|
| 1015 | :info:build _main in usbredirect-usbredirect.o |
|---|
| 1016 | :info:build _usbredir_alloc_lock in usbredirect-usbredirect.o |
|---|
| 1017 | :info:build "_g_strrstr", referenced from: |
|---|
| 1018 | :info:build _main in usbredirect-usbredirect.o |
|---|
| 1019 | :info:build "_g_socket_client_connect_to_host", referenced from: |
|---|
| 1020 | :info:build _main in usbredirect-usbredirect.o |
|---|
| 1021 | :info:build "_g_io_stream_get_input_stream", referenced from: |
|---|
| 1022 | :info:build _usbredir_read_cb in usbredirect-usbredirect.o |
|---|
| 1023 | :info:build "_g_thread_try_new", referenced from: |
|---|
| 1024 | :info:build _main in usbredirect-usbredirect.o |
|---|
| 1025 | :info:build "_g_strdup", referenced from: |
|---|
| 1026 | :info:build _parse_opt_uri in usbredirect-usbredirect.o |
|---|
| 1027 | :info:build "_g_io_add_watch", referenced from: |
|---|
| 1028 | :info:build _main in usbredirect-usbredirect.o |
|---|
| 1029 | :info:build _connection_incoming_cb in usbredirect-usbredirect.o |
|---|
| 1030 | :info:build "_g_option_context_get_help", referenced from: |
|---|
| 1031 | :info:build _main in usbredirect-usbredirect.o |
|---|
| 1032 | :info:build _main in usbredirect-usbredirect.o |
|---|
| 1033 | :info:build "_g_strfreev", referenced from: |
|---|
| 1034 | :info:build _parse_opt_uri in usbredirect-usbredirect.o |
|---|
| 1035 | :info:build _parse_opt_uri in usbredirect-usbredirect.o |
|---|
| 1036 | :info:build _main in usbredirect-usbredirect.o |
|---|
| 1037 | :info:build _main in usbredirect-usbredirect.o |
|---|
| 1038 | :info:build "_g_free", referenced from: |
|---|
| 1039 | :info:build _main in usbredirect-usbredirect.o |
|---|
| 1040 | :info:build _main in usbredirect-usbredirect.o |
|---|
| 1041 | :info:build _main in usbredirect-usbredirect.o |
|---|
| 1042 | :info:build _main in usbredirect-usbredirect.o |
|---|
| 1043 | :info:build _main in usbredirect-usbredirect.o |
|---|
| 1044 | :info:build _main in usbredirect-usbredirect.o |
|---|
| 1045 | :info:build _usbredir_free_lock in usbredirect-usbredirect.o |
|---|
| 1046 | :info:build "_g_main_loop_run", referenced from: |
|---|
| 1047 | :info:build _main in usbredirect-usbredirect.o |
|---|
| 1048 | :info:build "_g_clear_error", referenced from: |
|---|
| 1049 | :info:build _main in usbredirect-usbredirect.o |
|---|
| 1050 | :info:build _usbredir_write_cb in usbredirect-usbredirect.o |
|---|
| 1051 | :info:build _usbredir_read_cb in usbredirect-usbredirect.o |
|---|
| 1052 | :info:build "_g_mutex_unlock", referenced from: |
|---|
| 1053 | :info:build _usbredir_unlock_lock in usbredirect-usbredirect.o |
|---|
| 1054 | :info:build "_g_pollable_output_stream_write_nonblocking", referenced from: |
|---|
| 1055 | :info:build _usbredir_write_cb in usbredirect-usbredirect.o |
|---|
| 1056 | :info:build "_g_io_stream_get_type", referenced from: |
|---|
| 1057 | :info:build _usbredir_write_cb in usbredirect-usbredirect.o |
|---|
| 1058 | :info:build _usbredir_read_cb in usbredirect-usbredirect.o |
|---|
| 1059 | :info:build "_g_unix_signal_add", referenced from: |
|---|
| 1060 | :info:build _main in usbredirect-usbredirect.o |
|---|
| 1061 | :info:build _main in usbredirect-usbredirect.o |
|---|
| 1062 | :info:build _main in usbredirect-usbredirect.o |
|---|
| 1063 | :info:build "_g_main_loop_new", referenced from: |
|---|
| 1064 | :info:build _main in usbredirect-usbredirect.o |
|---|
| 1065 | :info:build "_g_option_context_free", referenced from: |
|---|
| 1066 | :info:build _main in usbredirect-usbredirect.o |
|---|
| 1067 | :info:build "_g_log_structured_standard", referenced from: |
|---|
| 1068 | :info:build _main in usbredirect-usbredirect.o |
|---|
| 1069 | :info:build _main in usbredirect-usbredirect.o |
|---|
| 1070 | :info:build _main in usbredirect-usbredirect.o |
|---|
| 1071 | :info:build _main in usbredirect-usbredirect.o |
|---|
| 1072 | :info:build _main in usbredirect-usbredirect.o |
|---|
| 1073 | :info:build _main in usbredirect-usbredirect.o |
|---|
| 1074 | :info:build _connection_handle_io_cb in usbredirect-usbredirect.o |
|---|
| 1075 | :info:build _connection_handle_io_cb in usbredirect-usbredirect.o |
|---|
| 1076 | :info:build _usbredir_write_flush_cb in usbredirect-usbredirect.o |
|---|
| 1077 | :info:build _usbredir_write_cb in usbredirect-usbredirect.o |
|---|
| 1078 | :info:build _usbredir_read_cb in usbredirect-usbredirect.o |
|---|
| 1079 | :info:build _thread_handle_libusb_events in usbredirect-usbredirect.o |
|---|
| 1080 | :info:build _thread_handle_libusb_events in usbredirect-usbredirect.o |
|---|
| 1081 | :info:build "_g_pollable_output_stream_get_type", referenced from: |
|---|
| 1082 | :info:build _usbredir_write_cb in usbredirect-usbredirect.o |
|---|
| 1083 | :info:build "_g_option_context_parse", referenced from: |
|---|
| 1084 | :info:build _main in usbredirect-usbredirect.o |
|---|
| 1085 | :info:build "_g_log_structured", referenced from: |
|---|
| 1086 | :info:build _usbredir_log_cb in usbredirect-usbredirect.o |
|---|
| 1087 | :info:build _debug_libusb_cb in usbredirect-usbredirect.o |
|---|
| 1088 | :info:build "_g_error_matches", referenced from: |
|---|
| 1089 | :info:build _usbredir_write_cb in usbredirect-usbredirect.o |
|---|
| 1090 | :info:build _usbredir_read_cb in usbredirect-usbredirect.o |
|---|
| 1091 | :info:build "_g_option_context_add_main_entries", referenced from: |
|---|
| 1092 | :info:build _main in usbredirect-usbredirect.o |
|---|
| 1093 | :info:build "_g_socket_client_new", referenced from: |
|---|
| 1094 | :info:build _main in usbredirect-usbredirect.o |
|---|
| 1095 | :info:build "_g_atomic_int_set", referenced from: |
|---|
| 1096 | :info:build _main in usbredirect-usbredirect.o |
|---|
| 1097 | :info:build _main in usbredirect-usbredirect.o |
|---|
| 1098 | :info:build "_g_socket_service_new", referenced from: |
|---|
| 1099 | :info:build _main in usbredirect-usbredirect.o |
|---|
| 1100 | :info:build "_g_socket_get_fd", referenced from: |
|---|
| 1101 | :info:build _main in usbredirect-usbredirect.o |
|---|
| 1102 | :info:build _connection_incoming_cb in usbredirect-usbredirect.o |
|---|
| 1103 | :info:build "_g_mutex_clear", referenced from: |
|---|
| 1104 | :info:build _usbredir_free_lock in usbredirect-usbredirect.o |
|---|
| 1105 | :info:build "_g_io_error_quark", referenced from: |
|---|
| 1106 | :info:build _usbredir_write_cb in usbredirect-usbredirect.o |
|---|
| 1107 | :info:build _usbredir_read_cb in usbredirect-usbredirect.o |
|---|
| 1108 | :info:build "_g_socket_listener_add_address", referenced from: |
|---|
| 1109 | :info:build _main in usbredirect-usbredirect.o |
|---|
| 1110 | :info:build "_g_io_channel_unix_new", referenced from: |
|---|
| 1111 | :info:build _main in usbredirect-usbredirect.o |
|---|
| 1112 | :info:build _connection_incoming_cb in usbredirect-usbredirect.o |
|---|
| 1113 | :info:build "_g_ascii_strtoll", referenced from: |
|---|
| 1114 | :info:build _parse_opt_uri in usbredirect-usbredirect.o |
|---|
| 1115 | :info:build _main in usbredirect-usbredirect.o |
|---|
| 1116 | :info:build _main in usbredirect-usbredirect.o |
|---|
| 1117 | :info:build _main in usbredirect-usbredirect.o |
|---|
| 1118 | :info:build _main in usbredirect-usbredirect.o |
|---|
| 1119 | :info:build "_g_socket_set_keepalive", referenced from: |
|---|
| 1120 | :info:build _main in usbredirect-usbredirect.o |
|---|
| 1121 | :info:build _connection_incoming_cb in usbredirect-usbredirect.o |
|---|
| 1122 | :info:build "_g_main_loop_quit", referenced from: |
|---|
| 1123 | :info:build _signal_handler in usbredirect-usbredirect.o |
|---|
| 1124 | :info:build _connection_handle_io_cb in usbredirect-usbredirect.o |
|---|
| 1125 | :info:build _usbredir_write_flush_cb in usbredirect-usbredirect.o |
|---|
| 1126 | :info:build _usbredir_write_cb in usbredirect-usbredirect.o |
|---|
| 1127 | :info:build _usbredir_read_cb in usbredirect-usbredirect.o |
|---|
| 1128 | :info:build "_g_inet_address_new_loopback", referenced from: |
|---|
| 1129 | :info:build _main in usbredirect-usbredirect.o |
|---|
| 1130 | :info:build "_g_error_free", referenced from: |
|---|
| 1131 | :info:build _main in usbredirect-usbredirect.o |
|---|
| 1132 | :info:build "_g_warn_message", referenced from: |
|---|
| 1133 | :info:build _usbredir_log_cb in usbredirect-usbredirect.o |
|---|
| 1134 | :info:build _debug_libusb_cb in usbredirect-usbredirect.o |
|---|
| 1135 | :info:build "_g_mutex_lock", referenced from: |
|---|
| 1136 | :info:build _usbredir_lock_lock in usbredirect-usbredirect.o |
|---|
| 1137 | :info:build "_g_printerr", referenced from: |
|---|
| 1138 | :info:build _parse_opt_uri in usbredirect-usbredirect.o |
|---|
| 1139 | :info:build _main in usbredirect-usbredirect.o |
|---|
| 1140 | :info:build _main in usbredirect-usbredirect.o |
|---|
| 1141 | :info:build _main in usbredirect-usbredirect.o |
|---|
| 1142 | :info:build _main in usbredirect-usbredirect.o |
|---|
| 1143 | :info:build _main in usbredirect-usbredirect.o |
|---|
| 1144 | :info:build _main in usbredirect-usbredirect.o |
|---|
| 1145 | :info:build _main in usbredirect-usbredirect.o |
|---|
| 1146 | :info:build _main in usbredirect-usbredirect.o |
|---|
| 1147 | :info:build "_g_thread_join", referenced from: |
|---|
| 1148 | :info:build _main in usbredirect-usbredirect.o |
|---|
| 1149 | :info:build "_g_io_stream_get_output_stream", referenced from: |
|---|
| 1150 | :info:build _usbredir_write_cb in usbredirect-usbredirect.o |
|---|
| 1151 | :info:build "_g_pollable_input_stream_read_nonblocking", referenced from: |
|---|
| 1152 | :info:build _usbredir_read_cb in usbredirect-usbredirect.o |
|---|
| 1153 | :info:build ld: symbol(s) not found for architecture ppc |
|---|
| 1154 | :info:build collect2: ld returned 1 exit status |
|---|
| 1155 | :info:build fatal error: lipo: can't open input file: /opt/local/var/macports/build/_opt_local_var_macports_sources_rsync.macports.org_macports_release_tarballs_ports_devel_usbredir/usbredir/work/.tmp/ccTzu18y.out (No such file or directory) |
|---|
| 1156 | :info:build make[2]: *** [usbredirect] Error 1 |
|---|
| 1157 | :info:build make[2]: Leaving directory `/opt/local/var/macports/build/_opt_local_var_macports_sources_rsync.macports.org_macports_release_tarballs_ports_devel_usbredir/usbredir/work/usbredir-0.9.0/tools' |
|---|
| 1158 | :info:build make[1]: *** [all-recursive] Error 1 |
|---|
| 1159 | :info:build make[1]: Leaving directory `/opt/local/var/macports/build/_opt_local_var_macports_sources_rsync.macports.org_macports_release_tarballs_ports_devel_usbredir/usbredir/work/usbredir-0.9.0' |
|---|
| 1160 | :info:build make: *** [all] Error 2 |
|---|
| 1161 | :info:build make: Leaving directory `/opt/local/var/macports/build/_opt_local_var_macports_sources_rsync.macports.org_macports_release_tarballs_ports_devel_usbredir/usbredir/work/usbredir-0.9.0' |
|---|
| 1162 | :info:build Command failed: cd "/opt/local/var/macports/build/_opt_local_var_macports_sources_rsync.macports.org_macports_release_tarballs_ports_devel_usbredir/usbredir/work/usbredir-0.9.0" && /usr/bin/make -j4 -w all |
|---|
| 1163 | :info:build Exit code: 2 |
|---|
| 1164 | :error:build Failed to build usbredir: command execution failed |
|---|
| 1165 | :debug:build Error code: CHILDSTATUS 16423 2 |
|---|
| 1166 | :debug:build Backtrace: command execution failed |
|---|
| 1167 | :debug:build while executing |
|---|
| 1168 | :debug:build "system {*}$notty {*}$callback {*}$nice $fullcmdstring" |
|---|
| 1169 | :debug:build invoked from within |
|---|
| 1170 | :debug:build "command_exec -callback portprogress::target_progress_callback build" |
|---|
| 1171 | :debug:build (procedure "portbuild::build_main" line 8) |
|---|
| 1172 | :debug:build invoked from within |
|---|
| 1173 | :debug:build "$procedure $targetname" |
|---|
| 1174 | :error:build See /opt/local/var/macports/logs/_opt_local_var_macports_sources_rsync.macports.org_macports_release_tarballs_ports_devel_usbredir/usbredir/main.log for details. |
|---|