Ticket #65136: main.log

File main.log, 78.6 KB (added by barracuda156, 9 months ago)
Line 
1version:1
2:debug:main Starting logging for xorg-libxcb @1.15_0+python310+universal
3:debug:sysinfo Mac OS X 10.5.8 (darwin/9.8.0) arch powerpc
4:debug:sysinfo MacPorts 2.7.2
5:debug:sysinfo Xcode 3.1.4
6:debug:sysinfo SDK 10.5
7:debug:sysinfo MACOSX_DEPLOYMENT_TARGET: 10.5
8:msg:main --->  Computing dependencies for xorg-libxcb:info:main .:debug:main xorg-libxcb has no conflicts
9:debug:main Searching for dependency: xz
10:debug:main Found Dependency: receipt exists for xz
11:debug:main Searching for dependency: pkgconfig
12:debug:main Found Dependency: receipt exists for pkgconfig
13:debug:main Searching for dependency: python310
14:debug:main Found Dependency: receipt exists for python310
15:debug:main Searching for dependency: xorg-libXau
16:debug:main Found Dependency: receipt exists for xorg-libXau
17:debug:main Searching for dependency: xorg-libXdmcp
18:debug:main Found Dependency: receipt exists for xorg-libXdmcp
19:debug:main Searching for dependency: xorg-xcb-proto
20:debug:main Found Dependency: receipt exists for xorg-xcb-proto
21:debug:main Searching for dependency: xorg-libpthread-stubs
22:debug:main Found Dependency: receipt exists for xorg-libpthread-stubs
23:debug:main Executing org.macports.main (xorg-libxcb)
24:debug:main dropping privileges: euid changed to 502, egid changed to 500.
25:debug:archivefetch archivefetch phase started at Sun May  8 18:04:57 CST 2022
26:debug:archivefetch Executing org.macports.archivefetch (xorg-libxcb)
27:debug:archivefetch Privilege de-escalation not attempted as not running as root.
28:debug:fetch fetch phase started at Sun May  8 18:04:57 CST 2022
29:notice:fetch --->  Fetching distfiles for xorg-libxcb
30:debug:fetch Executing org.macports.fetch (xorg-libxcb)
31:info:fetch --->  libxcb-1.15.tar.xz does not exist in /opt/local/var/macports/distfiles/xorg-libxcb
32:notice:fetch --->  Attempting to fetch libxcb-1.15.tar.xz from https://xcb.freedesktop.org/dist/
33:debug:fetch Privilege de-escalation not attempted as not running as root.
34:debug:checksum checksum phase started at Sun May  8 18:05:03 CST 2022
35:notice:checksum --->  Verifying checksums for xorg-libxcb
36:debug:checksum Executing org.macports.checksum (xorg-libxcb)
37:info:checksum --->  Checksumming libxcb-1.15.tar.xz
38:debug:checksum Calculated (rmd160) is 045aec64dbebbe836db7ba6cff79d11879e747be
39:debug:checksum Correct (rmd160) checksum for libxcb-1.15.tar.xz
40:debug:checksum Calculated (sha256) is cc38744f817cf6814c847e2df37fcb8997357d72fa4bcbc228ae0fe47219a059
41:debug:checksum Correct (sha256) checksum for libxcb-1.15.tar.xz
42:debug:checksum Calculated (size) is 446492
43:debug:checksum Correct (size) checksum for libxcb-1.15.tar.xz
44:debug:checksum Privilege de-escalation not attempted as not running as root.
45:debug:extract extract phase started at Sun May  8 18:05:03 CST 2022
46:notice:extract --->  Extracting xorg-libxcb
47:debug:extract setting option extract.cmd to /opt/local/bin/xz
48:debug:extract Executing org.macports.extract (xorg-libxcb)
49:info:extract --->  Extracting libxcb-1.15.tar.xz
50:debug:extract setting option extract.args to '/opt/local/var/macports/distfiles/xorg-libxcb/libxcb-1.15.tar.xz'
51:debug:extract Environment:
52:debug:extract CC_PRINT_OPTIONS='YES'
53:debug:extract CC_PRINT_OPTIONS_FILE='/opt/local/var/macports/build/_opt_local_var_macports_sources_rsync.macports.org_macports_release_tarballs_ports_x11_xorg-libxcb/xorg-libxcb/work/.CC_PRINT_OPTIONS'
54:debug:extract CPATH='/opt/local/include'
55:debug:extract DEVELOPER_DIR='/Developer'
56:debug:extract LIBRARY_PATH='/opt/local/lib'
57:debug:extract MACOSX_DEPLOYMENT_TARGET='10.5'
58:info:extract Executing:  cd "/opt/local/var/macports/build/_opt_local_var_macports_sources_rsync.macports.org_macports_release_tarballs_ports_x11_xorg-libxcb/xorg-libxcb/work" && /opt/local/bin/xz -dc '/opt/local/var/macports/distfiles/xorg-libxcb/libxcb-1.15.tar.xz' | /usr/bin/gnutar --no-same-owner -xf -
59:debug:extract system:  cd "/opt/local/var/macports/build/_opt_local_var_macports_sources_rsync.macports.org_macports_release_tarballs_ports_x11_xorg-libxcb/xorg-libxcb/work" && /opt/local/bin/xz -dc '/opt/local/var/macports/distfiles/xorg-libxcb/libxcb-1.15.tar.xz' | /usr/bin/gnutar --no-same-owner -xf -
60:debug:extract euid/egid changed to: 0/0
61:debug:extract chowned /opt/local/var/macports/build/_opt_local_var_macports_sources_rsync.macports.org_macports_release_tarballs_ports_x11_xorg-libxcb/xorg-libxcb/work to macports
62:debug:extract euid/egid changed to: 502/500
63:debug:extract Privilege de-escalation not attempted as not running as root.
64:debug:patch patch phase started at Sun May  8 18:05:03 CST 2022
65:debug:patch Executing org.macports.patch (xorg-libxcb)
66:debug:patch Privilege de-escalation not attempted as not running as root.
67:debug:configure configure phase started at Sun May  8 18:05:03 CST 2022
68:notice:configure --->  Configuring xorg-libxcb
69:debug:configure Preferred compilers: gcc-4.2 llvm-gcc-4.2 apple-gcc-4.2 gcc-4.0 macports-gcc-11 macports-gcc-10 macports-gcc-7 macports-gcc-6 macports-gcc-5 macports-clang-7.0 macports-clang-6.0 macports-clang-5.0 macports-clang-3.7 macports-clang-3.4
70:debug:configure Using compiler 'Xcode GCC 4.2'
71:debug:configure Executing org.macports.configure (xorg-libxcb)
72:debug:configure Environment:
73:debug:configure CC='/usr/bin/gcc-4.2'
74:debug:configure CC_PRINT_OPTIONS='YES'
75:debug:configure CC_PRINT_OPTIONS_FILE='/opt/local/var/macports/build/_opt_local_var_macports_sources_rsync.macports.org_macports_release_tarballs_ports_x11_xorg-libxcb/xorg-libxcb/work/.CC_PRINT_OPTIONS'
76:debug:configure CFLAGS='-pipe -Os -arch ppc -arch ppc64'
77:debug:configure CPATH='/opt/local/include'
78:debug:configure CPPFLAGS='-I/opt/local/include'
79:debug:configure CXX='/usr/bin/g++-4.2'
80:debug:configure CXXFLAGS='-pipe -Os -arch ppc -arch ppc64'
81:debug:configure DEVELOPER_DIR='/Developer'
82:debug:configure F90FLAGS='-pipe -Os'
83:debug:configure FCFLAGS='-pipe -Os'
84:debug:configure FFLAGS='-pipe -Os'
85:debug:configure INSTALL='/usr/bin/install -c'
86:debug:configure LDFLAGS='-L/opt/local/lib -Wl,-headerpad_max_install_names -arch ppc -arch ppc64'
87:debug:configure LIBRARY_PATH='/opt/local/lib'
88:debug:configure MACOSX_DEPLOYMENT_TARGET='10.5'
89:debug:configure OBJC='/usr/bin/gcc-4.2'
90:debug:configure OBJCFLAGS='-pipe -Os -arch ppc -arch ppc64'
91:debug:configure OBJCXX='/usr/bin/g++-4.2'
92:debug:configure OBJCXXFLAGS='-pipe -Os -arch ppc -arch ppc64'
93:debug:configure PYTHON='/opt/local/bin/python3.10'
94:info:configure Executing:  cd "/opt/local/var/macports/build/_opt_local_var_macports_sources_rsync.macports.org_macports_release_tarballs_ports_x11_xorg-libxcb/xorg-libxcb/work/libxcb-1.15" && ./configure --prefix=/opt/local --disable-dependency-tracking --disable-devel-docs --disable-silent-rules
95:debug:configure system:  cd "/opt/local/var/macports/build/_opt_local_var_macports_sources_rsync.macports.org_macports_release_tarballs_ports_x11_xorg-libxcb/xorg-libxcb/work/libxcb-1.15" && ./configure --prefix=/opt/local --disable-dependency-tracking --disable-devel-docs --disable-silent-rules
96:info:configure checking for a BSD-compatible install... /usr/bin/install -c
97:info:configure checking whether build environment is sane... yes
98:info:configure checking for a race-free mkdir -p... /opt/local/bin/gmkdir -p
99:info:configure checking for gawk... gawk
100:info:configure checking whether make sets $(MAKE)... yes
101:info:configure checking whether make supports nested variables... yes
102:info:configure checking whether /opt/local/bin/python3.10 version is >= 2.6... yes
103:info:configure checking for /opt/local/bin/python3.10 version... 3.10
104:info:configure checking for /opt/local/bin/python3.10 platform... darwin
105:info:configure checking for GNU default /opt/local/bin/python3.10 prefix... ${prefix}
106:info:configure checking for GNU default /opt/local/bin/python3.10 exec_prefix... ${exec_prefix}
107:info:configure checking for /opt/local/bin/python3.10 script directory (pythondir)... ${PYTHON_PREFIX}/lib/python3.10/site-packages
108:info:configure checking for /opt/local/bin/python3.10 extension module directory (pyexecdir)... ${PYTHON_EXEC_PREFIX}/lib/python3.10/site-packages
109:info:configure checking whether make supports the include directive... yes (GNU style)
110:info:configure checking for gcc... /usr/bin/gcc-4.2
111:info:configure checking whether the C compiler works... yes
112:info:configure checking for C compiler default output file name... a.out
113:info:configure checking for suffix of executables...
114:info:configure checking whether we are cross compiling... no
115:info:configure checking for suffix of object files... o
116:info:configure checking whether the compiler supports GNU C... yes
117:info:configure checking whether /usr/bin/gcc-4.2 accepts -g... yes
118:info:configure checking for /usr/bin/gcc-4.2 option to enable C11 features... unsupported
119:info:configure checking for /usr/bin/gcc-4.2 option to enable C99 features... -std=gnu99
120:info:configure checking whether /usr/bin/gcc-4.2 -std=gnu99 understands -c and -o together... yes
121:info:configure checking dependency style of /usr/bin/gcc-4.2 -std=gnu99... none
122:info:configure checking for stdio.h... yes
123:info:configure checking for stdlib.h... yes
124:info:configure checking for string.h... yes
125:info:configure checking for inttypes.h... yes
126:info:configure checking for stdint.h... yes
127:info:configure checking for strings.h... yes
128:info:configure checking for sys/stat.h... yes
129:info:configure checking for sys/types.h... yes
130:info:configure checking for unistd.h... yes
131:info:configure checking for wchar.h... yes
132:info:configure checking for minix/config.h... no
133:info:configure checking whether it is safe to define __EXTENSIONS__... yes
134:info:configure checking whether _XOPEN_SOURCE should be defined... no
135:info:configure checking build system type... powerpc-apple-darwin9.8.0
136:info:configure checking host system type... powerpc-apple-darwin9.8.0
137:info:configure checking how to print strings... printf
138:info:configure checking for a sed that does not truncate output... /opt/local/bin/gsed
139:info:configure checking for grep that handles long lines and -e... /opt/local/bin/ggrep
140:info:configure checking for egrep... /opt/local/bin/ggrep -E
141:info:configure checking for fgrep... /opt/local/bin/ggrep -F
142:info:configure checking for ld used by /usr/bin/gcc-4.2 -std=gnu99... /usr/libexec/gcc/powerpc-apple-darwin9/4.2.1/ld
143:info:configure checking if the linker (/usr/libexec/gcc/powerpc-apple-darwin9/4.2.1/ld) is GNU ld... no
144:info:configure checking for BSD- or MS-compatible name lister (nm)... /usr/bin/nm -p
145:info:configure checking the name lister (/usr/bin/nm -p) interface... BSD nm
146:info:configure checking whether ln -s works... yes
147:info:configure checking the maximum length of command line arguments... 196608
148:info:configure checking how to convert powerpc-apple-darwin9.8.0 file names to powerpc-apple-darwin9.8.0 format... func_convert_file_noop
149:info:configure checking how to convert powerpc-apple-darwin9.8.0 file names to toolchain format... func_convert_file_noop
150:info:configure checking for /usr/libexec/gcc/powerpc-apple-darwin9/4.2.1/ld option to reload object files... -r
151:info:configure checking for objdump... no
152:info:configure checking how to recognize dependent libraries... pass_all
153:info:configure checking for dlltool... no
154:info:configure checking how to associate runtime and link libraries... printf %s\n
155:info:configure checking for ar... ar
156:info:configure checking for archiver @FILE support... no
157:info:configure checking for strip... strip
158:info:configure checking for ranlib... ranlib
159:info:configure checking command to parse /usr/bin/nm -p output from /usr/bin/gcc-4.2 -std=gnu99 object... ok
160:info:configure checking for sysroot... no
161:info:configure checking for a working dd... /bin/dd
162:info:configure checking how to truncate binary pipes... /bin/dd bs=4096 count=1
163:info:configure checking for mt... no
164:info:configure checking if : is a manifest tool... no
165:info:configure checking for dsymutil... dsymutil
166:info:configure checking for nmedit... nmedit
167:info:configure checking for lipo... lipo
168:info:configure checking for otool... otool
169:info:configure checking for otool64... no
170:info:configure checking for -single_module linker flag... yes
171:info:configure checking for -exported_symbols_list linker flag... yes
172:info:configure checking for -force_load linker flag... ld: unknown option: -force_load
173:info:configure ld: unknown option: -force_load
174:info:configure no
175:info:configure checking for dlfcn.h... yes
176:info:configure checking for objdir... .libs
177:info:configure checking if /usr/bin/gcc-4.2 -std=gnu99 supports -fno-rtti -fno-exceptions... no
178:info:configure checking for /usr/bin/gcc-4.2 -std=gnu99 option to produce PIC... -fno-common -DPIC
179:info:configure checking if /usr/bin/gcc-4.2 -std=gnu99 PIC flag -fno-common -DPIC works... yes
180:info:configure checking if /usr/bin/gcc-4.2 -std=gnu99 static flag -static works... no
181:info:configure checking if /usr/bin/gcc-4.2 -std=gnu99 supports -c -o file.o... yes
182:info:configure checking if /usr/bin/gcc-4.2 -std=gnu99 supports -c -o file.o... (cached) yes
183:info:configure checking whether the /usr/bin/gcc-4.2 -std=gnu99 linker (/usr/libexec/gcc/powerpc-apple-darwin9/4.2.1/ld) supports shared libraries... yes
184:info:configure checking dynamic linker characteristics... darwin9.8.0 dyld
185:info:configure checking how to hardcode library paths into programs... immediate
186:info:configure checking whether stripping libraries is possible... yes
187:info:configure checking if libtool supports shared libraries... yes
188:info:configure checking whether to build shared libraries... yes
189:info:configure checking whether to build static libraries... yes
190:info:configure checking for /usr/bin/gcc-4.2 -std=gnu99 options needed to detect all undeclared functions... none needed
191:info:configure checking whether __clang__ is declared... no
192:info:configure checking whether __INTEL_COMPILER is declared... no
193:info:configure checking whether __SUNPRO_C is declared... no
194:info:configure checking for pkg-config... /opt/local/bin/pkg-config
195:info:configure checking pkg-config is at least version 0.9.0... yes
196:info:configure checking if /usr/bin/gcc-4.2 -std=gnu99 supports -Werror=unknown-warning-option... no
197:info:configure checking if /usr/bin/gcc-4.2 -std=gnu99 supports -Werror=unused-command-line-argument... no
198:info:configure checking if /usr/bin/gcc-4.2 -std=gnu99 supports -Wall... yes
199:info:configure checking if /usr/bin/gcc-4.2 -std=gnu99 supports -Wpointer-arith... yes
200:info:configure checking if /usr/bin/gcc-4.2 -std=gnu99 supports -Wmissing-declarations... yes
201:info:configure checking if /usr/bin/gcc-4.2 -std=gnu99 supports -Wformat=2... yes
202:info:configure checking if /usr/bin/gcc-4.2 -std=gnu99 supports -Wstrict-prototypes... yes
203:info:configure checking if /usr/bin/gcc-4.2 -std=gnu99 supports -Wmissing-prototypes... yes
204:info:configure checking if /usr/bin/gcc-4.2 -std=gnu99 supports -Wnested-externs... yes
205:info:configure checking if /usr/bin/gcc-4.2 -std=gnu99 supports -Wbad-function-cast... yes
206:info:configure checking if /usr/bin/gcc-4.2 -std=gnu99 supports -Wold-style-definition... yes
207:info:configure checking if /usr/bin/gcc-4.2 -std=gnu99 supports -Wdeclaration-after-statement... yes
208:info:configure checking if /usr/bin/gcc-4.2 -std=gnu99 supports -Wunused... yes
209:info:configure checking if /usr/bin/gcc-4.2 -std=gnu99 supports -Wuninitialized... yes
210:info:configure checking if /usr/bin/gcc-4.2 -std=gnu99 supports -Wshadow... yes
211:info:configure checking if /usr/bin/gcc-4.2 -std=gnu99 supports -Wmissing-noreturn... yes
212:info:configure checking if /usr/bin/gcc-4.2 -std=gnu99 supports -Wmissing-format-attribute... yes
213:info:configure checking if /usr/bin/gcc-4.2 -std=gnu99 supports -Wredundant-decls... yes
214:info:configure checking if /usr/bin/gcc-4.2 -std=gnu99 supports -Wlogical-op... no
215:info:configure checking if /usr/bin/gcc-4.2 -std=gnu99 supports -Werror=implicit... yes
216:info:configure checking if /usr/bin/gcc-4.2 -std=gnu99 supports -Werror=nonnull... yes
217:info:configure checking if /usr/bin/gcc-4.2 -std=gnu99 supports -Werror=init-self... yes
218:info:configure checking if /usr/bin/gcc-4.2 -std=gnu99 supports -Werror=main... yes
219:info:configure checking if /usr/bin/gcc-4.2 -std=gnu99 supports -Werror=missing-braces... yes
220:info:configure checking if /usr/bin/gcc-4.2 -std=gnu99 supports -Werror=sequence-point... yes
221:info:configure checking if /usr/bin/gcc-4.2 -std=gnu99 supports -Werror=return-type... yes
222:info:configure checking if /usr/bin/gcc-4.2 -std=gnu99 supports -Werror=trigraphs... yes
223:info:configure checking if /usr/bin/gcc-4.2 -std=gnu99 supports -Werror=array-bounds... no
224:info:configure checking if /usr/bin/gcc-4.2 -std=gnu99 supports -Werror=write-strings... yes
225:info:configure checking if /usr/bin/gcc-4.2 -std=gnu99 supports -Werror=address... yes
226:info:configure checking if /usr/bin/gcc-4.2 -std=gnu99 supports -Werror=int-to-pointer-cast... yes
227:info:configure checking if /usr/bin/gcc-4.2 -std=gnu99 supports -Werror=pointer-to-int-cast... yes
228:info:configure checking if /usr/bin/gcc-4.2 -std=gnu99 supports -pedantic... yes
229:info:configure checking if /usr/bin/gcc-4.2 -std=gnu99 supports -Werror... yes
230:info:configure checking if /usr/bin/gcc-4.2 -std=gnu99 supports -Werror=attributes... yes
231:info:configure checking whether make supports nested variables... (cached) yes
232:info:configure checking whether to build developer documentation... no
233:info:configure checking for doxygen... no
234:info:configure configure: WARNING: doxygen not found - documentation targets will be skipped
235:info:configure configure: WARNING: dot not found - doxygen targets will be skipped
236:info:configure checking for CHECK... no
237:info:configure checking for XCBPROTO... yes
238:info:configure checking for NEEDED... yes
239:info:configure checking for XDMCP... yes
240:info:configure checking for XdmcpWrap in -lXdmcp... yes
241:info:configure checking XCBPROTO_XCBINCLUDEDIR... //opt/local/share/xcb
242:info:configure checking XCBPROTO_XCBPYTHONDIR... //opt/local/Library/Frameworks/Python.framework/Versions/3.9/lib/python3.9/site-packages
243:info:configure checking for egrep... (cached) /opt/local/bin/ggrep -E
244:info:configure checking for library containing getaddrinfo... none required
245:info:configure checking for library containing connect... none required
246:info:configure checking for library containing sendmsg... none required
247:info:configure checking for struct msghdr.msg_control... yes
248:info:configure checking for struct sockaddr_un.sun_len... yes
249:info:configure checking for tsol/label.h... no
250:info:configure checking for is_system_labeled... no
251:info:configure checking whether IOV_MAX is declared... yes
252:info:configure checking whether /usr/bin/gcc-4.2 -std=gnu99 supports symbol visibility... yes
253:info:configure checking for getaddrinfo... yes
254:info:configure checking for launchd... yes
255:info:configure checking that generated files are newer than configure... done
256:info:configure configure: creating ./config.status
257:info:configure config.status: creating Makefile
258:info:configure config.status: creating doc/Makefile
259:info:configure config.status: creating man/Makefile
260:info:configure config.status: creating src/Makefile
261:info:configure config.status: creating tests/Makefile
262:info:configure config.status: creating xcb.pc
263:info:configure config.status: creating xcb-composite.pc
264:info:configure config.status: creating xcb-damage.pc
265:info:configure config.status: creating xcb-dpms.pc
266:info:configure config.status: creating xcb-dri2.pc
267:info:configure config.status: creating xcb-dri3.pc
268:info:configure config.status: creating xcb-ge.pc
269:info:configure config.status: creating xcb-glx.pc
270:info:configure config.status: creating xcb-present.pc
271:info:configure config.status: creating xcb-randr.pc
272:info:configure config.status: creating xcb-record.pc
273:info:configure config.status: creating xcb-render.pc
274:info:configure config.status: creating xcb-res.pc
275:info:configure config.status: creating xcb-screensaver.pc
276:info:configure config.status: creating xcb-shape.pc
277:info:configure config.status: creating xcb-shm.pc
278:info:configure config.status: creating xcb-sync.pc
279:info:configure config.status: creating xcb-xevie.pc
280:info:configure config.status: creating xcb-xf86dri.pc
281:info:configure config.status: creating xcb-xfixes.pc
282:info:configure config.status: creating xcb-xinerama.pc
283:info:configure config.status: creating xcb-xinput.pc
284:info:configure config.status: creating xcb-xkb.pc
285:info:configure config.status: creating xcb-xprint.pc
286:info:configure config.status: creating xcb-xselinux.pc
287:info:configure config.status: creating xcb-xtest.pc
288:info:configure config.status: creating xcb-xv.pc
289:info:configure config.status: creating xcb-xvmc.pc
290:info:configure config.status: creating doc/xcb.doxygen
291:info:configure config.status: creating src/config.h
292:info:configure config.status: executing depfiles commands
293:info:configure config.status: executing libtool commands
294:info:configure   Package: libxcb 1.15
295:info:configure   Configuration
296:info:configure     XDM support.........: yes
297:info:configure     sendmsg fd passing..: yes
298:info:configure     Build unit tests....: no
299:info:configure       with html results.: no
300:info:configure     XCB buffer size.....: 16384
301:info:configure   X11 extensions
302:info:configure     Composite...........: yes
303:info:configure     Damage..............: yes
304:info:configure     Dpms................: yes
305:info:configure     Dri2................: yes
306:info:configure     Dri3................: yes
307:info:configure     GenericEvent........: no
308:info:configure     Glx.................: yes
309:info:configure     Randr...............: yes
310:info:configure     Record..............: yes
311:info:configure     Render..............: yes
312:info:configure     Resource............: yes
313:info:configure     Screensaver.........: yes
314:info:configure     selinux.............: no
315:info:configure     Shape...............: yes
316:info:configure     Shm.................: yes
317:info:configure     Sync................: yes
318:info:configure     Xevie...............: no
319:info:configure     Xfixes..............: yes
320:info:configure     Xfree86-dri.........: yes
321:info:configure     xinerama............: yes
322:info:configure     xinput..............: yes
323:info:configure     xkb.................: yes
324:info:configure     xprint..............: no
325:info:configure     xtest...............: yes
326:info:configure     xv..................: yes
327:info:configure     xvmc................: yes
328:info:configure   Used CFLAGS:
329:info:configure     CPPFLAGS............: -I/opt/local/include
330:info:configure     CFLAGS..............: -pipe -Os -arch ppc -arch ppc64
331:info:configure   Installation:
332:info:configure     Prefix..............: /opt/local
333:debug:configure Executing portconfigure::configure_finish
334:debug:configure Privilege de-escalation not attempted as not running as root.
335:debug:build build phase started at Sun May  8 18:05:25 CST 2022
336:notice:build --->  Building xorg-libxcb
337:debug:build Executing org.macports.build (xorg-libxcb)
338:debug:build Environment:
339:debug:build CC_PRINT_OPTIONS='YES'
340:debug:build CC_PRINT_OPTIONS_FILE='/opt/local/var/macports/build/_opt_local_var_macports_sources_rsync.macports.org_macports_release_tarballs_ports_x11_xorg-libxcb/xorg-libxcb/work/.CC_PRINT_OPTIONS'
341:debug:build CPATH='/opt/local/include'
342:debug:build DEVELOPER_DIR='/Developer'
343:debug:build LIBRARY_PATH='/opt/local/lib'
344:debug:build MACOSX_DEPLOYMENT_TARGET='10.5'
345:info:build Executing:  cd "/opt/local/var/macports/build/_opt_local_var_macports_sources_rsync.macports.org_macports_release_tarballs_ports_x11_xorg-libxcb/xorg-libxcb/work/libxcb-1.15" && /usr/bin/make -j4 -w all
346:debug:build system:  cd "/opt/local/var/macports/build/_opt_local_var_macports_sources_rsync.macports.org_macports_release_tarballs_ports_x11_xorg-libxcb/xorg-libxcb/work/libxcb-1.15" && /usr/bin/make -j4 -w all
347:info:build make: Entering directory `/opt/local/var/macports/build/_opt_local_var_macports_sources_rsync.macports.org_macports_release_tarballs_ports_x11_xorg-libxcb/xorg-libxcb/work/libxcb-1.15'
348:info:build Making all in src
349:info:build make[1]: Entering directory `/opt/local/var/macports/build/_opt_local_var_macports_sources_rsync.macports.org_macports_release_tarballs_ports_x11_xorg-libxcb/xorg-libxcb/work/libxcb-1.15/src'
350:info:build /opt/local/bin/python3.10 ./c_client.py     -c "libxcb 1.15" -l "X Version 11" \
351:info:build             -s "3" -p //opt/local/Library/Frameworks/Python.framework/Versions/3.9/lib/python3.9/site-packages \
352:info:build              \
353:info:build             //opt/local/share/xcb/xproto.xml
354:info:build /opt/local/bin/python3.10 ./c_client.py     -c "libxcb 1.15" -l "X Version 11" \
355:info:build             -s "3" -p //opt/local/Library/Frameworks/Python.framework/Versions/3.9/lib/python3.9/site-packages \
356:info:build              \
357:info:build             //opt/local/share/xcb/bigreq.xml
358:info:build /opt/local/bin/python3.10 ./c_client.py     -c "libxcb 1.15" -l "X Version 11" \
359:info:build             -s "3" -p //opt/local/Library/Frameworks/Python.framework/Versions/3.9/lib/python3.9/site-packages \
360:info:build              \
361:info:build             //opt/local/share/xcb/xc_misc.xml
362:info:build /opt/local/bin/python3.10 ./c_client.py     -c "libxcb 1.15" -l "X Version 11" \
363:info:build             -s "3" -p //opt/local/Library/Frameworks/Python.framework/Versions/3.9/lib/python3.9/site-packages \
364:info:build              \
365:info:build             //opt/local/share/xcb/composite.xml
366:info:build Traceback (most recent call last):
367:info:build   File "/opt/local/var/macports/build/_opt_local_var_macports_sources_rsync.macports.org_macports_release_tarballs_ports_x11_xorg-libxcb/xorg-libxcb/work/libxcb-1.15/src/./c_client.py", line 3394, in <module>
368:info:build     module.generate()
369:info:build   File "//opt/local/Library/Frameworks/Python.framework/Versions/3.9/lib/python3.9/site-packages/xcbgen/state.py", line 131, in generate
370:info:build     item.out(name)
371:info:build   File "/opt/local/var/macports/build/_opt_local_var_macports_sources_rsync.macports.org_macports_release_tarballs_ports_x11_xorg-libxcb/xorg-libxcb/work/libxcb-1.15/src/./c_client.py", line 3181, in c_request
372:info:build     _c_type_setup(self.reply, name, ('reply',))
373:info:build   File "/opt/local/var/macports/build/_opt_local_var_macports_sources_rsync.macports.org_macports_release_tarballs_ports_x11_xorg-libxcb/xorg-libxcb/work/libxcb-1.15/src/./c_client.py", line 536, in _c_type_setup
374:info:build     _c_serialize('sizeof', self)
375:info:build   File "/opt/local/var/macports/build/_opt_local_var_macports_sources_rsync.macports.org_macports_release_tarballs_ports_x11_xorg-libxcb/xorg-libxcb/work/libxcb-1.15/src/./c_client.py", line 1420, in _c_serialize
376:info:build     if self.length_expr is not None:
377:info:build AttributeError: 'Reply' object has no attribute 'length_expr'
378:info:build /opt/local/bin/python3.10 ./c_client.py     -c "libxcb 1.15" -l "X Version 11" \
379:info:build             -s "3" -p //opt/local/Library/Frameworks/Python.framework/Versions/3.9/lib/python3.9/site-packages \
380:info:build              \
381:info:build             //opt/local/share/xcb/damage.xml
382:info:build make[1]: *** [xc_misc.c] Error 1
383:info:build make[1]: *** Waiting for unfinished jobs....
384:info:build Traceback (most recent call last):
385:info:build   File "/opt/local/var/macports/build/_opt_local_var_macports_sources_rsync.macports.org_macports_release_tarballs_ports_x11_xorg-libxcb/xorg-libxcb/work/libxcb-1.15/src/./c_client.py", line 3394, in <module>
386:info:build     module.generate()
387:info:build   File "//opt/local/Library/Frameworks/Python.framework/Versions/3.9/lib/python3.9/site-packages/xcbgen/state.py", line 131, in generate
388:info:build     item.out(name)
389:info:build   File "/opt/local/var/macports/build/_opt_local_var_macports_sources_rsync.macports.org_macports_release_tarballs_ports_x11_xorg-libxcb/xorg-libxcb/work/libxcb-1.15/src/./c_client.py", line 2161, in c_struct
390:info:build     _c_type_setup(self, name, ())
391:info:build   File "/opt/local/var/macports/build/_opt_local_var_macports_sources_rsync.macports.org_macports_release_tarballs_ports_x11_xorg-libxcb/xorg-libxcb/work/libxcb-1.15/src/./c_client.py", line 536, in _c_type_setup
392:info:build     _c_serialize('sizeof', self)
393:info:build   File "/opt/local/var/macports/build/_opt_local_var_macports_sources_rsync.macports.org_macports_release_tarballs_ports_x11_xorg-libxcb/xorg-libxcb/work/libxcb-1.15/src/./c_client.py", line 1420, in _c_serialize
394:info:build     if self.length_expr is not None:
395:info:build AttributeError: 'Struct' object has no attribute 'length_expr'
396:info:build make[1]: *** [xproto.c] Error 1
397:info:build make[1]: Leaving directory `/opt/local/var/macports/build/_opt_local_var_macports_sources_rsync.macports.org_macports_release_tarballs_ports_x11_xorg-libxcb/xorg-libxcb/work/libxcb-1.15/src'
398:info:build make: *** [all-recursive] Error 1
399:info:build make: Leaving directory `/opt/local/var/macports/build/_opt_local_var_macports_sources_rsync.macports.org_macports_release_tarballs_ports_x11_xorg-libxcb/xorg-libxcb/work/libxcb-1.15'
400:info:build Command failed:  cd "/opt/local/var/macports/build/_opt_local_var_macports_sources_rsync.macports.org_macports_release_tarballs_ports_x11_xorg-libxcb/xorg-libxcb/work/libxcb-1.15" && /usr/bin/make -j4 -w all
401:info:build Exit code: 2
402:error:build Failed to build xorg-libxcb: command execution failed
403:debug:build Error code: CHILDSTATUS 21650 2
404:debug:build Backtrace: command execution failed
405:debug:build     while executing
406:debug:build "system {*}$notty {*}$callback {*}$nice $fullcmdstring"
407:debug:build     invoked from within
408:debug:build "command_exec -callback portprogress::target_progress_callback build"
409:debug:build     (procedure "portbuild::build_main" line 8)
410:debug:build     invoked from within
411:debug:build "$procedure $targetname"
412:error:build See /opt/local/var/macports/logs/_opt_local_var_macports_sources_rsync.macports.org_macports_release_tarballs_ports_x11_xorg-libxcb/xorg-libxcb/main.log for details.
413version:1
414:debug:main Starting logging for xorg-libxcb @1.15_0+python310+universal
415:debug:sysinfo Mac OS X 10.5.8 (darwin/9.8.0) arch powerpc
416:debug:sysinfo MacPorts 2.7.2
417:debug:sysinfo Xcode 3.1.4
418:debug:sysinfo SDK 10.5
419:debug:sysinfo MACOSX_DEPLOYMENT_TARGET: 10.5
420:msg:main --->  Computing dependencies for xorg-libxcb:info:main .:debug:main xorg-libxcb has no conflicts
421:debug:main Searching for dependency: xz
422:debug:main Found Dependency: receipt exists for xz
423:debug:main Searching for dependency: pkgconfig
424:debug:main Found Dependency: receipt exists for pkgconfig
425:debug:main Searching for dependency: python310
426:debug:main Found Dependency: receipt exists for python310
427:debug:main Searching for dependency: xorg-libXau
428:debug:main Found Dependency: receipt exists for xorg-libXau
429:debug:main Searching for dependency: xorg-libXdmcp
430:debug:main Found Dependency: receipt exists for xorg-libXdmcp
431:debug:main Searching for dependency: xorg-xcb-proto
432:debug:main Found Dependency: receipt exists for xorg-xcb-proto
433:debug:main Searching for dependency: xorg-libpthread-stubs
434:debug:main Found Dependency: receipt exists for xorg-libpthread-stubs
435:debug:main Executing org.macports.main (xorg-libxcb)
436:debug:main dropping privileges: euid changed to 502, egid changed to 500.
437:debug:archivefetch archivefetch phase started at Sun May  8 18:06:38 CST 2022
438:debug:archivefetch Executing org.macports.archivefetch (xorg-libxcb)
439:debug:archivefetch Privilege de-escalation not attempted as not running as root.
440:debug:fetch fetch phase started at Sun May  8 18:06:38 CST 2022
441:notice:fetch --->  Fetching distfiles for xorg-libxcb
442:debug:fetch Executing org.macports.fetch (xorg-libxcb)
443:debug:fetch Privilege de-escalation not attempted as not running as root.
444:debug:checksum checksum phase started at Sun May  8 18:06:38 CST 2022
445:notice:checksum --->  Verifying checksums for xorg-libxcb
446:debug:checksum Executing org.macports.checksum (xorg-libxcb)
447:info:checksum --->  Checksumming libxcb-1.15.tar.xz
448:debug:checksum Calculated (rmd160) is 045aec64dbebbe836db7ba6cff79d11879e747be
449:debug:checksum Correct (rmd160) checksum for libxcb-1.15.tar.xz
450:debug:checksum Calculated (sha256) is cc38744f817cf6814c847e2df37fcb8997357d72fa4bcbc228ae0fe47219a059
451:debug:checksum Correct (sha256) checksum for libxcb-1.15.tar.xz
452:debug:checksum Calculated (size) is 446492
453:debug:checksum Correct (size) checksum for libxcb-1.15.tar.xz
454:debug:checksum Privilege de-escalation not attempted as not running as root.
455:debug:extract extract phase started at Sun May  8 18:06:38 CST 2022
456:notice:extract --->  Extracting xorg-libxcb
457:debug:extract setting option extract.cmd to /opt/local/bin/xz
458:debug:extract Executing org.macports.extract (xorg-libxcb)
459:info:extract --->  Extracting libxcb-1.15.tar.xz
460:debug:extract setting option extract.args to '/opt/local/var/macports/distfiles/xorg-libxcb/libxcb-1.15.tar.xz'
461:debug:extract Environment:
462:debug:extract CC_PRINT_OPTIONS='YES'
463:debug:extract CC_PRINT_OPTIONS_FILE='/opt/local/var/macports/build/_opt_local_var_macports_sources_rsync.macports.org_macports_release_tarballs_ports_x11_xorg-libxcb/xorg-libxcb/work/.CC_PRINT_OPTIONS'
464:debug:extract CPATH='/opt/local/include'
465:debug:extract DEVELOPER_DIR='/Developer'
466:debug:extract LIBRARY_PATH='/opt/local/lib'
467:debug:extract MACOSX_DEPLOYMENT_TARGET='10.5'
468:info:extract Executing:  cd "/opt/local/var/macports/build/_opt_local_var_macports_sources_rsync.macports.org_macports_release_tarballs_ports_x11_xorg-libxcb/xorg-libxcb/work" && /opt/local/bin/xz -dc '/opt/local/var/macports/distfiles/xorg-libxcb/libxcb-1.15.tar.xz' | /usr/bin/gnutar --no-same-owner -xf -
469:debug:extract system:  cd "/opt/local/var/macports/build/_opt_local_var_macports_sources_rsync.macports.org_macports_release_tarballs_ports_x11_xorg-libxcb/xorg-libxcb/work" && /opt/local/bin/xz -dc '/opt/local/var/macports/distfiles/xorg-libxcb/libxcb-1.15.tar.xz' | /usr/bin/gnutar --no-same-owner -xf -
470:debug:extract euid/egid changed to: 0/0
471:debug:extract chowned /opt/local/var/macports/build/_opt_local_var_macports_sources_rsync.macports.org_macports_release_tarballs_ports_x11_xorg-libxcb/xorg-libxcb/work to macports
472:debug:extract euid/egid changed to: 502/500
473:debug:extract Privilege de-escalation not attempted as not running as root.
474:debug:patch patch phase started at Sun May  8 18:06:39 CST 2022
475:debug:patch Executing org.macports.patch (xorg-libxcb)
476:debug:patch Privilege de-escalation not attempted as not running as root.
477:debug:configure configure phase started at Sun May  8 18:06:39 CST 2022
478:notice:configure --->  Configuring xorg-libxcb
479:debug:configure Preferred compilers: gcc-4.2 llvm-gcc-4.2 apple-gcc-4.2 gcc-4.0 macports-gcc-11 macports-gcc-10 macports-gcc-7 macports-gcc-6 macports-gcc-5 macports-clang-7.0 macports-clang-6.0 macports-clang-5.0 macports-clang-3.7 macports-clang-3.4
480:debug:configure Using compiler 'Xcode GCC 4.2'
481:debug:configure Executing org.macports.configure (xorg-libxcb)
482:info:configure --->  Configuring xorg-libxcb for architecture ppc
483:debug:configure setting option configure.dir to /opt/local/var/macports/build/_opt_local_var_macports_sources_rsync.macports.org_macports_release_tarballs_ports_x11_xorg-libxcb/xorg-libxcb/work/libxcb-1.15-ppc
484:debug:configure setting option autoreconf.dir to /opt/local/var/macports/build/_opt_local_var_macports_sources_rsync.macports.org_macports_release_tarballs_ports_x11_xorg-libxcb/xorg-libxcb/work/libxcb-1.15-ppc
485:debug:configure setting option autoconf.dir to /opt/local/var/macports/build/_opt_local_var_macports_sources_rsync.macports.org_macports_release_tarballs_ports_x11_xorg-libxcb/xorg-libxcb/work/libxcb-1.15-ppc
486:debug:configure Environment:
487:debug:configure CC='/usr/bin/gcc-4.2'
488:debug:configure CC_PRINT_OPTIONS='YES'
489:debug:configure CC_PRINT_OPTIONS_FILE='/opt/local/var/macports/build/_opt_local_var_macports_sources_rsync.macports.org_macports_release_tarballs_ports_x11_xorg-libxcb/xorg-libxcb/work/.CC_PRINT_OPTIONS'
490:debug:configure CFLAGS='-pipe -Os -arch ppc'
491:debug:configure CPATH='/opt/local/include'
492:debug:configure CPPFLAGS='-I/opt/local/include'
493:debug:configure CXX='/usr/bin/g++-4.2'
494:debug:configure CXXFLAGS='-pipe -Os -arch ppc'
495:debug:configure DEVELOPER_DIR='/Developer'
496:debug:configure F90FLAGS='-pipe -Os -m32'
497:debug:configure FCFLAGS='-pipe -Os -m32'
498:debug:configure FFLAGS='-pipe -Os -m32'
499:debug:configure INSTALL='/usr/bin/install -c'
500:debug:configure LDFLAGS='-L/opt/local/lib -Wl,-headerpad_max_install_names -arch ppc'
501:debug:configure LIBRARY_PATH='/opt/local/lib'
502:debug:configure MACOSX_DEPLOYMENT_TARGET='10.5'
503:debug:configure OBJC='/usr/bin/gcc-4.2'
504:debug:configure OBJCFLAGS='-pipe -Os -arch ppc'
505:debug:configure OBJCXX='/usr/bin/g++-4.2'
506:debug:configure OBJCXXFLAGS='-pipe -Os'
507:debug:configure PYTHON='/opt/local/bin/python3.10'
508:info:configure Executing:  cd "/opt/local/var/macports/build/_opt_local_var_macports_sources_rsync.macports.org_macports_release_tarballs_ports_x11_xorg-libxcb/xorg-libxcb/work/libxcb-1.15-ppc" && ./configure --prefix=/opt/local --disable-devel-docs --disable-silent-rules
509:debug:configure system:  cd "/opt/local/var/macports/build/_opt_local_var_macports_sources_rsync.macports.org_macports_release_tarballs_ports_x11_xorg-libxcb/xorg-libxcb/work/libxcb-1.15-ppc" && ./configure --prefix=/opt/local --disable-devel-docs --disable-silent-rules
510:info:configure checking for a BSD-compatible install... /usr/bin/install -c
511:info:configure checking whether build environment is sane... yes
512:info:configure checking for a race-free mkdir -p... /opt/local/bin/gmkdir -p
513:info:configure checking for gawk... gawk
514:info:configure checking whether make sets $(MAKE)... yes
515:info:configure checking whether make supports nested variables... yes
516:info:configure checking whether /opt/local/bin/python3.10 version is >= 2.6... yes
517:info:configure checking for /opt/local/bin/python3.10 version... 3.10
518:info:configure checking for /opt/local/bin/python3.10 platform... darwin
519:info:configure checking for GNU default /opt/local/bin/python3.10 prefix... ${prefix}
520:info:configure checking for GNU default /opt/local/bin/python3.10 exec_prefix... ${exec_prefix}
521:info:configure checking for /opt/local/bin/python3.10 script directory (pythondir)... ${PYTHON_PREFIX}/lib/python3.10/site-packages
522:info:configure checking for /opt/local/bin/python3.10 extension module directory (pyexecdir)... ${PYTHON_EXEC_PREFIX}/lib/python3.10/site-packages
523:info:configure checking whether make supports the include directive... yes (GNU style)
524:info:configure checking for gcc... /usr/bin/gcc-4.2
525:info:configure checking whether the C compiler works... yes
526:info:configure checking for C compiler default output file name... a.out
527:info:configure checking for suffix of executables...
528:info:configure checking whether we are cross compiling... no
529:info:configure checking for suffix of object files... o
530:info:configure checking whether the compiler supports GNU C... yes
531:info:configure checking whether /usr/bin/gcc-4.2 accepts -g... yes
532:info:configure checking for /usr/bin/gcc-4.2 option to enable C11 features... unsupported
533:info:configure checking for /usr/bin/gcc-4.2 option to enable C99 features... -std=gnu99
534:info:configure checking whether /usr/bin/gcc-4.2 -std=gnu99 understands -c and -o together... yes
535:info:configure checking dependency style of /usr/bin/gcc-4.2 -std=gnu99... gcc3
536:info:configure checking for stdio.h... yes
537:info:configure checking for stdlib.h... yes
538:info:configure checking for string.h... yes
539:info:configure checking for inttypes.h... yes
540:info:configure checking for stdint.h... yes
541:info:configure checking for strings.h... yes
542:info:configure checking for sys/stat.h... yes
543:info:configure checking for sys/types.h... yes
544:info:configure checking for unistd.h... yes
545:info:configure checking for wchar.h... yes
546:info:configure checking for minix/config.h... no
547:info:configure checking whether it is safe to define __EXTENSIONS__... yes
548:info:configure checking whether _XOPEN_SOURCE should be defined... no
549:info:configure checking build system type... powerpc-apple-darwin9.8.0
550:info:configure checking host system type... powerpc-apple-darwin9.8.0
551:info:configure checking how to print strings... printf
552:info:configure checking for a sed that does not truncate output... /opt/local/bin/gsed
553:info:configure checking for grep that handles long lines and -e... /opt/local/bin/ggrep
554:info:configure checking for egrep... /opt/local/bin/ggrep -E
555:info:configure checking for fgrep... /opt/local/bin/ggrep -F
556:info:configure checking for ld used by /usr/bin/gcc-4.2 -std=gnu99... /usr/libexec/gcc/powerpc-apple-darwin9/4.2.1/ld
557:info:configure checking if the linker (/usr/libexec/gcc/powerpc-apple-darwin9/4.2.1/ld) is GNU ld... no
558:info:configure checking for BSD- or MS-compatible name lister (nm)... /usr/bin/nm -p
559:info:configure checking the name lister (/usr/bin/nm -p) interface... BSD nm
560:info:configure checking whether ln -s works... yes
561:info:configure checking the maximum length of command line arguments... 196608
562:info:configure checking how to convert powerpc-apple-darwin9.8.0 file names to powerpc-apple-darwin9.8.0 format... func_convert_file_noop
563:info:configure checking how to convert powerpc-apple-darwin9.8.0 file names to toolchain format... func_convert_file_noop
564:info:configure checking for /usr/libexec/gcc/powerpc-apple-darwin9/4.2.1/ld option to reload object files... -r
565:info:configure checking for objdump... no
566:info:configure checking how to recognize dependent libraries... pass_all
567:info:configure checking for dlltool... no
568:info:configure checking how to associate runtime and link libraries... printf %s\n
569:info:configure checking for ar... ar
570:info:configure checking for archiver @FILE support... no
571:info:configure checking for strip... strip
572:info:configure checking for ranlib... ranlib
573:info:configure checking command to parse /usr/bin/nm -p output from /usr/bin/gcc-4.2 -std=gnu99 object... ok
574:info:configure checking for sysroot... no
575:info:configure checking for a working dd... /bin/dd
576:info:configure checking how to truncate binary pipes... /bin/dd bs=4096 count=1
577:info:configure checking for mt... no
578:info:configure checking if : is a manifest tool... no
579:info:configure checking for dsymutil... dsymutil
580:info:configure checking for nmedit... nmedit
581:info:configure checking for lipo... lipo
582:info:configure checking for otool... otool
583:info:configure checking for otool64... no
584:info:configure checking for -single_module linker flag... yes
585:info:configure checking for -exported_symbols_list linker flag... yes
586:info:configure checking for -force_load linker flag... ld: unknown option: -force_load
587:info:configure no
588:info:configure checking for dlfcn.h... yes
589:info:configure checking for objdir... .libs
590:info:configure checking if /usr/bin/gcc-4.2 -std=gnu99 supports -fno-rtti -fno-exceptions... no
591:info:configure checking for /usr/bin/gcc-4.2 -std=gnu99 option to produce PIC... -fno-common -DPIC
592:info:configure checking if /usr/bin/gcc-4.2 -std=gnu99 PIC flag -fno-common -DPIC works... yes
593:info:configure checking if /usr/bin/gcc-4.2 -std=gnu99 static flag -static works... no
594:info:configure checking if /usr/bin/gcc-4.2 -std=gnu99 supports -c -o file.o... yes
595:info:configure checking if /usr/bin/gcc-4.2 -std=gnu99 supports -c -o file.o... (cached) yes
596:info:configure checking whether the /usr/bin/gcc-4.2 -std=gnu99 linker (/usr/libexec/gcc/powerpc-apple-darwin9/4.2.1/ld) supports shared libraries... yes
597:info:configure checking dynamic linker characteristics... darwin9.8.0 dyld
598:info:configure checking how to hardcode library paths into programs... immediate
599:info:configure checking whether stripping libraries is possible... yes
600:info:configure checking if libtool supports shared libraries... yes
601:info:configure checking whether to build shared libraries... yes
602:info:configure checking whether to build static libraries... yes
603:info:configure checking for /usr/bin/gcc-4.2 -std=gnu99 options needed to detect all undeclared functions... none needed
604:info:configure checking whether __clang__ is declared... no
605:info:configure checking whether __INTEL_COMPILER is declared... no
606:info:configure checking whether __SUNPRO_C is declared... no
607:info:configure checking for pkg-config... /opt/local/bin/pkg-config
608:info:configure checking pkg-config is at least version 0.9.0... yes
609:info:configure checking if /usr/bin/gcc-4.2 -std=gnu99 supports -Werror=unknown-warning-option... no
610:info:configure checking if /usr/bin/gcc-4.2 -std=gnu99 supports -Werror=unused-command-line-argument... no
611:info:configure checking if /usr/bin/gcc-4.2 -std=gnu99 supports -Wall... yes
612:info:configure checking if /usr/bin/gcc-4.2 -std=gnu99 supports -Wpointer-arith... yes
613:info:configure checking if /usr/bin/gcc-4.2 -std=gnu99 supports -Wmissing-declarations... yes
614:info:configure checking if /usr/bin/gcc-4.2 -std=gnu99 supports -Wformat=2... yes
615:info:configure checking if /usr/bin/gcc-4.2 -std=gnu99 supports -Wstrict-prototypes... yes
616:info:configure checking if /usr/bin/gcc-4.2 -std=gnu99 supports -Wmissing-prototypes... yes
617:info:configure checking if /usr/bin/gcc-4.2 -std=gnu99 supports -Wnested-externs... yes
618:info:configure checking if /usr/bin/gcc-4.2 -std=gnu99 supports -Wbad-function-cast... yes
619:info:configure checking if /usr/bin/gcc-4.2 -std=gnu99 supports -Wold-style-definition... yes
620:info:configure checking if /usr/bin/gcc-4.2 -std=gnu99 supports -Wdeclaration-after-statement... yes
621:info:configure checking if /usr/bin/gcc-4.2 -std=gnu99 supports -Wunused... yes
622:info:configure checking if /usr/bin/gcc-4.2 -std=gnu99 supports -Wuninitialized... yes
623:info:configure checking if /usr/bin/gcc-4.2 -std=gnu99 supports -Wshadow... yes
624:info:configure checking if /usr/bin/gcc-4.2 -std=gnu99 supports -Wmissing-noreturn... yes
625:info:configure checking if /usr/bin/gcc-4.2 -std=gnu99 supports -Wmissing-format-attribute... yes
626:info:configure checking if /usr/bin/gcc-4.2 -std=gnu99 supports -Wredundant-decls... yes
627:info:configure checking if /usr/bin/gcc-4.2 -std=gnu99 supports -Wlogical-op... no
628:info:configure checking if /usr/bin/gcc-4.2 -std=gnu99 supports -Werror=implicit... yes
629:info:configure checking if /usr/bin/gcc-4.2 -std=gnu99 supports -Werror=nonnull... yes
630:info:configure checking if /usr/bin/gcc-4.2 -std=gnu99 supports -Werror=init-self... yes
631:info:configure checking if /usr/bin/gcc-4.2 -std=gnu99 supports -Werror=main... yes
632:info:configure checking if /usr/bin/gcc-4.2 -std=gnu99 supports -Werror=missing-braces... yes
633:info:configure checking if /usr/bin/gcc-4.2 -std=gnu99 supports -Werror=sequence-point... yes
634:info:configure checking if /usr/bin/gcc-4.2 -std=gnu99 supports -Werror=return-type... yes
635:info:configure checking if /usr/bin/gcc-4.2 -std=gnu99 supports -Werror=trigraphs... yes
636:info:configure checking if /usr/bin/gcc-4.2 -std=gnu99 supports -Werror=array-bounds... no
637:info:configure checking if /usr/bin/gcc-4.2 -std=gnu99 supports -Werror=write-strings... yes
638:info:configure checking if /usr/bin/gcc-4.2 -std=gnu99 supports -Werror=address... yes
639:info:configure checking if /usr/bin/gcc-4.2 -std=gnu99 supports -Werror=int-to-pointer-cast... yes
640:info:configure checking if /usr/bin/gcc-4.2 -std=gnu99 supports -Werror=pointer-to-int-cast... yes
641:info:configure checking if /usr/bin/gcc-4.2 -std=gnu99 supports -pedantic... yes
642:info:configure checking if /usr/bin/gcc-4.2 -std=gnu99 supports -Werror... yes
643:info:configure checking if /usr/bin/gcc-4.2 -std=gnu99 supports -Werror=attributes... yes
644:info:configure checking whether make supports nested variables... (cached) yes
645:info:configure checking whether to build developer documentation... no
646:info:configure checking for doxygen... no
647:info:configure configure: WARNING: doxygen not found - documentation targets will be skipped
648:info:configure configure: WARNING: dot not found - doxygen targets will be skipped
649:info:configure checking for CHECK... no
650:info:configure checking for XCBPROTO... yes
651:info:configure checking for NEEDED... yes
652:info:configure checking for XDMCP... yes
653:info:configure checking for XdmcpWrap in -lXdmcp... yes
654:info:configure checking XCBPROTO_XCBINCLUDEDIR... //opt/local/share/xcb
655:info:configure checking XCBPROTO_XCBPYTHONDIR... //opt/local/Library/Frameworks/Python.framework/Versions/3.9/lib/python3.9/site-packages
656:info:configure checking for egrep... (cached) /opt/local/bin/ggrep -E
657:info:configure checking for library containing getaddrinfo... none required
658:info:configure checking for library containing connect... none required
659:info:configure checking for library containing sendmsg... none required
660:info:configure checking for struct msghdr.msg_control... yes
661:info:configure checking for struct sockaddr_un.sun_len... yes
662:info:configure checking for tsol/label.h... no
663:info:configure checking for is_system_labeled... no
664:info:configure checking whether IOV_MAX is declared... yes
665:info:configure checking whether /usr/bin/gcc-4.2 -std=gnu99 supports symbol visibility... yes
666:info:configure checking for getaddrinfo... yes
667:info:configure checking for launchd... yes
668:info:configure checking that generated files are newer than configure... done
669:info:configure configure: creating ./config.status
670:info:configure config.status: creating Makefile
671:info:configure config.status: creating doc/Makefile
672:info:configure config.status: creating man/Makefile
673:info:configure config.status: creating src/Makefile
674:info:configure config.status: creating tests/Makefile
675:info:configure config.status: creating xcb.pc
676:info:configure config.status: creating xcb-composite.pc
677:info:configure config.status: creating xcb-damage.pc
678:info:configure config.status: creating xcb-dpms.pc
679:info:configure config.status: creating xcb-dri2.pc
680:info:configure config.status: creating xcb-dri3.pc
681:info:configure config.status: creating xcb-ge.pc
682:info:configure config.status: creating xcb-glx.pc
683:info:configure config.status: creating xcb-present.pc
684:info:configure config.status: creating xcb-randr.pc
685:info:configure config.status: creating xcb-record.pc
686:info:configure config.status: creating xcb-render.pc
687:info:configure config.status: creating xcb-res.pc
688:info:configure config.status: creating xcb-screensaver.pc
689:info:configure config.status: creating xcb-shape.pc
690:info:configure config.status: creating xcb-shm.pc
691:info:configure config.status: creating xcb-sync.pc
692:info:configure config.status: creating xcb-xevie.pc
693:info:configure config.status: creating xcb-xf86dri.pc
694:info:configure config.status: creating xcb-xfixes.pc
695:info:configure config.status: creating xcb-xinerama.pc
696:info:configure config.status: creating xcb-xinput.pc
697:info:configure config.status: creating xcb-xkb.pc
698:info:configure config.status: creating xcb-xprint.pc
699:info:configure config.status: creating xcb-xselinux.pc
700:info:configure config.status: creating xcb-xtest.pc
701:info:configure config.status: creating xcb-xv.pc
702:info:configure config.status: creating xcb-xvmc.pc
703:info:configure config.status: creating doc/xcb.doxygen
704:info:configure config.status: creating src/config.h
705:info:configure config.status: executing depfiles commands
706:info:configure config.status: executing libtool commands
707:info:configure   Package: libxcb 1.15
708:info:configure   Configuration
709:info:configure     XDM support.........: yes
710:info:configure     sendmsg fd passing..: yes
711:info:configure     Build unit tests....: no
712:info:configure       with html results.: no
713:info:configure     XCB buffer size.....: 16384
714:info:configure   X11 extensions
715:info:configure     Composite...........: yes
716:info:configure     Damage..............: yes
717:info:configure     Dpms................: yes
718:info:configure     Dri2................: yes
719:info:configure     Dri3................: yes
720:info:configure     GenericEvent........: no
721:info:configure     Glx.................: yes
722:info:configure     Randr...............: yes
723:info:configure     Record..............: yes
724:info:configure     Render..............: yes
725:info:configure     Resource............: yes
726:info:configure     Screensaver.........: yes
727:info:configure     selinux.............: no
728:info:configure     Shape...............: yes
729:info:configure     Shm.................: yes
730:info:configure     Sync................: yes
731:info:configure     Xevie...............: no
732:info:configure     Xfixes..............: yes
733:info:configure     Xfree86-dri.........: yes
734:info:configure     xinerama............: yes
735:info:configure     xinput..............: yes
736:info:configure     xkb.................: yes
737:info:configure     xprint..............: no
738:info:configure     xtest...............: yes
739:info:configure     xv..................: yes
740:info:configure     xvmc................: yes
741:info:configure   Used CFLAGS:
742:info:configure     CPPFLAGS............: -I/opt/local/include
743:info:configure     CFLAGS..............: -pipe -Os -arch ppc
744:info:configure   Installation:
745:info:configure     Prefix..............: /opt/local
746:debug:configure setting option autoconf.dir to /opt/local/var/macports/build/_opt_local_var_macports_sources_rsync.macports.org_macports_release_tarballs_ports_x11_xorg-libxcb/xorg-libxcb/work/libxcb-1.15
747:debug:configure setting option autoreconf.dir to /opt/local/var/macports/build/_opt_local_var_macports_sources_rsync.macports.org_macports_release_tarballs_ports_x11_xorg-libxcb/xorg-libxcb/work/libxcb-1.15
748:debug:configure setting option configure.dir to /opt/local/var/macports/build/_opt_local_var_macports_sources_rsync.macports.org_macports_release_tarballs_ports_x11_xorg-libxcb/xorg-libxcb/work/libxcb-1.15
749:debug:configure setting option configure.compiler to gcc-4.2
750:debug:configure setting option configure.f90 to {}
751:debug:configure setting option configure.f77 to {}
752:debug:configure setting option configure.fc to {}
753:debug:configure setting option configure.cc to /usr/bin/gcc-4.2
754:debug:configure setting option configure.cxx to /usr/bin/g++-4.2
755:debug:configure setting option configure.objc to /usr/bin/gcc-4.2
756:info:configure --->  Configuring xorg-libxcb for architecture ppc64
757:debug:configure setting option configure.dir to /opt/local/var/macports/build/_opt_local_var_macports_sources_rsync.macports.org_macports_release_tarballs_ports_x11_xorg-libxcb/xorg-libxcb/work/libxcb-1.15-ppc64
758:debug:configure setting option autoreconf.dir to /opt/local/var/macports/build/_opt_local_var_macports_sources_rsync.macports.org_macports_release_tarballs_ports_x11_xorg-libxcb/xorg-libxcb/work/libxcb-1.15-ppc64
759:debug:configure setting option autoconf.dir to /opt/local/var/macports/build/_opt_local_var_macports_sources_rsync.macports.org_macports_release_tarballs_ports_x11_xorg-libxcb/xorg-libxcb/work/libxcb-1.15-ppc64
760:debug:configure Environment:
761:debug:configure CC='/usr/bin/gcc-4.2'
762:debug:configure CC_PRINT_OPTIONS='YES'
763:debug:configure CC_PRINT_OPTIONS_FILE='/opt/local/var/macports/build/_opt_local_var_macports_sources_rsync.macports.org_macports_release_tarballs_ports_x11_xorg-libxcb/xorg-libxcb/work/.CC_PRINT_OPTIONS'
764:debug:configure CFLAGS='-pipe -Os -arch ppc64'
765:debug:configure CPATH='/opt/local/include'
766:debug:configure CPPFLAGS='-I/opt/local/include'
767:debug:configure CXX='/usr/bin/g++-4.2'
768:debug:configure CXXFLAGS='-pipe -Os -arch ppc64'
769:debug:configure DEVELOPER_DIR='/Developer'
770:debug:configure F90FLAGS='-pipe -Os -m64'
771:debug:configure FCFLAGS='-pipe -Os -m64'
772:debug:configure FFLAGS='-pipe -Os -m64'
773:debug:configure INSTALL='/usr/bin/install -c'
774:debug:configure LDFLAGS='-L/opt/local/lib -Wl,-headerpad_max_install_names -arch ppc64'
775:debug:configure LIBRARY_PATH='/opt/local/lib'
776:debug:configure MACOSX_DEPLOYMENT_TARGET='10.5'
777:debug:configure OBJC='/usr/bin/gcc-4.2'
778:debug:configure OBJCFLAGS='-pipe -Os -arch ppc64'
779:debug:configure OBJCXX='/usr/bin/g++-4.2'
780:debug:configure OBJCXXFLAGS='-pipe -Os'
781:debug:configure PYTHON='/opt/local/bin/python3.10'
782:info:configure Executing:  cd "/opt/local/var/macports/build/_opt_local_var_macports_sources_rsync.macports.org_macports_release_tarballs_ports_x11_xorg-libxcb/xorg-libxcb/work/libxcb-1.15-ppc64" && ./configure --prefix=/opt/local --disable-devel-docs --disable-silent-rules
783:debug:configure system:  cd "/opt/local/var/macports/build/_opt_local_var_macports_sources_rsync.macports.org_macports_release_tarballs_ports_x11_xorg-libxcb/xorg-libxcb/work/libxcb-1.15-ppc64" && ./configure --prefix=/opt/local --disable-devel-docs --disable-silent-rules
784:info:configure checking for a BSD-compatible install... /usr/bin/install -c
785:info:configure checking whether build environment is sane... yes
786:info:configure checking for a race-free mkdir -p... /opt/local/bin/gmkdir -p
787:info:configure checking for gawk... gawk
788:info:configure checking whether make sets $(MAKE)... yes
789:info:configure checking whether make supports nested variables... yes
790:info:configure checking whether /opt/local/bin/python3.10 version is >= 2.6... yes
791:info:configure checking for /opt/local/bin/python3.10 version... 3.10
792:info:configure checking for /opt/local/bin/python3.10 platform... darwin
793:info:configure checking for GNU default /opt/local/bin/python3.10 prefix... ${prefix}
794:info:configure checking for GNU default /opt/local/bin/python3.10 exec_prefix... ${exec_prefix}
795:info:configure checking for /opt/local/bin/python3.10 script directory (pythondir)... ${PYTHON_PREFIX}/lib/python3.10/site-packages
796:info:configure checking for /opt/local/bin/python3.10 extension module directory (pyexecdir)... ${PYTHON_EXEC_PREFIX}/lib/python3.10/site-packages
797:info:configure checking whether make supports the include directive... yes (GNU style)
798:info:configure checking for gcc... /usr/bin/gcc-4.2
799:info:configure checking whether the C compiler works... yes
800:info:configure checking for C compiler default output file name... a.out
801:info:configure checking for suffix of executables...
802:info:configure checking whether we are cross compiling... no
803:info:configure checking for suffix of object files... o
804:info:configure checking whether the compiler supports GNU C... yes
805:info:configure checking whether /usr/bin/gcc-4.2 accepts -g... yes
806:info:configure checking for /usr/bin/gcc-4.2 option to enable C11 features... unsupported
807:info:configure checking for /usr/bin/gcc-4.2 option to enable C99 features... -std=gnu99
808:info:configure checking whether /usr/bin/gcc-4.2 -std=gnu99 understands -c and -o together... yes
809:info:configure checking dependency style of /usr/bin/gcc-4.2 -std=gnu99... gcc3
810:info:configure checking for stdio.h... yes
811:info:configure checking for stdlib.h... yes
812:info:configure checking for string.h... yes
813:info:configure checking for inttypes.h... yes
814:info:configure checking for stdint.h... yes
815:info:configure checking for strings.h... yes
816:info:configure checking for sys/stat.h... yes
817:info:configure checking for sys/types.h... yes
818:info:configure checking for unistd.h... yes
819:info:configure checking for wchar.h... yes
820:info:configure checking for minix/config.h... no
821:info:configure checking whether it is safe to define __EXTENSIONS__... yes
822:info:configure checking whether _XOPEN_SOURCE should be defined... no
823:info:configure checking build system type... powerpc-apple-darwin9.8.0
824:info:configure checking host system type... powerpc-apple-darwin9.8.0
825:info:configure checking how to print strings... printf
826:info:configure checking for a sed that does not truncate output... /opt/local/bin/gsed
827:info:configure checking for grep that handles long lines and -e... /opt/local/bin/ggrep
828:info:configure checking for egrep... /opt/local/bin/ggrep -E
829:info:configure checking for fgrep... /opt/local/bin/ggrep -F
830:info:configure checking for ld used by /usr/bin/gcc-4.2 -std=gnu99... /usr/libexec/gcc/powerpc-apple-darwin9/4.2.1/ld
831:info:configure checking if the linker (/usr/libexec/gcc/powerpc-apple-darwin9/4.2.1/ld) is GNU ld... no
832:info:configure checking for BSD- or MS-compatible name lister (nm)... /usr/bin/nm -p
833:info:configure checking the name lister (/usr/bin/nm -p) interface... BSD nm
834:info:configure checking whether ln -s works... yes
835:info:configure checking the maximum length of command line arguments... 196608
836:info:configure checking how to convert powerpc-apple-darwin9.8.0 file names to powerpc-apple-darwin9.8.0 format... func_convert_file_noop
837:info:configure checking how to convert powerpc-apple-darwin9.8.0 file names to toolchain format... func_convert_file_noop
838:info:configure checking for /usr/libexec/gcc/powerpc-apple-darwin9/4.2.1/ld option to reload object files... -r
839:info:configure checking for objdump... no
840:info:configure checking how to recognize dependent libraries... pass_all
841:info:configure checking for dlltool... no
842:info:configure checking how to associate runtime and link libraries... printf %s\n
843:info:configure checking for ar... ar
844:info:configure checking for archiver @FILE support... no
845:info:configure checking for strip... strip
846:info:configure checking for ranlib... ranlib
847:info:configure checking command to parse /usr/bin/nm -p output from /usr/bin/gcc-4.2 -std=gnu99 object... ok
848:info:configure checking for sysroot... no
849:info:configure checking for a working dd... /bin/dd
850:info:configure checking how to truncate binary pipes... /bin/dd bs=4096 count=1
851:info:configure checking for mt... no
852:info:configure checking if : is a manifest tool... no
853:info:configure checking for dsymutil... dsymutil
854:info:configure checking for nmedit... nmedit
855:info:configure checking for lipo... lipo
856:info:configure checking for otool... otool
857:info:configure checking for otool64... no
858:info:configure checking for -single_module linker flag... yes
859:info:configure checking for -exported_symbols_list linker flag... yes
860:info:configure checking for -force_load linker flag... ld: unknown option: -force_load
861:info:configure no
862:info:configure checking for dlfcn.h... yes
863:info:configure checking for objdir... .libs
864:info:configure checking if /usr/bin/gcc-4.2 -std=gnu99 supports -fno-rtti -fno-exceptions... no
865:info:configure checking for /usr/bin/gcc-4.2 -std=gnu99 option to produce PIC... -fno-common -DPIC
866:info:configure checking if /usr/bin/gcc-4.2 -std=gnu99 PIC flag -fno-common -DPIC works... yes
867:info:configure checking if /usr/bin/gcc-4.2 -std=gnu99 static flag -static works... no
868:info:configure checking if /usr/bin/gcc-4.2 -std=gnu99 supports -c -o file.o... yes
869:info:configure checking if /usr/bin/gcc-4.2 -std=gnu99 supports -c -o file.o... (cached) yes
870:info:configure checking whether the /usr/bin/gcc-4.2 -std=gnu99 linker (/usr/libexec/gcc/powerpc-apple-darwin9/4.2.1/ld) supports shared libraries... yes
871:info:configure checking dynamic linker characteristics... darwin9.8.0 dyld
872:info:configure checking how to hardcode library paths into programs... immediate
873:info:configure checking whether stripping libraries is possible... yes
874:info:configure checking if libtool supports shared libraries... yes
875:info:configure checking whether to build shared libraries... yes
876:info:configure checking whether to build static libraries... yes
877:info:configure checking for /usr/bin/gcc-4.2 -std=gnu99 options needed to detect all undeclared functions... none needed
878:info:configure checking whether __clang__ is declared... no
879:info:configure checking whether __INTEL_COMPILER is declared... no
880:info:configure checking whether __SUNPRO_C is declared... no
881:info:configure checking for pkg-config... /opt/local/bin/pkg-config
882:info:configure checking pkg-config is at least version 0.9.0... yes
883:info:configure checking if /usr/bin/gcc-4.2 -std=gnu99 supports -Werror=unknown-warning-option... no
884:info:configure checking if /usr/bin/gcc-4.2 -std=gnu99 supports -Werror=unused-command-line-argument... no
885:info:configure checking if /usr/bin/gcc-4.2 -std=gnu99 supports -Wall... yes
886:info:configure checking if /usr/bin/gcc-4.2 -std=gnu99 supports -Wpointer-arith... yes
887:info:configure checking if /usr/bin/gcc-4.2 -std=gnu99 supports -Wmissing-declarations... yes
888:info:configure checking if /usr/bin/gcc-4.2 -std=gnu99 supports -Wformat=2... yes
889:info:configure checking if /usr/bin/gcc-4.2 -std=gnu99 supports -Wstrict-prototypes... yes
890:info:configure checking if /usr/bin/gcc-4.2 -std=gnu99 supports -Wmissing-prototypes... yes
891:info:configure checking if /usr/bin/gcc-4.2 -std=gnu99 supports -Wnested-externs... yes
892:info:configure checking if /usr/bin/gcc-4.2 -std=gnu99 supports -Wbad-function-cast... yes
893:info:configure checking if /usr/bin/gcc-4.2 -std=gnu99 supports -Wold-style-definition... yes
894:info:configure checking if /usr/bin/gcc-4.2 -std=gnu99 supports -Wdeclaration-after-statement... yes
895:info:configure checking if /usr/bin/gcc-4.2 -std=gnu99 supports -Wunused... yes
896:info:configure checking if /usr/bin/gcc-4.2 -std=gnu99 supports -Wuninitialized... yes
897:info:configure checking if /usr/bin/gcc-4.2 -std=gnu99 supports -Wshadow... yes
898:info:configure checking if /usr/bin/gcc-4.2 -std=gnu99 supports -Wmissing-noreturn... yes
899:info:configure checking if /usr/bin/gcc-4.2 -std=gnu99 supports -Wmissing-format-attribute... yes
900:info:configure checking if /usr/bin/gcc-4.2 -std=gnu99 supports -Wredundant-decls... yes
901:info:configure checking if /usr/bin/gcc-4.2 -std=gnu99 supports -Wlogical-op... no
902:info:configure checking if /usr/bin/gcc-4.2 -std=gnu99 supports -Werror=implicit... yes
903:info:configure checking if /usr/bin/gcc-4.2 -std=gnu99 supports -Werror=nonnull... yes
904:info:configure checking if /usr/bin/gcc-4.2 -std=gnu99 supports -Werror=init-self... yes
905:info:configure checking if /usr/bin/gcc-4.2 -std=gnu99 supports -Werror=main... yes
906:info:configure checking if /usr/bin/gcc-4.2 -std=gnu99 supports -Werror=missing-braces... yes
907:info:configure checking if /usr/bin/gcc-4.2 -std=gnu99 supports -Werror=sequence-point... yes
908:info:configure checking if /usr/bin/gcc-4.2 -std=gnu99 supports -Werror=return-type... yes
909:info:configure checking if /usr/bin/gcc-4.2 -std=gnu99 supports -Werror=trigraphs... yes
910:info:configure checking if /usr/bin/gcc-4.2 -std=gnu99 supports -Werror=array-bounds... no
911:info:configure checking if /usr/bin/gcc-4.2 -std=gnu99 supports -Werror=write-strings... yes
912:info:configure checking if /usr/bin/gcc-4.2 -std=gnu99 supports -Werror=address... yes
913:info:configure checking if /usr/bin/gcc-4.2 -std=gnu99 supports -Werror=int-to-pointer-cast... yes
914:info:configure checking if /usr/bin/gcc-4.2 -std=gnu99 supports -Werror=pointer-to-int-cast... yes
915:info:configure checking if /usr/bin/gcc-4.2 -std=gnu99 supports -pedantic... yes
916:info:configure checking if /usr/bin/gcc-4.2 -std=gnu99 supports -Werror... yes
917:info:configure checking if /usr/bin/gcc-4.2 -std=gnu99 supports -Werror=attributes... yes
918:info:configure checking whether make supports nested variables... (cached) yes
919:info:configure checking whether to build developer documentation... no
920:info:configure checking for doxygen... no
921:info:configure configure: WARNING: doxygen not found - documentation targets will be skipped
922:info:configure configure: WARNING: dot not found - doxygen targets will be skipped
923:info:configure checking for CHECK... no
924:info:configure checking for XCBPROTO... yes
925:info:configure checking for NEEDED... yes
926:info:configure checking for XDMCP... yes
927:info:configure checking for XdmcpWrap in -lXdmcp... yes
928:info:configure checking XCBPROTO_XCBINCLUDEDIR... //opt/local/share/xcb
929:info:configure checking XCBPROTO_XCBPYTHONDIR... //opt/local/Library/Frameworks/Python.framework/Versions/3.9/lib/python3.9/site-packages
930:info:configure checking for egrep... (cached) /opt/local/bin/ggrep -E
931:info:configure checking for library containing getaddrinfo... none required
932:info:configure checking for library containing connect... none required
933:info:configure checking for library containing sendmsg... none required
934:info:configure checking for struct msghdr.msg_control... yes
935:info:configure checking for struct sockaddr_un.sun_len... yes
936:info:configure checking for tsol/label.h... no
937:info:configure checking for is_system_labeled... no
938:info:configure checking whether IOV_MAX is declared... yes
939:info:configure checking whether /usr/bin/gcc-4.2 -std=gnu99 supports symbol visibility... yes
940:info:configure checking for getaddrinfo... yes
941:info:configure checking for launchd... yes
942:info:configure checking that generated files are newer than configure... done
943:info:configure configure: creating ./config.status
944:info:configure config.status: creating Makefile
945:info:configure config.status: creating doc/Makefile
946:info:configure config.status: creating man/Makefile
947:info:configure config.status: creating src/Makefile
948:info:configure config.status: creating tests/Makefile
949:info:configure config.status: creating xcb.pc
950:info:configure config.status: creating xcb-composite.pc
951:info:configure config.status: creating xcb-damage.pc
952:info:configure config.status: creating xcb-dpms.pc
953:info:configure config.status: creating xcb-dri2.pc
954:info:configure config.status: creating xcb-dri3.pc
955:info:configure config.status: creating xcb-ge.pc
956:info:configure config.status: creating xcb-glx.pc
957:info:configure config.status: creating xcb-present.pc
958:info:configure config.status: creating xcb-randr.pc
959:info:configure config.status: creating xcb-record.pc
960:info:configure config.status: creating xcb-render.pc
961:info:configure config.status: creating xcb-res.pc
962:info:configure config.status: creating xcb-screensaver.pc
963:info:configure config.status: creating xcb-shape.pc
964:info:configure config.status: creating xcb-shm.pc
965:info:configure config.status: creating xcb-sync.pc
966:info:configure config.status: creating xcb-xevie.pc
967:info:configure config.status: creating xcb-xf86dri.pc
968:info:configure config.status: creating xcb-xfixes.pc
969:info:configure config.status: creating xcb-xinerama.pc
970:info:configure config.status: creating xcb-xinput.pc
971:info:configure config.status: creating xcb-xkb.pc
972:info:configure config.status: creating xcb-xprint.pc
973:info:configure config.status: creating xcb-xselinux.pc
974:info:configure config.status: creating xcb-xtest.pc
975:info:configure config.status: creating xcb-xv.pc
976:info:configure config.status: creating xcb-xvmc.pc
977:info:configure config.status: creating doc/xcb.doxygen
978:info:configure config.status: creating src/config.h
979:info:configure config.status: executing depfiles commands
980:info:configure config.status: executing libtool commands
981:info:configure   Package: libxcb 1.15
982:info:configure   Configuration
983:info:configure     XDM support.........: yes
984:info:configure     sendmsg fd passing..: yes
985:info:configure     Build unit tests....: no
986:info:configure       with html results.: no
987:info:configure     XCB buffer size.....: 16384
988:info:configure   X11 extensions
989:info:configure     Composite...........: yes
990:info:configure     Damage..............: yes
991:info:configure     Dpms................: yes
992:info:configure     Dri2................: yes
993:info:configure     Dri3................: yes
994:info:configure     GenericEvent........: no
995:info:configure     Glx.................: yes
996:info:configure     Randr...............: yes
997:info:configure     Record..............: yes
998:info:configure     Render..............: yes
999:info:configure     Resource............: yes
1000:info:configure     Screensaver.........: yes
1001:info:configure     selinux.............: no
1002:info:configure     Shape...............: yes
1003:info:configure     Shm.................: yes
1004:info:configure     Sync................: yes
1005:info:configure     Xevie...............: no
1006:info:configure     Xfixes..............: yes
1007:info:configure     Xfree86-dri.........: yes
1008:info:configure     xinerama............: yes
1009:info:configure     xinput..............: yes
1010:info:configure     xkb.................: yes
1011:info:configure     xprint..............: no
1012:info:configure     xtest...............: yes
1013:info:configure     xv..................: yes
1014:info:configure     xvmc................: yes
1015:info:configure   Used CFLAGS:
1016:info:configure     CPPFLAGS............: -I/opt/local/include
1017:info:configure     CFLAGS..............: -pipe -Os -arch ppc64
1018:info:configure   Installation:
1019:info:configure     Prefix..............: /opt/local
1020:debug:configure setting option autoconf.dir to /opt/local/var/macports/build/_opt_local_var_macports_sources_rsync.macports.org_macports_release_tarballs_ports_x11_xorg-libxcb/xorg-libxcb/work/libxcb-1.15
1021:debug:configure setting option autoreconf.dir to /opt/local/var/macports/build/_opt_local_var_macports_sources_rsync.macports.org_macports_release_tarballs_ports_x11_xorg-libxcb/xorg-libxcb/work/libxcb-1.15
1022:debug:configure setting option configure.dir to /opt/local/var/macports/build/_opt_local_var_macports_sources_rsync.macports.org_macports_release_tarballs_ports_x11_xorg-libxcb/xorg-libxcb/work/libxcb-1.15
1023:debug:configure setting option configure.compiler to gcc-4.2
1024:debug:configure setting option configure.f90 to {}
1025:debug:configure setting option configure.f77 to {}
1026:debug:configure setting option configure.fc to {}
1027:debug:configure setting option configure.cc to /usr/bin/gcc-4.2
1028:debug:configure setting option configure.cxx to /usr/bin/g++-4.2
1029:debug:configure setting option configure.objc to /usr/bin/gcc-4.2
1030:debug:configure Executing portconfigure::configure_finish
1031:debug:configure Privilege de-escalation not attempted as not running as root.
1032:debug:build build phase started at Sun May  8 18:07:13 CST 2022
1033:notice:build --->  Building xorg-libxcb
1034:debug:build Executing org.macports.build (xorg-libxcb)
1035:info:build --->  Building xorg-libxcb for architecture ppc
1036:debug:build setting option build.dir to /opt/local/var/macports/build/_opt_local_var_macports_sources_rsync.macports.org_macports_release_tarballs_ports_x11_xorg-libxcb/xorg-libxcb/work/libxcb-1.15-ppc
1037:debug:build Environment:
1038:debug:build CC_PRINT_OPTIONS='YES'
1039:debug:build CC_PRINT_OPTIONS_FILE='/opt/local/var/macports/build/_opt_local_var_macports_sources_rsync.macports.org_macports_release_tarballs_ports_x11_xorg-libxcb/xorg-libxcb/work/.CC_PRINT_OPTIONS'
1040:debug:build CPATH='/opt/local/include'
1041:debug:build DEVELOPER_DIR='/Developer'
1042:debug:build LIBRARY_PATH='/opt/local/lib'
1043:debug:build MACOSX_DEPLOYMENT_TARGET='10.5'
1044:info:build Executing:  cd "/opt/local/var/macports/build/_opt_local_var_macports_sources_rsync.macports.org_macports_release_tarballs_ports_x11_xorg-libxcb/xorg-libxcb/work/libxcb-1.15-ppc" && /usr/bin/make -j4 -w all
1045:debug:build system:  cd "/opt/local/var/macports/build/_opt_local_var_macports_sources_rsync.macports.org_macports_release_tarballs_ports_x11_xorg-libxcb/xorg-libxcb/work/libxcb-1.15-ppc" && /usr/bin/make -j4 -w all
1046:info:build make: Entering directory `/opt/local/var/macports/build/_opt_local_var_macports_sources_rsync.macports.org_macports_release_tarballs_ports_x11_xorg-libxcb/xorg-libxcb/work/libxcb-1.15-ppc'
1047:info:build Making all in src
1048:info:build make[1]: Entering directory `/opt/local/var/macports/build/_opt_local_var_macports_sources_rsync.macports.org_macports_release_tarballs_ports_x11_xorg-libxcb/xorg-libxcb/work/libxcb-1.15-ppc/src'
1049:info:build /opt/local/bin/python3.10 ./c_client.py     -c "libxcb 1.15" -l "X Version 11" \
1050:info:build             -s "3" -p //opt/local/Library/Frameworks/Python.framework/Versions/3.9/lib/python3.9/site-packages \
1051:info:build              \
1052:info:build             //opt/local/share/xcb/xproto.xml
1053:info:build /opt/local/bin/python3.10 ./c_client.py     -c "libxcb 1.15" -l "X Version 11" \
1054:info:build             -s "3" -p //opt/local/Library/Frameworks/Python.framework/Versions/3.9/lib/python3.9/site-packages \
1055:info:build              \
1056:info:build             //opt/local/share/xcb/bigreq.xml
1057:info:build /opt/local/bin/python3.10 ./c_client.py     -c "libxcb 1.15" -l "X Version 11" \
1058:info:build             -s "3" -p //opt/local/Library/Frameworks/Python.framework/Versions/3.9/lib/python3.9/site-packages \
1059:info:build              \
1060:info:build             //opt/local/share/xcb/xc_misc.xml
1061:info:build /opt/local/bin/python3.10 ./c_client.py     -c "libxcb 1.15" -l "X Version 11" \
1062:info:build             -s "3" -p //opt/local/Library/Frameworks/Python.framework/Versions/3.9/lib/python3.9/site-packages \
1063:info:build              \
1064:info:build             //opt/local/share/xcb/composite.xml
1065:info:build Traceback (most recent call last):
1066:info:build   File "/opt/local/var/macports/build/_opt_local_var_macports_sources_rsync.macports.org_macports_release_tarballs_ports_x11_xorg-libxcb/xorg-libxcb/work/libxcb-1.15-ppc/src/./c_client.py", line 3394, in <module>
1067:info:build     module.generate()
1068:info:build   File "//opt/local/Library/Frameworks/Python.framework/Versions/3.9/lib/python3.9/site-packages/xcbgen/state.py", line 131, in generate
1069:info:build     item.out(name)
1070:info:build   File "/opt/local/var/macports/build/_opt_local_var_macports_sources_rsync.macports.org_macports_release_tarballs_ports_x11_xorg-libxcb/xorg-libxcb/work/libxcb-1.15-ppc/src/./c_client.py", line 3181, in c_request
1071:info:build     _c_type_setup(self.reply, name, ('reply',))
1072:info:build   File "/opt/local/var/macports/build/_opt_local_var_macports_sources_rsync.macports.org_macports_release_tarballs_ports_x11_xorg-libxcb/xorg-libxcb/work/libxcb-1.15-ppc/src/./c_client.py", line 536, in _c_type_setup
1073:info:build     _c_serialize('sizeof', self)
1074:info:build   File "/opt/local/var/macports/build/_opt_local_var_macports_sources_rsync.macports.org_macports_release_tarballs_ports_x11_xorg-libxcb/xorg-libxcb/work/libxcb-1.15-ppc/src/./c_client.py", line 1420, in _c_serialize
1075:info:build     if self.length_expr is not None:
1076:info:build AttributeError: 'Reply' object has no attribute 'length_expr'
1077:info:build /opt/local/bin/python3.10 ./c_client.py     -c "libxcb 1.15" -l "X Version 11" \
1078:info:build             -s "3" -p //opt/local/Library/Frameworks/Python.framework/Versions/3.9/lib/python3.9/site-packages \
1079:info:build              \
1080:info:build             //opt/local/share/xcb/damage.xml
1081:info:build make[1]: *** [xc_misc.c] Error 1
1082:info:build make[1]: *** Waiting for unfinished jobs....
1083:info:build Traceback (most recent call last):
1084:info:build   File "/opt/local/var/macports/build/_opt_local_var_macports_sources_rsync.macports.org_macports_release_tarballs_ports_x11_xorg-libxcb/xorg-libxcb/work/libxcb-1.15-ppc/src/./c_client.py", line 3394, in <module>
1085:info:build     module.generate()
1086:info:build   File "//opt/local/Library/Frameworks/Python.framework/Versions/3.9/lib/python3.9/site-packages/xcbgen/state.py", line 131, in generate
1087:info:build     item.out(name)
1088:info:build   File "/opt/local/var/macports/build/_opt_local_var_macports_sources_rsync.macports.org_macports_release_tarballs_ports_x11_xorg-libxcb/xorg-libxcb/work/libxcb-1.15-ppc/src/./c_client.py", line 2161, in c_struct
1089:info:build     _c_type_setup(self, name, ())
1090:info:build   File "/opt/local/var/macports/build/_opt_local_var_macports_sources_rsync.macports.org_macports_release_tarballs_ports_x11_xorg-libxcb/xorg-libxcb/work/libxcb-1.15-ppc/src/./c_client.py", line 536, in _c_type_setup
1091:info:build     _c_serialize('sizeof', self)
1092:info:build   File "/opt/local/var/macports/build/_opt_local_var_macports_sources_rsync.macports.org_macports_release_tarballs_ports_x11_xorg-libxcb/xorg-libxcb/work/libxcb-1.15-ppc/src/./c_client.py", line 1420, in _c_serialize
1093:info:build     if self.length_expr is not None:
1094:info:build AttributeError: 'Struct' object has no attribute 'length_expr'
1095:info:build make[1]: *** [xproto.c] Error 1
1096:info:build make[1]: Leaving directory `/opt/local/var/macports/build/_opt_local_var_macports_sources_rsync.macports.org_macports_release_tarballs_ports_x11_xorg-libxcb/xorg-libxcb/work/libxcb-1.15-ppc/src'
1097:info:build make: *** [all-recursive] Error 1
1098:info:build make: Leaving directory `/opt/local/var/macports/build/_opt_local_var_macports_sources_rsync.macports.org_macports_release_tarballs_ports_x11_xorg-libxcb/xorg-libxcb/work/libxcb-1.15-ppc'
1099:info:build Command failed:  cd "/opt/local/var/macports/build/_opt_local_var_macports_sources_rsync.macports.org_macports_release_tarballs_ports_x11_xorg-libxcb/xorg-libxcb/work/libxcb-1.15-ppc" && /usr/bin/make -j4 -w all
1100:info:build Exit code: 2
1101:error:build Failed to build xorg-libxcb: command execution failed
1102:debug:build Error code: NONE
1103:debug:build Backtrace: command execution failed
1104:debug:build     while executing
1105:debug:build "$procedure $targetname"
1106:error:build See /opt/local/var/macports/logs/_opt_local_var_macports_sources_rsync.macports.org_macports_release_tarballs_ports_x11_xorg-libxcb/xorg-libxcb/main.log for details.