| 1 | version:1 |
|---|
| 2 | :debug:clean Starting logging for lnav @0.12.0_0 |
|---|
| 3 | :debug:sysinfo OS X 10.9.5 (darwin/13.4.0) arch i386 |
|---|
| 4 | :debug:sysinfo MacPorts 2.9.1 |
|---|
| 5 | :debug:sysinfo Xcode 6.2, CLT 6.2.0.0.1.1424975374 |
|---|
| 6 | :debug:sysinfo SDK 10.9 |
|---|
| 7 | :debug:sysinfo MACOSX_DEPLOYMENT_TARGET: 10.9 |
|---|
| 8 | :msg:clean ---> Computing dependencies for lnav:info:clean .:debug:clean Checking for conflicts against lnav |
|---|
| 9 | :debug:clean Searching for dependency: lnav-devel |
|---|
| 10 | :debug:clean Didn't find receipt, going to depspec regex for: lnav-devel |
|---|
| 11 | :debug:clean Searching for dependency: autoconf |
|---|
| 12 | :debug:clean Found Dependency: receipt exists for autoconf |
|---|
| 13 | :debug:clean Searching for dependency: automake |
|---|
| 14 | :debug:clean Found Dependency: receipt exists for automake |
|---|
| 15 | :debug:clean Searching for dependency: libtool |
|---|
| 16 | :debug:clean Found Dependency: receipt exists for libtool |
|---|
| 17 | :debug:clean Searching for dependency: clang-16 |
|---|
| 18 | :debug:clean Found Dependency: receipt exists for clang-16 |
|---|
| 19 | :debug:clean Searching for dependency: openssl |
|---|
| 20 | :debug:clean Found Dependency: receipt exists for openssl |
|---|
| 21 | :debug:clean Searching for dependency: bzip2 |
|---|
| 22 | :debug:clean Found Dependency: receipt exists for bzip2 |
|---|
| 23 | :debug:clean Searching for dependency: curl |
|---|
| 24 | :debug:clean Found Dependency: receipt exists for curl |
|---|
| 25 | :debug:clean Searching for dependency: libarchive |
|---|
| 26 | :debug:clean Found Dependency: receipt exists for libarchive |
|---|
| 27 | :debug:clean Searching for dependency: ncurses |
|---|
| 28 | :debug:clean Found Dependency: receipt exists for ncurses |
|---|
| 29 | :debug:clean Searching for dependency: pcre2 |
|---|
| 30 | :debug:clean Found Dependency: receipt exists for pcre2 |
|---|
| 31 | :debug:clean Searching for dependency: readline |
|---|
| 32 | :debug:clean Found Dependency: receipt exists for readline |
|---|
| 33 | :debug:clean Searching for dependency: sqlite3 |
|---|
| 34 | :debug:clean Found Dependency: receipt exists for sqlite3 |
|---|
| 35 | :debug:clean Searching for dependency: zlib |
|---|
| 36 | :debug:clean Found Dependency: receipt exists for zlib |
|---|
| 37 | :debug:clean Searching for dependency: legacy-support |
|---|
| 38 | :debug:clean Found Dependency: receipt exists for legacy-support |
|---|
| 39 | :debug:main Executing org.macports.main (lnav) |
|---|
| 40 | :debug:main dropping privileges: euid changed to 502, egid changed to 501. |
|---|
| 41 | :debug:archivefetch archivefetch phase started at Mon Feb 26 10:38:37 EST 2024 |
|---|
| 42 | :msg:archivefetch ---> Fetching archive for lnav |
|---|
| 43 | :debug:archivefetch Executing org.macports.archivefetch (lnav) |
|---|
| 44 | :debug:archivefetch euid/egid changed to: 0/0 |
|---|
| 45 | :debug:archivefetch chowned /opt/local/var/macports/incoming to macports |
|---|
| 46 | :debug:archivefetch euid/egid changed to: 502/501 |
|---|
| 47 | :info:archivefetch ---> lnav-0.12.0_0.darwin_13.x86_64.tbz2 doesn't seem to exist in /opt/local/var/macports/incoming/verified |
|---|
| 48 | :msg:archivefetch ---> Attempting to fetch lnav-0.12.0_0.darwin_13.x86_64.tbz2 from http://packages.macports.org/lnav |
|---|
| 49 | :debug:archivefetch Fetching archive failed: The requested URL returned error: 404 |
|---|
| 50 | :msg:archivefetch ---> Attempting to fetch lnav-0.12.0_0.darwin_13.x86_64.tbz2 from http://fra.de.packages.macports.org/lnav |
|---|
| 51 | :debug:archivefetch Fetching archive failed: The requested URL returned error: 404 |
|---|
| 52 | :msg:archivefetch ---> Attempting to fetch lnav-0.12.0_0.darwin_13.x86_64.tbz2 from http://nue.de.packages.macports.org/lnav |
|---|
| 53 | :debug:archivefetch Fetching archive failed: The requested URL returned error: 404 |
|---|
| 54 | :debug:archivefetch Privilege de-escalation not attempted as not running as root. |
|---|
| 55 | :debug:fetch fetch phase started at Mon Feb 26 10:38:38 EST 2024 |
|---|
| 56 | :notice:fetch ---> Fetching distfiles for lnav |
|---|
| 57 | :debug:fetch elevating privileges for fetch: euid changed to 0, egid changed to 0. |
|---|
| 58 | :debug:fetch dropping privileges: euid changed to 502, egid changed to 501. |
|---|
| 59 | :debug:fetch Executing org.macports.fetch (lnav) |
|---|
| 60 | :info:fetch ---> lnav-0.12.0.tar.gz does not exist in /opt/local/var/macports/distfiles/lnav |
|---|
| 61 | :notice:fetch ---> Attempting to fetch lnav-0.12.0.tar.gz from https://github.com/tstack/lnav/archive/v0.12.0 |
|---|
| 62 | :debug:fetch Privilege de-escalation not attempted as not running as root. |
|---|
| 63 | :debug:checksum checksum phase started at Mon Feb 26 10:39:01 EST 2024 |
|---|
| 64 | :notice:checksum ---> Verifying checksums for lnav |
|---|
| 65 | :debug:checksum Executing org.macports.checksum (lnav) |
|---|
| 66 | :info:checksum ---> Checksumming lnav-0.12.0.tar.gz |
|---|
| 67 | :debug:checksum Calculated (rmd160) is c9869fba8ac907f9c88b55da4d37b5422964bfef |
|---|
| 68 | :debug:checksum Correct (rmd160) checksum for lnav-0.12.0.tar.gz |
|---|
| 69 | :debug:checksum Calculated (sha256) is d431840213549c8175780ecc6151ae66c3ecf27b48e5e859a6a18df83c4a02bd |
|---|
| 70 | :debug:checksum Correct (sha256) checksum for lnav-0.12.0.tar.gz |
|---|
| 71 | :debug:checksum Calculated (size) is 18038892 |
|---|
| 72 | :debug:checksum Correct (size) checksum for lnav-0.12.0.tar.gz |
|---|
| 73 | :debug:checksum Privilege de-escalation not attempted as not running as root. |
|---|
| 74 | :debug:extract extract phase started at Mon Feb 26 10:39:01 EST 2024 |
|---|
| 75 | :notice:extract ---> Extracting lnav |
|---|
| 76 | :debug:extract Executing org.macports.extract (lnav) |
|---|
| 77 | :info:extract ---> Extracting lnav-0.12.0.tar.gz |
|---|
| 78 | :debug:extract setting option extract.args to '/opt/local/var/macports/distfiles/lnav/lnav-0.12.0.tar.gz' |
|---|
| 79 | :debug:extract Environment: |
|---|
| 80 | :debug:extract CC_PRINT_OPTIONS='YES' |
|---|
| 81 | :debug:extract CC_PRINT_OPTIONS_FILE='/opt/local/var/macports/build/_opt_local_var_macports_sources_rsync.macports.org_release_tarballs_ports_sysutils_lnav/lnav/work/.CC_PRINT_OPTIONS' |
|---|
| 82 | :debug:extract CPATH='/opt/local/include' |
|---|
| 83 | :debug:extract CPLUS_INCLUDE_PATH='/opt/local/include/LegacySupport' |
|---|
| 84 | :debug:extract C_INCLUDE_PATH='/opt/local/include/LegacySupport' |
|---|
| 85 | :debug:extract DEVELOPER_DIR='/Library/Developer/CommandLineTools' |
|---|
| 86 | :debug:extract LIBRARY_PATH='/opt/local/lib' |
|---|
| 87 | :debug:extract MACOSX_DEPLOYMENT_TARGET='10.9' |
|---|
| 88 | :debug:extract MACPORTS_LEGACY_SUPPORT_CPPFLAGS='-isystem/opt/local/include/LegacySupport' |
|---|
| 89 | :debug:extract MACPORTS_LEGACY_SUPPORT_ENABLED='1' |
|---|
| 90 | :debug:extract MACPORTS_LEGACY_SUPPORT_LDFLAGS='-L/opt/local/lib -lMacportsLegacySupport' |
|---|
| 91 | :debug:extract OBJCPLUS_INCLUDE_PATH='/opt/local/include/LegacySupport' |
|---|
| 92 | :debug:extract OBJC_INCLUDE_PATH='/opt/local/include/LegacySupport' |
|---|
| 93 | :info:extract Executing: cd "/opt/local/var/macports/build/_opt_local_var_macports_sources_rsync.macports.org_release_tarballs_ports_sysutils_lnav/lnav/work" && /usr/bin/gzip -dc '/opt/local/var/macports/distfiles/lnav/lnav-0.12.0.tar.gz' | /usr/bin/tar -xf - |
|---|
| 94 | :debug:extract system: cd "/opt/local/var/macports/build/_opt_local_var_macports_sources_rsync.macports.org_release_tarballs_ports_sysutils_lnav/lnav/work" && /usr/bin/gzip -dc '/opt/local/var/macports/distfiles/lnav/lnav-0.12.0.tar.gz' | /usr/bin/tar -xf - |
|---|
| 95 | :debug:extract euid/egid changed to: 0/0 |
|---|
| 96 | :debug:extract chowned /opt/local/var/macports/build/_opt_local_var_macports_sources_rsync.macports.org_release_tarballs_ports_sysutils_lnav/lnav/work to macports |
|---|
| 97 | :debug:extract euid/egid changed to: 502/501 |
|---|
| 98 | :debug:extract Privilege de-escalation not attempted as not running as root. |
|---|
| 99 | :debug:patch patch phase started at Mon Feb 26 10:39:01 EST 2024 |
|---|
| 100 | :debug:patch Executing org.macports.patch (lnav) |
|---|
| 101 | :debug:patch Privilege de-escalation not attempted as not running as root. |
|---|
| 102 | :debug:configure configure phase started at Mon Feb 26 10:39:01 EST 2024 |
|---|
| 103 | :notice:configure ---> Configuring lnav |
|---|
| 104 | :debug:configure Preferred compilers: macports-clang-16 macports-clang-15 macports-clang-14 macports-clang-13 macports-clang-12 macports-clang-11 macports-clang-10 macports-clang-9.0 macports-clang-8.0 macports-clang-7.0 macports-clang-6.0 macports-clang-5.0 macports-clang-3.7 macports-clang-3.4 |
|---|
| 105 | :debug:configure Using compiler 'MacPorts Clang 16' |
|---|
| 106 | :debug:configure Executing org.macports.configure (lnav) |
|---|
| 107 | :debug:configure Environment: |
|---|
| 108 | :debug:configure CC_PRINT_OPTIONS='YES' |
|---|
| 109 | :debug:configure CC_PRINT_OPTIONS_FILE='/opt/local/var/macports/build/_opt_local_var_macports_sources_rsync.macports.org_release_tarballs_ports_sysutils_lnav/lnav/work/.CC_PRINT_OPTIONS' |
|---|
| 110 | :debug:configure CPATH='/opt/local/include' |
|---|
| 111 | :debug:configure DEVELOPER_DIR='/Library/Developer/CommandLineTools' |
|---|
| 112 | :debug:configure LIBRARY_PATH='/opt/local/lib' |
|---|
| 113 | :debug:configure MACOSX_DEPLOYMENT_TARGET='10.9' |
|---|
| 114 | :info:configure Executing: cd "/opt/local/var/macports/build/_opt_local_var_macports_sources_rsync.macports.org_release_tarballs_ports_sysutils_lnav/lnav/work/lnav-0.12.0" && autoreconf --install --verbose |
|---|
| 115 | :debug:configure system: cd "/opt/local/var/macports/build/_opt_local_var_macports_sources_rsync.macports.org_release_tarballs_ports_sysutils_lnav/lnav/work/lnav-0.12.0" && autoreconf --install --verbose |
|---|
| 116 | :info:configure autoreconf: export WARNINGS= |
|---|
| 117 | :info:configure autoreconf: Entering directory '.' |
|---|
| 118 | :info:configure autoreconf: configure.ac: not using Gettext |
|---|
| 119 | :info:configure autoreconf: running: /opt/local/bin/aclocal -I . |
|---|
| 120 | :info:configure autoreconf: configure.ac: tracing |
|---|
| 121 | :info:configure autoreconf: configure.ac: not using Libtool |
|---|
| 122 | :info:configure autoreconf: configure.ac: not using Intltool |
|---|
| 123 | :info:configure autoreconf: configure.ac: not using Gtkdoc |
|---|
| 124 | :info:configure autoreconf: running: /opt/local/bin/autoconf |
|---|
| 125 | :info:configure autoreconf: running: /opt/local/bin/autoheader |
|---|
| 126 | :info:configure autoreconf: running: /opt/local/bin/automake --add-missing --copy --no-force |
|---|
| 127 | :info:configure configure.ac:49: installing './ar-lib' |
|---|
| 128 | :info:configure configure.ac:10: installing './compile' |
|---|
| 129 | :info:configure configure.ac:9: installing './config.guess' |
|---|
| 130 | :info:configure configure.ac:9: installing './config.sub' |
|---|
| 131 | :info:configure configure.ac:4: installing './install-sh' |
|---|
| 132 | :info:configure configure.ac:4: installing './missing' |
|---|
| 133 | :info:configure src/Makefile.am: installing './depcomp' |
|---|
| 134 | :info:configure parallel-tests: installing './test-driver' |
|---|
| 135 | :info:configure autoreconf: Leaving directory '.' |
|---|
| 136 | :debug:configure Environment: |
|---|
| 137 | :debug:configure CC='/opt/local/bin/clang-mp-16' |
|---|
| 138 | :debug:configure CC_PRINT_OPTIONS='YES' |
|---|
| 139 | :debug:configure CC_PRINT_OPTIONS_FILE='/opt/local/var/macports/build/_opt_local_var_macports_sources_rsync.macports.org_release_tarballs_ports_sysutils_lnav/lnav/work/.CC_PRINT_OPTIONS' |
|---|
| 140 | :debug:configure CFLAGS='-pipe -Os -arch x86_64' |
|---|
| 141 | :debug:configure CPATH='/opt/local/include' |
|---|
| 142 | :debug:configure CPLUS_INCLUDE_PATH='/opt/local/include/LegacySupport' |
|---|
| 143 | :debug:configure CPPFLAGS='-isystem/opt/local/include/LegacySupport -I/opt/local/include' |
|---|
| 144 | :debug:configure CXX='/opt/local/bin/clang++-mp-16' |
|---|
| 145 | :debug:configure CXXFLAGS='-pipe -Os -stdlib=libc++ -arch x86_64' |
|---|
| 146 | :debug:configure C_INCLUDE_PATH='/opt/local/include/LegacySupport' |
|---|
| 147 | :debug:configure DEVELOPER_DIR='/Library/Developer/CommandLineTools' |
|---|
| 148 | :debug:configure F90FLAGS='-pipe -Os -m64' |
|---|
| 149 | :debug:configure FCFLAGS='-pipe -Os -m64' |
|---|
| 150 | :debug:configure FFLAGS='-pipe -Os -m64' |
|---|
| 151 | :debug:configure INSTALL='/usr/bin/install -c' |
|---|
| 152 | :debug:configure LDFLAGS='-Wl,-headerpad_max_install_names -L/opt/local/lib -lMacportsLegacySupport -arch x86_64' |
|---|
| 153 | :debug:configure LIBRARY_PATH='/opt/local/lib' |
|---|
| 154 | :debug:configure MACOSX_DEPLOYMENT_TARGET='10.9' |
|---|
| 155 | :debug:configure MACPORTS_LEGACY_SUPPORT_CPPFLAGS='-isystem/opt/local/include/LegacySupport' |
|---|
| 156 | :debug:configure MACPORTS_LEGACY_SUPPORT_ENABLED='1' |
|---|
| 157 | :debug:configure MACPORTS_LEGACY_SUPPORT_LDFLAGS='-L/opt/local/lib -lMacportsLegacySupport' |
|---|
| 158 | :debug:configure OBJC='/opt/local/bin/clang-mp-16' |
|---|
| 159 | :debug:configure OBJCFLAGS='-pipe -Os -arch x86_64' |
|---|
| 160 | :debug:configure OBJCPLUS_INCLUDE_PATH='/opt/local/include/LegacySupport' |
|---|
| 161 | :debug:configure OBJCXX='/opt/local/bin/clang++-mp-16' |
|---|
| 162 | :debug:configure OBJCXXFLAGS='-pipe -Os -stdlib=libc++ -arch x86_64' |
|---|
| 163 | :debug:configure OBJC_INCLUDE_PATH='/opt/local/include/LegacySupport' |
|---|
| 164 | :info:configure Executing: cd "/opt/local/var/macports/build/_opt_local_var_macports_sources_rsync.macports.org_release_tarballs_ports_sysutils_lnav/lnav/work/lnav-0.12.0" && ./configure --prefix=/opt/local --disable-silent-rules --disable-static --with-libarchive --with-libcurl=/opt/local --with-ncurses --with-pcre2 --with-readline --with-sqlite3 |
|---|
| 165 | :debug:configure system: cd "/opt/local/var/macports/build/_opt_local_var_macports_sources_rsync.macports.org_release_tarballs_ports_sysutils_lnav/lnav/work/lnav-0.12.0" && ./configure --prefix=/opt/local --disable-silent-rules --disable-static --with-libarchive --with-libcurl=/opt/local --with-ncurses --with-pcre2 --with-readline --with-sqlite3 |
|---|
| 166 | :info:configure checking for a BSD-compatible install... /usr/bin/install -c |
|---|
| 167 | :info:configure checking whether build environment is sane... yes |
|---|
| 168 | :info:configure checking for a race-free mkdir -p... /opt/local/bin/gmkdir -p |
|---|
| 169 | :info:configure checking for gawk... gawk |
|---|
| 170 | :info:configure checking whether make sets $(MAKE)... yes |
|---|
| 171 | :info:configure checking whether make supports nested variables... yes |
|---|
| 172 | :info:configure checking whether make supports nested variables... (cached) yes |
|---|
| 173 | :info:configure checking build system type... x86_64-apple-darwin13.4.0 |
|---|
| 174 | :info:configure checking host system type... x86_64-apple-darwin13.4.0 |
|---|
| 175 | :info:configure checking whether make supports the include directive... yes (GNU style) |
|---|
| 176 | :info:configure checking for gcc... /opt/local/bin/clang-mp-16 |
|---|
| 177 | :info:configure checking whether the C compiler works... yes |
|---|
| 178 | :info:configure checking for C compiler default output file name... a.out |
|---|
| 179 | :info:configure checking for suffix of executables... |
|---|
| 180 | :info:configure checking whether we are cross compiling... no |
|---|
| 181 | :info:configure checking for suffix of object files... o |
|---|
| 182 | :info:configure checking whether the compiler supports GNU C... yes |
|---|
| 183 | :info:configure checking whether /opt/local/bin/clang-mp-16 accepts -g... yes |
|---|
| 184 | :info:configure checking for /opt/local/bin/clang-mp-16 option to enable C11 features... none needed |
|---|
| 185 | :info:configure checking whether /opt/local/bin/clang-mp-16 understands -c and -o together... yes |
|---|
| 186 | :info:configure checking dependency style of /opt/local/bin/clang-mp-16... gcc3 |
|---|
| 187 | :info:configure checking how to run the C preprocessor... /opt/local/bin/clang-mp-16 -E |
|---|
| 188 | :info:configure checking for x86_64-apple-darwin13.4.0-gcc... no |
|---|
| 189 | :info:configure checking for gcc... gcc |
|---|
| 190 | :info:configure checking whether the compiler supports GNU C... (cached) yes |
|---|
| 191 | :info:configure checking whether gcc accepts -g... yes |
|---|
| 192 | :info:configure checking for gcc option to enable C11 features... (cached) none needed |
|---|
| 193 | :info:configure checking whether gcc understands -c and -o together... yes |
|---|
| 194 | :info:configure checking dependency style of gcc... gcc3 |
|---|
| 195 | :info:configure checking whether the C compiler works... yes |
|---|
| 196 | :info:configure checking for C compiler default output file name... a.out |
|---|
| 197 | :info:configure checking for suffix of executables... |
|---|
| 198 | :info:configure checking whether we are cross compiling... no |
|---|
| 199 | :info:configure checking for suffix of object files... o |
|---|
| 200 | :info:configure checking how to run the C preprocessor... gcc -E |
|---|
| 201 | :info:configure checking for a sed that does not truncate output... /opt/local/bin/gsed |
|---|
| 202 | :info:configure checking for egrep -e... /opt/local/bin/ggrep -E |
|---|
| 203 | :info:configure checking whether /opt/local/bin/clang-mp-16 is Clang... yes |
|---|
| 204 | :info:configure checking whether pthreads work with "-pthread" and "-lpthread"... yes |
|---|
| 205 | :info:configure checking whether Clang needs flag to prevent "argument unused" warning when linking with -pthread... no |
|---|
| 206 | :info:configure checking for joinable pthread attribute... PTHREAD_CREATE_JOINABLE |
|---|
| 207 | :info:configure checking whether more special flags are required for pthreads... no |
|---|
| 208 | :info:configure checking for PTHREAD_PRIO_INHERIT... yes |
|---|
| 209 | :info:configure checking whether the compiler supports GNU C++... yes |
|---|
| 210 | :info:configure checking whether /opt/local/bin/clang++-mp-16 accepts -g... yes |
|---|
| 211 | :info:configure checking for /opt/local/bin/clang++-mp-16 option to enable C++11 features... none needed |
|---|
| 212 | :info:configure checking dependency style of /opt/local/bin/clang++-mp-16... gcc3 |
|---|
| 213 | :info:configure checking whether /opt/local/bin/clang++-mp-16 supports C++14 features with -std=c++14... yes |
|---|
| 214 | :info:configure checking for ranlib... ranlib |
|---|
| 215 | :info:configure checking for ar... ar |
|---|
| 216 | :info:configure checking the archiver (ar) interface... ar |
|---|
| 217 | :info:configure checking whether ln -s works... yes |
|---|
| 218 | :info:configure checking whether make sets $(MAKE)... (cached) yes |
|---|
| 219 | :info:configure checking for bzip2... /opt/local/bin/bzip2 |
|---|
| 220 | :info:configure checking for re2c... no |
|---|
| 221 | :info:configure checking for xz... /opt/local/bin/xz |
|---|
| 222 | :info:configure checking for tshark... /opt/local/bin/tshark |
|---|
| 223 | :info:configure checking for stdio.h... yes |
|---|
| 224 | :info:configure checking for stdlib.h... yes |
|---|
| 225 | :info:configure checking for string.h... yes |
|---|
| 226 | :info:configure checking for inttypes.h... yes |
|---|
| 227 | :info:configure checking for stdint.h... yes |
|---|
| 228 | :info:configure checking for strings.h... yes |
|---|
| 229 | :info:configure checking for sys/stat.h... yes |
|---|
| 230 | :info:configure checking for sys/types.h... yes |
|---|
| 231 | :info:configure checking for unistd.h... yes |
|---|
| 232 | :info:configure checking size of off_t... 8 |
|---|
| 233 | :info:configure checking size of size_t... 8 |
|---|
| 234 | :info:configure checking whether struct tm is in sys/time.h or time.h... time.h |
|---|
| 235 | :info:configure checking for /opt/local/bin/clang++-mp-16 -std=c++14 options needed to detect all undeclared functions... none needed |
|---|
| 236 | :info:configure checking for struct tm.tm_zone... yes |
|---|
| 237 | :info:configure checking for library containing openpty... none required |
|---|
| 238 | :info:configure checking for library containing gzseek... -lz |
|---|
| 239 | :info:configure checking for library containing BZ2_bzopen... -lbz2 |
|---|
| 240 | :info:configure checking for library containing dlopen... none required |
|---|
| 241 | :info:configure checking for library containing backtrace... none required |
|---|
| 242 | :info:configure checking for gawk... (cached) gawk |
|---|
| 243 | :info:configure checking for curl-config... /opt/local/bin/curl-config |
|---|
| 244 | :info:configure checking for the version of libcurl... 8.6.0 |
|---|
| 245 | :info:configure checking for libcurl >= version 7.23.0... yes |
|---|
| 246 | :info:configure checking whether libcurl is usable... yes |
|---|
| 247 | :info:configure checking for curl_free... yes |
|---|
| 248 | :info:configure configure: Trying to link with tinfo |
|---|
| 249 | :info:configure checking for library containing cur_term... no |
|---|
| 250 | :info:configure configure: WARNING: libtinfo not found |
|---|
| 251 | :info:configure checking for execinfo.h... yes |
|---|
| 252 | :info:configure checking for pty.h... no |
|---|
| 253 | :info:configure checking for util.h... yes |
|---|
| 254 | :info:configure checking for zlib.h... yes |
|---|
| 255 | :info:configure checking for bzlib.h... yes |
|---|
| 256 | :info:configure checking for libutil.h... no |
|---|
| 257 | :info:configure checking for sys/ttydefaults.h... yes |
|---|
| 258 | :info:configure configure: compiling with the included version of yajl |
|---|
| 259 | :info:configure checking for NcursesW wide-character library... yes |
|---|
| 260 | :info:configure checking for working ncursesw/curses.h... no |
|---|
| 261 | :info:configure checking for working ncursesw.h... no |
|---|
| 262 | :info:configure checking for working ncurses.h... yes |
|---|
| 263 | :info:configure checking lib archive... (testing) |
|---|
| 264 | :info:configure checking for archive_read_new in -larchive... yes |
|---|
| 265 | :info:configure checking for archive.h... yes |
|---|
| 266 | :info:configure checking lib archive... -larchive |
|---|
| 267 | :info:configure checking if PCRE2 is wanted... yes |
|---|
| 268 | :info:configure configure: WARNING: Sorry, yes does not exist, checking usual places |
|---|
| 269 | :info:configure checking for pcre2_compile_8 in -lpcre2-8... yes |
|---|
| 270 | :info:configure checking for pcre2.h... yes |
|---|
| 271 | :info:configure checking lib readline... checking for library containing readline... -lreadline |
|---|
| 272 | :info:configure checking for library containing history_set_history_state... none required |
|---|
| 273 | :info:configure checking for readline.h... no |
|---|
| 274 | :info:configure checking for readline/readline.h... yes |
|---|
| 275 | :info:configure checking whether to build with code coverage support... no |
|---|
| 276 | :info:configure checking for library containing sqlite3_open... -lsqlite3 |
|---|
| 277 | :info:configure checking for sqlite3.h... yes |
|---|
| 278 | :info:configure checking for SQLite3 library >= 3.9.0... yes |
|---|
| 279 | :info:configure checking for sqlite3_stmt_readonly... yes |
|---|
| 280 | :info:configure checking for sqlite3_value_subtype... yes |
|---|
| 281 | :info:configure checking for sqlite3_error_offset... yes |
|---|
| 282 | :info:configure checking for sqlite3_drop_modules... yes |
|---|
| 283 | :info:configure Adding include path: /opt/local/include |
|---|
| 284 | :info:configure Adding include path: /usr/local/include |
|---|
| 285 | :info:configure checking that generated files are newer than configure... done |
|---|
| 286 | :info:configure configure: creating ./config.status |
|---|
| 287 | :info:configure config.status: creating Makefile |
|---|
| 288 | :info:configure config.status: creating TESTS_ENVIRONMENT |
|---|
| 289 | :info:configure config.status: creating tools/Makefile |
|---|
| 290 | :info:configure config.status: creating src/Makefile |
|---|
| 291 | :info:configure config.status: creating src/base/Makefile |
|---|
| 292 | :info:configure config.status: creating src/formats/logfmt/Makefile |
|---|
| 293 | :info:configure config.status: creating src/fmtlib/Makefile |
|---|
| 294 | :info:configure config.status: creating src/pcrepp/Makefile |
|---|
| 295 | :info:configure config.status: creating src/pugixml/Makefile |
|---|
| 296 | :info:configure config.status: creating src/tailer/Makefile |
|---|
| 297 | :info:configure config.status: creating src/yajl/Makefile |
|---|
| 298 | :info:configure config.status: creating src/yajlpp/Makefile |
|---|
| 299 | :info:configure config.status: creating src/third-party/base64/lib/Makefile |
|---|
| 300 | :info:configure config.status: creating src/third-party/date/src/Makefile |
|---|
| 301 | :info:configure config.status: creating src/third-party/scnlib/src/Makefile |
|---|
| 302 | :info:configure config.status: creating test/Makefile |
|---|
| 303 | :info:configure config.status: creating src/config.h |
|---|
| 304 | :info:configure config.status: executing depfiles commands |
|---|
| 305 | :debug:configure Executing portconfigure::configure_finish |
|---|
| 306 | :debug:configure Privilege de-escalation not attempted as not running as root. |
|---|
| 307 | :debug:build build phase started at Mon Feb 26 10:39:24 EST 2024 |
|---|
| 308 | :notice:build ---> Building lnav |
|---|
| 309 | :debug:build Executing org.macports.build (lnav) |
|---|
| 310 | :debug:build Environment: |
|---|
| 311 | :debug:build CC_PRINT_OPTIONS='YES' |
|---|
| 312 | :debug:build CC_PRINT_OPTIONS_FILE='/opt/local/var/macports/build/_opt_local_var_macports_sources_rsync.macports.org_release_tarballs_ports_sysutils_lnav/lnav/work/.CC_PRINT_OPTIONS' |
|---|
| 313 | :debug:build CPATH='/opt/local/include' |
|---|
| 314 | :debug:build CPLUS_INCLUDE_PATH='/opt/local/include/LegacySupport' |
|---|
| 315 | :debug:build C_INCLUDE_PATH='/opt/local/include/LegacySupport' |
|---|
| 316 | :debug:build DEVELOPER_DIR='/Library/Developer/CommandLineTools' |
|---|
| 317 | :debug:build LIBRARY_PATH='/opt/local/lib' |
|---|
| 318 | :debug:build MACOSX_DEPLOYMENT_TARGET='10.9' |
|---|
| 319 | :debug:build MACPORTS_LEGACY_SUPPORT_CPPFLAGS='-isystem/opt/local/include/LegacySupport' |
|---|
| 320 | :debug:build MACPORTS_LEGACY_SUPPORT_ENABLED='1' |
|---|
| 321 | :debug:build MACPORTS_LEGACY_SUPPORT_LDFLAGS='-L/opt/local/lib -lMacportsLegacySupport' |
|---|
| 322 | :debug:build OBJCPLUS_INCLUDE_PATH='/opt/local/include/LegacySupport' |
|---|
| 323 | :debug:build OBJC_INCLUDE_PATH='/opt/local/include/LegacySupport' |
|---|
| 324 | :info:build Executing: cd "/opt/local/var/macports/build/_opt_local_var_macports_sources_rsync.macports.org_release_tarballs_ports_sysutils_lnav/lnav/work/lnav-0.12.0" && /usr/bin/make -j8 -w all |
|---|
| 325 | :debug:build system: cd "/opt/local/var/macports/build/_opt_local_var_macports_sources_rsync.macports.org_release_tarballs_ports_sysutils_lnav/lnav/work/lnav-0.12.0" && /usr/bin/make -j8 -w all |
|---|
| 326 | :info:build make: Entering directory `/opt/local/var/macports/build/_opt_local_var_macports_sources_rsync.macports.org_release_tarballs_ports_sysutils_lnav/lnav/work/lnav-0.12.0' |
|---|
| 327 | :info:build Making all in tools |
|---|
| 328 | :info:build make[1]: Entering directory `/opt/local/var/macports/build/_opt_local_var_macports_sources_rsync.macports.org_release_tarballs_ports_sysutils_lnav/lnav/work/lnav-0.12.0/tools' |
|---|
| 329 | :info:build /opt/local/bin/clang-mp-16 -I../src/third-party/doctest-root -isystem/opt/local/include/LegacySupport -I/opt/local/include -D_ISOC99_SOURCE -D__STDC_LIMIT_MACROS -D_GNU_SOURCE -DUSE_OS_TZDB=1 -DHAS_REMOTE_API=0 -I/opt/local/include -I/opt/local/include -I/opt/local/include -I/usr/local/include -L/opt/local/lib -Wl,-headerpad_max_install_names -L/opt/local/lib -lMacportsLegacySupport -arch x86_64 -L/opt/local/lib -L/opt/local/lib -L/opt/local/lib -L/usr/local/lib -L/usr/lib -g3 -o bin2c bin2c.c -lz -fPIE |
|---|
| 330 | :info:build make[1]: Leaving directory `/opt/local/var/macports/build/_opt_local_var_macports_sources_rsync.macports.org_release_tarballs_ports_sysutils_lnav/lnav/work/lnav-0.12.0/tools' |
|---|
| 331 | :info:build Making all in src |
|---|
| 332 | :info:build make[1]: Entering directory `/opt/local/var/macports/build/_opt_local_var_macports_sources_rsync.macports.org_release_tarballs_ports_sysutils_lnav/lnav/work/lnav-0.12.0/src' |
|---|
| 333 | :info:build ../tools/bin2c animals-json animals.json |
|---|
| 334 | :info:build ../tools/bin2c ansi-palette-json ansi-palette.json |
|---|
| 335 | :info:build ../tools/bin2c -n lnav_scripts builtin-scripts ./scripts/dhclient-summary.lnav ./scripts/docker-url-handler.lnav ./scripts/lnav-pop-view.lnav ./scripts/partition-by-boot.lnav ./scripts/piper-url-handler.lnav ./scripts/rename-stdin.lnav ./scripts/search-for.lnav |
|---|
| 336 | :info:build ../tools/bin2c -n lnav_sh_scripts builtin-sh-scripts ./scripts/com.vmware.btresolver.py ./scripts/dump-pid.sh ./scripts/pcap_log-converter.sh |
|---|
| 337 | :info:build ../tools/bin2c css-color-names-json css-color-names.json |
|---|
| 338 | :info:build ../tools/bin2c -n lnav_config_json default-config ./root-config.json ./keymaps/de-keymap.json ./keymaps/default-keymap.json ./keymaps/fr-keymap.json ./keymaps/sv-keymap.json ./keymaps/uk-keymap.json ./keymaps/us-keymap.json ./themes/default-theme.json ./themes/dracula.json ./themes/eldar.json ./themes/grayscale.json ./themes/monocai.json ./themes/night-owl.json ./themes/solarized-dark.json ./themes/solarized-light.json |
|---|
| 339 | :info:build ../tools/bin2c -n lnav_format_json default-formats ./formats/access_log.json ./formats/alb_log.json ./formats/block_log.json ./formats/bunyan_log.json ./formats/candlepin_log.json ./formats/choose_repo_log.json ./formats/cloudflare_log.json ./formats/cloudvm_ram_log.json ./formats/cups_log.json ./formats/dpkg_log.json ./formats/elb_log.json ./formats/engine_log.json ./formats/error_log.json ./formats/esx_syslog_log.json ./formats/fsck_hfs_log.json ./formats/github_events_log.json ./formats/glog_log.json ./formats/haproxy_log.json ./formats/java_log.json ./formats/journald_json_log.json ./formats/katello_log.json ./formats/nextcloud_log.json ./formats/openam_log.json ./formats/openamdb_log.json ./formats/openstack_log.json ./formats/page_log.json ./formats/papertrail_log.json ./formats/pcap_log.json ./formats/procstate_log.json ./formats/redis_log.json ./formats/snaplogic_log.json ./formats/sssd_log.json ./formats/strace_log.json ./formats/sudo_log.json ./formats/syslog_log.json ./formats/s3_log.json ./formats/tcf_log.json ./formats/tcsh_history.json ./formats/unifi_log.json ./formats/uwsgi_log.json ./formats/vdsm_log.json ./formats/vmk_log.json ./formats/vmw_log.json ./formats/vmw_vc_svc_log.json ./formats/vmw_py_log.json ./formats/vpostgres_log.json ./formats/xmlrpc_log.json |
|---|
| 340 | :info:build ../tools/bin2c diseases-json diseases.json |
|---|
| 341 | :info:build ../tools/bin2c emojis-json emojis.json |
|---|
| 342 | :info:build ../tools/bin2c words-json words.json |
|---|
| 343 | :info:build ../tools/bin2c help-md help.md |
|---|
| 344 | :info:build ../tools/bin2c init-sql init.sql |
|---|
| 345 | :info:build /opt/local/bin/clang-mp-16 -I../src/third-party/doctest-root -isystem/opt/local/include/LegacySupport -I/opt/local/include -D_ISOC99_SOURCE -D__STDC_LIMIT_MACROS -D_GNU_SOURCE -DUSE_OS_TZDB=1 -DHAS_REMOTE_API=0 -I/opt/local/include -I/opt/local/include -I/opt/local/include -I/usr/local/include -L/opt/local/lib -Wl,-headerpad_max_install_names -L/opt/local/lib -lMacportsLegacySupport -arch x86_64 -L/opt/local/lib -L/opt/local/lib -L/opt/local/lib -L/usr/local/lib -L/usr/lib -g3 -o ptimec ptimec.c -fPIE |
|---|
| 346 | :info:build ../tools/bin2c xml-entities-json xml-entities.json |
|---|
| 347 | :info:build ../tools/bin2c xterm-palette-json xterm-palette.json |
|---|
| 348 | :info:build ./ptimec "@%@" "%Y-%m-%d %H:%M:%S.%f%z" "%Y-%m-%d %H:%M:%S,%f%z" "%Y-%m-%d %H:%M:%S.%f %Z" "%Y-%m-%d %H:%M:%S,%f %Z" "%Y-%m-%d %H:%M:%S,%L%z" "%Y-%m-%d %H:%M:%S,%L %z" "%Y-%m-%d %H:%M:%S.%L%z" "%Y-%m-%d %H:%M:%S.%L %z" "%Y-%m-%d %H:%M:%S.%L %Z" "%Y-%m-%d %H:%M:%S,%L" "%Y-%m-%d %H:%M:%S.%L" "%Y-%m-%d %H:%M:%S%z" "%Y-%m-%d %H:%M:%S %z" "%Y-%m-%d %H:%M:%S:%L" "%Y-%m-%d %H:%M:%S" "%Y-%m-%d %H:%M" "%Y-%m-%dT%H:%M:%S %p %Z" "%Y-%m-%dT%H:%M:%S.%N%z" "%y-%m-%dT%H:%M:%S.%N%z" "%Y-%m-%dT%H:%M:%S.%f%z" "%y-%m-%dT%H:%M:%S.%f%z" "%Y-%m-%dT%H:%M:%S.%L%z" "%y-%m-%dT%H:%M:%S.%L%z" "%Y-%m-%dT%H:%M:%S%z" "%Y-%m-%dT%H:%M:%S" "%Y-%m-%dT%H:%M:%S%z" "%Y-%m-%dT%H:%M" "%Y/%m/%d %H:%M:%S %z" "%Y/%m/%d %H:%M:%S%z" "%Y/%m/%d %H:%M:%S.%f%z" "%Y/%m/%d %H:%M:%S.%f%Z" "%Y/%m/%d %H:%M:%S.%f %z" "%Y/%m/%d %H:%M:%S.%f %Z" "%Y/%m/%d %H:%M:%S.%f" "%Y/%m/%d %H:%M:%S.%L" "%Y/%m/%d %H:%M:%S" "%Y/%m/%d %H:%M" "%Y %b %d %a %H:%M:%S.%L" "%Y %b %d %H:%M:%S.%L" "%Y %b %d %H:%M:%S" "%a %b %d %H:%M:%S %Y" "%a %b %d %H:%M:%S.%f %Y" "%a %b %d %H:%M:%S:%f %Y" "%a %b %d %H:%M:%S %Z %Y" "%a %b %d %I:%M:%S %p %Z %Y" "%a %b %d %H:%M:%S " "%a %b %d %H:%M:%S.%L " "%a %b %d %H:%M " "%a %b %e %H:%M:%S %Z %Y" "%d/%b/%Y:%H:%M:%S %z" "%d-%b-%Y %H:%M:%S %z" "%d-%b-%Y %H:%M:%S %Z" "%d %b %Y %H:%M:%S" "%d %b %Y %H:%M:%S.%L%z" "%d %b %Y %H:%M:%S,%L%z" "%d %b %Y %H:%M:%S.%L" "%d %b %Y %H:%M:%S,%L" "%d %b %Y %H:%M" "%b %d %H:%M:%S" "%b %d %k:%M:%S" "%b %d %l:%M:%S" "%b %d %l:%M" "%b %e, %Y %l:%M:%S %p" "%b %d, %Y %l:%M:%S %p" "%m/%d/%Y %I:%M:%S:%L %p %Z" "%m/%d/%Y %I:%M:%S %p %Z" "%m/%d/%Y %l:%M:%S %p %Z" "%m/%d/%Y %I:%M:%S %p%z" "%m/%d/%Y %l:%M:%S %p%z" "%m/%e/%Y %l:%M:%S %p%z" "%m/%e/%Y %l:%M:%S %p %z" "%m/%e/%Y %I:%M:%S %p" "%m/%e/%Y %l:%M:%S%p" "%m/%d/%y %H:%M:%S" "%m/%d/%Y %H:%M:%S" "%d/%b/%Y %H:%M:%S" "%d/%b/%y %H:%M:%S" "%m%d %H:%M:%S" "%Y%m%d %H:%M:%S" "%Y%m%d.%H%M%S" "%H:%M:%S" "%H:%M:%S.%f" "%M:%S" "%m/%d %H:%M:%S" "%Y-%m-%d" "%Y-%m" "%Y/%m/%d" "%Y/%m" "%s.%f" > time_fmts.cc |
|---|
| 349 | :info:build /Library/Developer/CommandLineTools/usr/bin/make all-recursive |
|---|
| 350 | :info:build make[2]: Entering directory `/opt/local/var/macports/build/_opt_local_var_macports_sources_rsync.macports.org_release_tarballs_ports_sysutils_lnav/lnav/work/lnav-0.12.0/src' |
|---|
| 351 | :info:build Making all in fmtlib |
|---|
| 352 | :info:build make[3]: Entering directory `/opt/local/var/macports/build/_opt_local_var_macports_sources_rsync.macports.org_release_tarballs_ports_sysutils_lnav/lnav/work/lnav-0.12.0/src/fmtlib' |
|---|
| 353 | :info:build depbase=`echo format.o | sed 's|[^/]*$|.deps/&|;s|\.o$||'`;\ |
|---|
| 354 | :info:build /opt/local/bin/clang++-mp-16 -std=c++14 -DHAVE_CONFIG_H -I. -I../../src -I../../src/third-party/doctest-root -isystem/opt/local/include/LegacySupport -I/opt/local/include -D_ISOC99_SOURCE -D__STDC_LIMIT_MACROS -D_GNU_SOURCE -DUSE_OS_TZDB=1 -DHAS_REMOTE_API=0 -I/opt/local/include -I/opt/local/include -I/opt/local/include -I/usr/local/include -pipe -Os -stdlib=libc++ -arch x86_64 -pthread -MT format.o -MD -MP -MF $depbase.Tpo -c -o format.o format.cc &&\ |
|---|
| 355 | :info:build mv -f $depbase.Tpo $depbase.Po |
|---|
| 356 | :info:build depbase=`echo os.o | sed 's|[^/]*$|.deps/&|;s|\.o$||'`;\ |
|---|
| 357 | :info:build /opt/local/bin/clang++-mp-16 -std=c++14 -DHAVE_CONFIG_H -I. -I../../src -I../../src/third-party/doctest-root -isystem/opt/local/include/LegacySupport -I/opt/local/include -D_ISOC99_SOURCE -D__STDC_LIMIT_MACROS -D_GNU_SOURCE -DUSE_OS_TZDB=1 -DHAS_REMOTE_API=0 -I/opt/local/include -I/opt/local/include -I/opt/local/include -I/usr/local/include -pipe -Os -stdlib=libc++ -arch x86_64 -pthread -MT os.o -MD -MP -MF $depbase.Tpo -c -o os.o os.cc &&\ |
|---|
| 358 | :info:build mv -f $depbase.Tpo $depbase.Po |
|---|
| 359 | :info:build rm -f libcppfmt.a |
|---|
| 360 | :info:build ar cru libcppfmt.a format.o os.o |
|---|
| 361 | :info:build ranlib libcppfmt.a |
|---|
| 362 | :info:build make[3]: Leaving directory `/opt/local/var/macports/build/_opt_local_var_macports_sources_rsync.macports.org_release_tarballs_ports_sysutils_lnav/lnav/work/lnav-0.12.0/src/fmtlib' |
|---|
| 363 | :info:build Making all in third-party/base64/lib |
|---|
| 364 | :info:build make[3]: Entering directory `/opt/local/var/macports/build/_opt_local_var_macports_sources_rsync.macports.org_release_tarballs_ports_sysutils_lnav/lnav/work/lnav-0.12.0/src/third-party/base64/lib' |
|---|
| 365 | :info:build depbase=`echo lib.o | sed 's|[^/]*$|.deps/&|;s|\.o$||'`;\ |
|---|
| 366 | :info:build /opt/local/bin/clang-mp-16 -DHAVE_CONFIG_H -I. -I../../../../src -I../../../../src/third-party/doctest-root -isystem/opt/local/include/LegacySupport -I/opt/local/include -D_ISOC99_SOURCE -D__STDC_LIMIT_MACROS -D_GNU_SOURCE -DUSE_OS_TZDB=1 -DHAS_REMOTE_API=0 -I/opt/local/include -I/opt/local/include -I/opt/local/include -I/usr/local/include -pipe -Os -arch x86_64 -pthread -MT lib.o -MD -MP -MF $depbase.Tpo -c -o lib.o lib.c &&\ |
|---|
| 367 | :info:build mv -f $depbase.Tpo $depbase.Po |
|---|
| 368 | :info:build depbase=`echo arch/generic/codec.o | sed 's|[^/]*$|.deps/&|;s|\.o$||'`;\ |
|---|
| 369 | :info:build /opt/local/bin/clang-mp-16 -DHAVE_CONFIG_H -I. -I../../../../src -I../../../../src/third-party/doctest-root -isystem/opt/local/include/LegacySupport -I/opt/local/include -D_ISOC99_SOURCE -D__STDC_LIMIT_MACROS -D_GNU_SOURCE -DUSE_OS_TZDB=1 -DHAS_REMOTE_API=0 -I/opt/local/include -I/opt/local/include -I/opt/local/include -I/usr/local/include -pipe -Os -arch x86_64 -pthread -MT arch/generic/codec.o -MD -MP -MF $depbase.Tpo -c -o arch/generic/codec.o arch/generic/codec.c &&\ |
|---|
| 370 | :info:build mv -f $depbase.Tpo $depbase.Po |
|---|
| 371 | :info:build depbase=`echo tables/tables.o | sed 's|[^/]*$|.deps/&|;s|\.o$||'`;\ |
|---|
| 372 | :info:build /opt/local/bin/clang-mp-16 -DHAVE_CONFIG_H -I. -I../../../../src -I../../../../src/third-party/doctest-root -isystem/opt/local/include/LegacySupport -I/opt/local/include -D_ISOC99_SOURCE -D__STDC_LIMIT_MACROS -D_GNU_SOURCE -DUSE_OS_TZDB=1 -DHAS_REMOTE_API=0 -I/opt/local/include -I/opt/local/include -I/opt/local/include -I/usr/local/include -pipe -Os -arch x86_64 -pthread -MT tables/tables.o -MD -MP -MF $depbase.Tpo -c -o tables/tables.o tables/tables.c &&\ |
|---|
| 373 | :info:build mv -f $depbase.Tpo $depbase.Po |
|---|
| 374 | :info:build rm -f libbase64.a |
|---|
| 375 | :info:build ar cru libbase64.a lib.o arch/generic/codec.o tables/tables.o |
|---|
| 376 | :info:build ranlib libbase64.a |
|---|
| 377 | :info:build make[3]: Leaving directory `/opt/local/var/macports/build/_opt_local_var_macports_sources_rsync.macports.org_release_tarballs_ports_sysutils_lnav/lnav/work/lnav-0.12.0/src/third-party/base64/lib' |
|---|
| 378 | :info:build Making all in third-party/date/src |
|---|
| 379 | :info:build make[3]: Entering directory `/opt/local/var/macports/build/_opt_local_var_macports_sources_rsync.macports.org_release_tarballs_ports_sysutils_lnav/lnav/work/lnav-0.12.0/src/third-party/date/src' |
|---|
| 380 | :info:build depbase=`echo tz.o | sed 's|[^/]*$|.deps/&|;s|\.o$||'`;\ |
|---|
| 381 | :info:build /opt/local/bin/clang++-mp-16 -std=c++14 -DHAVE_CONFIG_H -I. -I../../../../src -I./../include -I../../../../src/third-party/doctest-root -isystem/opt/local/include/LegacySupport -I/opt/local/include -D_ISOC99_SOURCE -D__STDC_LIMIT_MACROS -D_GNU_SOURCE -DUSE_OS_TZDB=1 -DHAS_REMOTE_API=0 -I/opt/local/include -I/opt/local/include -I/opt/local/include -I/usr/local/include -pipe -Os -stdlib=libc++ -arch x86_64 -pthread -MT tz.o -MD -MP -MF $depbase.Tpo -c -o tz.o tz.cpp &&\ |
|---|
| 382 | :info:build mv -f $depbase.Tpo $depbase.Po |
|---|
| 383 | :info:build rm -f libdatepp.a |
|---|
| 384 | :info:build ar cru libdatepp.a tz.o |
|---|
| 385 | :info:build ranlib libdatepp.a |
|---|
| 386 | :info:build make[3]: Leaving directory `/opt/local/var/macports/build/_opt_local_var_macports_sources_rsync.macports.org_release_tarballs_ports_sysutils_lnav/lnav/work/lnav-0.12.0/src/third-party/date/src' |
|---|
| 387 | :info:build Making all in third-party/scnlib/src |
|---|
| 388 | :info:build make[3]: Entering directory `/opt/local/var/macports/build/_opt_local_var_macports_sources_rsync.macports.org_release_tarballs_ports_sysutils_lnav/lnav/work/lnav-0.12.0/src/third-party/scnlib/src' |
|---|
| 389 | :info:build depbase=`echo reader_float.o | sed 's|[^/]*$|.deps/&|;s|\.o$||'`;\ |
|---|
| 390 | :info:build /opt/local/bin/clang++-mp-16 -std=c++14 -DHAVE_CONFIG_H -I. -I../../../../src -I./../include -I./deps/fast_float/single_include -I../../../../src/third-party/doctest-root -isystem/opt/local/include/LegacySupport -I/opt/local/include -D_ISOC99_SOURCE -D__STDC_LIMIT_MACROS -D_GNU_SOURCE -DUSE_OS_TZDB=1 -DHAS_REMOTE_API=0 -I/opt/local/include -I/opt/local/include -I/opt/local/include -I/usr/local/include -pipe -Os -stdlib=libc++ -arch x86_64 -pthread -MT reader_float.o -MD -MP -MF $depbase.Tpo -c -o reader_float.o reader_float.cpp &&\ |
|---|
| 391 | :info:build mv -f $depbase.Tpo $depbase.Po |
|---|
| 392 | :info:build depbase=`echo locale.o | sed 's|[^/]*$|.deps/&|;s|\.o$||'`;\ |
|---|
| 393 | :info:build /opt/local/bin/clang++-mp-16 -std=c++14 -DHAVE_CONFIG_H -I. -I../../../../src -I./../include -I./deps/fast_float/single_include -I../../../../src/third-party/doctest-root -isystem/opt/local/include/LegacySupport -I/opt/local/include -D_ISOC99_SOURCE -D__STDC_LIMIT_MACROS -D_GNU_SOURCE -DUSE_OS_TZDB=1 -DHAS_REMOTE_API=0 -I/opt/local/include -I/opt/local/include -I/opt/local/include -I/usr/local/include -pipe -Os -stdlib=libc++ -arch x86_64 -pthread -MT locale.o -MD -MP -MF $depbase.Tpo -c -o locale.o locale.cpp &&\ |
|---|
| 394 | :info:build mv -f $depbase.Tpo $depbase.Po |
|---|
| 395 | :info:build depbase=`echo reader_int.o | sed 's|[^/]*$|.deps/&|;s|\.o$||'`;\ |
|---|
| 396 | :info:build /opt/local/bin/clang++-mp-16 -std=c++14 -DHAVE_CONFIG_H -I. -I../../../../src -I./../include -I./deps/fast_float/single_include -I../../../../src/third-party/doctest-root -isystem/opt/local/include/LegacySupport -I/opt/local/include -D_ISOC99_SOURCE -D__STDC_LIMIT_MACROS -D_GNU_SOURCE -DUSE_OS_TZDB=1 -DHAS_REMOTE_API=0 -I/opt/local/include -I/opt/local/include -I/opt/local/include -I/usr/local/include -pipe -Os -stdlib=libc++ -arch x86_64 -pthread -MT reader_int.o -MD -MP -MF $depbase.Tpo -c -o reader_int.o reader_int.cpp &&\ |
|---|
| 397 | :info:build mv -f $depbase.Tpo $depbase.Po |
|---|
| 398 | :info:build depbase=`echo file.o | sed 's|[^/]*$|.deps/&|;s|\.o$||'`;\ |
|---|
| 399 | :info:build /opt/local/bin/clang++-mp-16 -std=c++14 -DHAVE_CONFIG_H -I. -I../../../../src -I./../include -I./deps/fast_float/single_include -I../../../../src/third-party/doctest-root -isystem/opt/local/include/LegacySupport -I/opt/local/include -D_ISOC99_SOURCE -D__STDC_LIMIT_MACROS -D_GNU_SOURCE -DUSE_OS_TZDB=1 -DHAS_REMOTE_API=0 -I/opt/local/include -I/opt/local/include -I/opt/local/include -I/usr/local/include -pipe -Os -stdlib=libc++ -arch x86_64 -pthread -MT file.o -MD -MP -MF $depbase.Tpo -c -o file.o file.cpp &&\ |
|---|
| 400 | :info:build mv -f $depbase.Tpo $depbase.Po |
|---|
| 401 | :info:build depbase=`echo vscan.o | sed 's|[^/]*$|.deps/&|;s|\.o$||'`;\ |
|---|
| 402 | :info:build /opt/local/bin/clang++-mp-16 -std=c++14 -DHAVE_CONFIG_H -I. -I../../../../src -I./../include -I./deps/fast_float/single_include -I../../../../src/third-party/doctest-root -isystem/opt/local/include/LegacySupport -I/opt/local/include -D_ISOC99_SOURCE -D__STDC_LIMIT_MACROS -D_GNU_SOURCE -DUSE_OS_TZDB=1 -DHAS_REMOTE_API=0 -I/opt/local/include -I/opt/local/include -I/opt/local/include -I/usr/local/include -pipe -Os -stdlib=libc++ -arch x86_64 -pthread -MT vscan.o -MD -MP -MF $depbase.Tpo -c -o vscan.o vscan.cpp &&\ |
|---|
| 403 | :info:build mv -f $depbase.Tpo $depbase.Po |
|---|
| 404 | :info:build rm -f libscnlib.a |
|---|
| 405 | :info:build ar cru libscnlib.a reader_float.o locale.o reader_int.o file.o vscan.o |
|---|
| 406 | :info:build ranlib libscnlib.a |
|---|
| 407 | :info:build make[3]: Leaving directory `/opt/local/var/macports/build/_opt_local_var_macports_sources_rsync.macports.org_release_tarballs_ports_sysutils_lnav/lnav/work/lnav-0.12.0/src/third-party/scnlib/src' |
|---|
| 408 | :info:build Making all in pcrepp |
|---|
| 409 | :info:build make[3]: Entering directory `/opt/local/var/macports/build/_opt_local_var_macports_sources_rsync.macports.org_release_tarballs_ports_sysutils_lnav/lnav/work/lnav-0.12.0/src/pcrepp' |
|---|
| 410 | :info:build depbase=`echo pcre2pp.o | sed 's|[^/]*$|.deps/&|;s|\.o$||'`;\ |
|---|
| 411 | :info:build /opt/local/bin/clang++-mp-16 -std=c++14 -DHAVE_CONFIG_H -I. -I../../src -Wall -I../../src -I../../src/fmtlib -I../../src/third-party/scnlib/include -I../../src/third-party/doctest-root -isystem/opt/local/include/LegacySupport -I/opt/local/include -D_ISOC99_SOURCE -D__STDC_LIMIT_MACROS -D_GNU_SOURCE -DUSE_OS_TZDB=1 -DHAS_REMOTE_API=0 -I/opt/local/include -I/opt/local/include -I/opt/local/include -I/usr/local/include -pipe -Os -stdlib=libc++ -arch x86_64 -pthread -MT pcre2pp.o -MD -MP -MF $depbase.Tpo -c -o pcre2pp.o pcre2pp.cc &&\ |
|---|
| 412 | :info:build mv -f $depbase.Tpo $depbase.Po |
|---|
| 413 | :info:build rm -f libpcrepp.a |
|---|
| 414 | :info:build ar cru libpcrepp.a pcre2pp.o |
|---|
| 415 | :info:build ranlib libpcrepp.a |
|---|
| 416 | :info:build make[3]: Leaving directory `/opt/local/var/macports/build/_opt_local_var_macports_sources_rsync.macports.org_release_tarballs_ports_sysutils_lnav/lnav/work/lnav-0.12.0/src/pcrepp' |
|---|
| 417 | :info:build Making all in base |
|---|
| 418 | :info:build make[3]: Entering directory `/opt/local/var/macports/build/_opt_local_var_macports_sources_rsync.macports.org_release_tarballs_ports_sysutils_lnav/lnav/work/lnav-0.12.0/src/base' |
|---|
| 419 | :info:build depbase=`echo ansi_scrubber.o | sed 's|[^/]*$|.deps/&|;s|\.o$||'`;\ |
|---|
| 420 | :info:build /opt/local/bin/clang++-mp-16 -std=c++14 -DHAVE_CONFIG_H -I. -I../../src -Wall -I../../src/ -I../../src/third-party -I../../src/fmtlib -I../../src/third-party/date/include -I../../src/third-party/scnlib/include -I/opt/local/include -I../../src/third-party/doctest-root -isystem/opt/local/include/LegacySupport -I/opt/local/include -D_ISOC99_SOURCE -D__STDC_LIMIT_MACROS -D_GNU_SOURCE -DUSE_OS_TZDB=1 -DHAS_REMOTE_API=0 -I/opt/local/include -I/opt/local/include -I/opt/local/include -I/usr/local/include -pipe -Os -stdlib=libc++ -arch x86_64 -pthread -MT ansi_scrubber.o -MD -MP -MF $depbase.Tpo -c -o ansi_scrubber.o ansi_scrubber.cc &&\ |
|---|
| 421 | :info:build mv -f $depbase.Tpo $depbase.Po |
|---|
| 422 | :info:build depbase=`echo attr_line.o | sed 's|[^/]*$|.deps/&|;s|\.o$||'`;\ |
|---|
| 423 | :info:build /opt/local/bin/clang++-mp-16 -std=c++14 -DHAVE_CONFIG_H -I. -I../../src -Wall -I../../src/ -I../../src/third-party -I../../src/fmtlib -I../../src/third-party/date/include -I../../src/third-party/scnlib/include -I/opt/local/include -I../../src/third-party/doctest-root -isystem/opt/local/include/LegacySupport -I/opt/local/include -D_ISOC99_SOURCE -D__STDC_LIMIT_MACROS -D_GNU_SOURCE -DUSE_OS_TZDB=1 -DHAS_REMOTE_API=0 -I/opt/local/include -I/opt/local/include -I/opt/local/include -I/usr/local/include -pipe -Os -stdlib=libc++ -arch x86_64 -pthread -MT attr_line.o -MD -MP -MF $depbase.Tpo -c -o attr_line.o attr_line.cc &&\ |
|---|
| 424 | :info:build mv -f $depbase.Tpo $depbase.Po |
|---|
| 425 | :info:build depbase=`echo attr_line.builder.o | sed 's|[^/]*$|.deps/&|;s|\.o$||'`;\ |
|---|
| 426 | :info:build /opt/local/bin/clang++-mp-16 -std=c++14 -DHAVE_CONFIG_H -I. -I../../src -Wall -I../../src/ -I../../src/third-party -I../../src/fmtlib -I../../src/third-party/date/include -I../../src/third-party/scnlib/include -I/opt/local/include -I../../src/third-party/doctest-root -isystem/opt/local/include/LegacySupport -I/opt/local/include -D_ISOC99_SOURCE -D__STDC_LIMIT_MACROS -D_GNU_SOURCE -DUSE_OS_TZDB=1 -DHAS_REMOTE_API=0 -I/opt/local/include -I/opt/local/include -I/opt/local/include -I/usr/local/include -pipe -Os -stdlib=libc++ -arch x86_64 -pthread -MT attr_line.builder.o -MD -MP -MF $depbase.Tpo -c -o attr_line.builder.o attr_line.builder.cc &&\ |
|---|
| 427 | :info:build mv -f $depbase.Tpo $depbase.Po |
|---|
| 428 | :info:build depbase=`echo auto_fd.o | sed 's|[^/]*$|.deps/&|;s|\.o$||'`;\ |
|---|
| 429 | :info:build /opt/local/bin/clang++-mp-16 -std=c++14 -DHAVE_CONFIG_H -I. -I../../src -Wall -I../../src/ -I../../src/third-party -I../../src/fmtlib -I../../src/third-party/date/include -I../../src/third-party/scnlib/include -I/opt/local/include -I../../src/third-party/doctest-root -isystem/opt/local/include/LegacySupport -I/opt/local/include -D_ISOC99_SOURCE -D__STDC_LIMIT_MACROS -D_GNU_SOURCE -DUSE_OS_TZDB=1 -DHAS_REMOTE_API=0 -I/opt/local/include -I/opt/local/include -I/opt/local/include -I/usr/local/include -pipe -Os -stdlib=libc++ -arch x86_64 -pthread -MT auto_fd.o -MD -MP -MF $depbase.Tpo -c -o auto_fd.o auto_fd.cc &&\ |
|---|
| 430 | :info:build mv -f $depbase.Tpo $depbase.Po |
|---|
| 431 | :info:build depbase=`echo auto_pid.o | sed 's|[^/]*$|.deps/&|;s|\.o$||'`;\ |
|---|
| 432 | :info:build /opt/local/bin/clang++-mp-16 -std=c++14 -DHAVE_CONFIG_H -I. -I../../src -Wall -I../../src/ -I../../src/third-party -I../../src/fmtlib -I../../src/third-party/date/include -I../../src/third-party/scnlib/include -I/opt/local/include -I../../src/third-party/doctest-root -isystem/opt/local/include/LegacySupport -I/opt/local/include -D_ISOC99_SOURCE -D__STDC_LIMIT_MACROS -D_GNU_SOURCE -DUSE_OS_TZDB=1 -DHAS_REMOTE_API=0 -I/opt/local/include -I/opt/local/include -I/opt/local/include -I/usr/local/include -pipe -Os -stdlib=libc++ -arch x86_64 -pthread -MT auto_pid.o -MD -MP -MF $depbase.Tpo -c -o auto_pid.o auto_pid.cc &&\ |
|---|
| 433 | :info:build mv -f $depbase.Tpo $depbase.Po |
|---|
| 434 | :info:build depbase=`echo color_spaces.o | sed 's|[^/]*$|.deps/&|;s|\.o$||'`;\ |
|---|
| 435 | :info:build /opt/local/bin/clang++-mp-16 -std=c++14 -DHAVE_CONFIG_H -I. -I../../src -Wall -I../../src/ -I../../src/third-party -I../../src/fmtlib -I../../src/third-party/date/include -I../../src/third-party/scnlib/include -I/opt/local/include -I../../src/third-party/doctest-root -isystem/opt/local/include/LegacySupport -I/opt/local/include -D_ISOC99_SOURCE -D__STDC_LIMIT_MACROS -D_GNU_SOURCE -DUSE_OS_TZDB=1 -DHAS_REMOTE_API=0 -I/opt/local/include -I/opt/local/include -I/opt/local/include -I/usr/local/include -pipe -Os -stdlib=libc++ -arch x86_64 -pthread -MT color_spaces.o -MD -MP -MF $depbase.Tpo -c -o color_spaces.o color_spaces.cc &&\ |
|---|
| 436 | :info:build mv -f $depbase.Tpo $depbase.Po |
|---|
| 437 | :info:build depbase=`echo date_time_scanner.o | sed 's|[^/]*$|.deps/&|;s|\.o$||'`;\ |
|---|
| 438 | :info:build /opt/local/bin/clang++-mp-16 -std=c++14 -DHAVE_CONFIG_H -I. -I../../src -Wall -I../../src/ -I../../src/third-party -I../../src/fmtlib -I../../src/third-party/date/include -I../../src/third-party/scnlib/include -I/opt/local/include -I../../src/third-party/doctest-root -isystem/opt/local/include/LegacySupport -I/opt/local/include -D_ISOC99_SOURCE -D__STDC_LIMIT_MACROS -D_GNU_SOURCE -DUSE_OS_TZDB=1 -DHAS_REMOTE_API=0 -I/opt/local/include -I/opt/local/include -I/opt/local/include -I/usr/local/include -pipe -Os -stdlib=libc++ -arch x86_64 -pthread -MT date_time_scanner.o -MD -MP -MF $depbase.Tpo -c -o date_time_scanner.o date_time_scanner.cc &&\ |
|---|
| 439 | :info:build mv -f $depbase.Tpo $depbase.Po |
|---|
| 440 | :info:build depbase=`echo fs_util.o | sed 's|[^/]*$|.deps/&|;s|\.o$||'`;\ |
|---|
| 441 | :info:build /opt/local/bin/clang++-mp-16 -std=c++14 -DHAVE_CONFIG_H -I. -I../../src -Wall -I../../src/ -I../../src/third-party -I../../src/fmtlib -I../../src/third-party/date/include -I../../src/third-party/scnlib/include -I/opt/local/include -I../../src/third-party/doctest-root -isystem/opt/local/include/LegacySupport -I/opt/local/include -D_ISOC99_SOURCE -D__STDC_LIMIT_MACROS -D_GNU_SOURCE -DUSE_OS_TZDB=1 -DHAS_REMOTE_API=0 -I/opt/local/include -I/opt/local/include -I/opt/local/include -I/usr/local/include -pipe -Os -stdlib=libc++ -arch x86_64 -pthread -MT fs_util.o -MD -MP -MF $depbase.Tpo -c -o fs_util.o fs_util.cc &&\ |
|---|
| 442 | :info:build mv -f $depbase.Tpo $depbase.Po |
|---|
| 443 | :info:build depbase=`echo humanize.o | sed 's|[^/]*$|.deps/&|;s|\.o$||'`;\ |
|---|
| 444 | :info:build /opt/local/bin/clang++-mp-16 -std=c++14 -DHAVE_CONFIG_H -I. -I../../src -Wall -I../../src/ -I../../src/third-party -I../../src/fmtlib -I../../src/third-party/date/include -I../../src/third-party/scnlib/include -I/opt/local/include -I../../src/third-party/doctest-root -isystem/opt/local/include/LegacySupport -I/opt/local/include -D_ISOC99_SOURCE -D__STDC_LIMIT_MACROS -D_GNU_SOURCE -DUSE_OS_TZDB=1 -DHAS_REMOTE_API=0 -I/opt/local/include -I/opt/local/include -I/opt/local/include -I/usr/local/include -pipe -Os -stdlib=libc++ -arch x86_64 -pthread -MT humanize.o -MD -MP -MF $depbase.Tpo -c -o humanize.o humanize.cc &&\ |
|---|
| 445 | :info:build mv -f $depbase.Tpo $depbase.Po |
|---|
| 446 | :info:build depbase=`echo humanize.network.o | sed 's|[^/]*$|.deps/&|;s|\.o$||'`;\ |
|---|
| 447 | :info:build /opt/local/bin/clang++-mp-16 -std=c++14 -DHAVE_CONFIG_H -I. -I../../src -Wall -I../../src/ -I../../src/third-party -I../../src/fmtlib -I../../src/third-party/date/include -I../../src/third-party/scnlib/include -I/opt/local/include -I../../src/third-party/doctest-root -isystem/opt/local/include/LegacySupport -I/opt/local/include -D_ISOC99_SOURCE -D__STDC_LIMIT_MACROS -D_GNU_SOURCE -DUSE_OS_TZDB=1 -DHAS_REMOTE_API=0 -I/opt/local/include -I/opt/local/include -I/opt/local/include -I/usr/local/include -pipe -Os -stdlib=libc++ -arch x86_64 -pthread -MT humanize.network.o -MD -MP -MF $depbase.Tpo -c -o humanize.network.o humanize.network.cc &&\ |
|---|
| 448 | :info:build mv -f $depbase.Tpo $depbase.Po |
|---|
| 449 | :info:build depbase=`echo humanize.time.o | sed 's|[^/]*$|.deps/&|;s|\.o$||'`;\ |
|---|
| 450 | :info:build /opt/local/bin/clang++-mp-16 -std=c++14 -DHAVE_CONFIG_H -I. -I../../src -Wall -I../../src/ -I../../src/third-party -I../../src/fmtlib -I../../src/third-party/date/include -I../../src/third-party/scnlib/include -I/opt/local/include -I../../src/third-party/doctest-root -isystem/opt/local/include/LegacySupport -I/opt/local/include -D_ISOC99_SOURCE -D__STDC_LIMIT_MACROS -D_GNU_SOURCE -DUSE_OS_TZDB=1 -DHAS_REMOTE_API=0 -I/opt/local/include -I/opt/local/include -I/opt/local/include -I/usr/local/include -pipe -Os -stdlib=libc++ -arch x86_64 -pthread -MT humanize.time.o -MD -MP -MF $depbase.Tpo -c -o humanize.time.o humanize.time.cc &&\ |
|---|
| 451 | :info:build mv -f $depbase.Tpo $depbase.Po |
|---|
| 452 | :info:build depbase=`echo intern_string.o | sed 's|[^/]*$|.deps/&|;s|\.o$||'`;\ |
|---|
| 453 | :info:build /opt/local/bin/clang++-mp-16 -std=c++14 -DHAVE_CONFIG_H -I. -I../../src -Wall -I../../src/ -I../../src/third-party -I../../src/fmtlib -I../../src/third-party/date/include -I../../src/third-party/scnlib/include -I/opt/local/include -I../../src/third-party/doctest-root -isystem/opt/local/include/LegacySupport -I/opt/local/include -D_ISOC99_SOURCE -D__STDC_LIMIT_MACROS -D_GNU_SOURCE -DUSE_OS_TZDB=1 -DHAS_REMOTE_API=0 -I/opt/local/include -I/opt/local/include -I/opt/local/include -I/usr/local/include -pipe -Os -stdlib=libc++ -arch x86_64 -pthread -MT intern_string.o -MD -MP -MF $depbase.Tpo -c -o intern_string.o intern_string.cc &&\ |
|---|
| 454 | :info:build mv -f $depbase.Tpo $depbase.Po |
|---|
| 455 | :info:build fs_util.cc:91:15: error: use of undeclared identifier 'mkostemp'; did you mean 'mkstemps'? |
|---|
| 456 | :info:build if ((fd = mkostemp(pattern_copy, O_CLOEXEC)) == -1) { |
|---|
| 457 | :info:build ^~~~~~~~ |
|---|
| 458 | :info:build mkstemps |
|---|
| 459 | :info:build /usr/include/unistd.h:671:6: note: 'mkstemps' declared here |
|---|
| 460 | :info:build int mkstemps(char *, int); |
|---|
| 461 | :info:build ^ |
|---|
| 462 | :info:build depbase=`echo is_utf8.o | sed 's|[^/]*$|.deps/&|;s|\.o$||'`;\ |
|---|
| 463 | :info:build /opt/local/bin/clang++-mp-16 -std=c++14 -DHAVE_CONFIG_H -I. -I../../src -Wall -I../../src/ -I../../src/third-party -I../../src/fmtlib -I../../src/third-party/date/include -I../../src/third-party/scnlib/include -I/opt/local/include -I../../src/third-party/doctest-root -isystem/opt/local/include/LegacySupport -I/opt/local/include -D_ISOC99_SOURCE -D__STDC_LIMIT_MACROS -D_GNU_SOURCE -DUSE_OS_TZDB=1 -DHAS_REMOTE_API=0 -I/opt/local/include -I/opt/local/include -I/opt/local/include -I/usr/local/include -pipe -Os -stdlib=libc++ -arch x86_64 -pthread -MT is_utf8.o -MD -MP -MF $depbase.Tpo -c -o is_utf8.o is_utf8.cc &&\ |
|---|
| 464 | :info:build mv -f $depbase.Tpo $depbase.Po |
|---|
| 465 | :info:build 1 error generated. |
|---|
| 466 | :info:build make[3]: *** [fs_util.o] Error 1 |
|---|
| 467 | :info:build make[3]: *** Waiting for unfinished jobs.... |
|---|
| 468 | :info:build make[3]: Leaving directory `/opt/local/var/macports/build/_opt_local_var_macports_sources_rsync.macports.org_release_tarballs_ports_sysutils_lnav/lnav/work/lnav-0.12.0/src/base' |
|---|
| 469 | :info:build make[2]: *** [all-recursive] Error 1 |
|---|
| 470 | :info:build make[2]: Leaving directory `/opt/local/var/macports/build/_opt_local_var_macports_sources_rsync.macports.org_release_tarballs_ports_sysutils_lnav/lnav/work/lnav-0.12.0/src' |
|---|
| 471 | :info:build make[1]: *** [all] Error 2 |
|---|
| 472 | :info:build make[1]: Leaving directory `/opt/local/var/macports/build/_opt_local_var_macports_sources_rsync.macports.org_release_tarballs_ports_sysutils_lnav/lnav/work/lnav-0.12.0/src' |
|---|
| 473 | :info:build make: *** [all-recursive] Error 1 |
|---|
| 474 | :info:build make: Leaving directory `/opt/local/var/macports/build/_opt_local_var_macports_sources_rsync.macports.org_release_tarballs_ports_sysutils_lnav/lnav/work/lnav-0.12.0' |
|---|
| 475 | :info:build Command failed: cd "/opt/local/var/macports/build/_opt_local_var_macports_sources_rsync.macports.org_release_tarballs_ports_sysutils_lnav/lnav/work/lnav-0.12.0" && /usr/bin/make -j8 -w all |
|---|
| 476 | :info:build Exit code: 2 |
|---|
| 477 | :error:build Failed to build lnav: command execution failed |
|---|
| 478 | :debug:build Error code: CHILDSTATUS 28214 2 |
|---|
| 479 | :debug:build Backtrace: command execution failed |
|---|
| 480 | :debug:build while executing |
|---|
| 481 | :debug:build "system {*}$notty {*}$callback {*}$nice $fullcmdstring" |
|---|
| 482 | :debug:build invoked from within |
|---|
| 483 | :debug:build "command_exec -callback portprogress::target_progress_callback build" |
|---|
| 484 | :debug:build (procedure "portbuild::build_main" line 10) |
|---|
| 485 | :debug:build invoked from within |
|---|
| 486 | :debug:build "$procedure $targetname" |
|---|
| 487 | :error:build See /opt/local/var/macports/logs/_opt_local_var_macports_sources_rsync.macports.org_release_tarballs_ports_sysutils_lnav/lnav/main.log for details. |
|---|