Changes between Initial Version and Version 8 of Ticket #36790


Ignore:
Timestamp:
Oct 30, 2012, 11:10:08 AM (8 years ago)
Author:
mkae (Marko Käning)
Comment:

Please make use code block formatting.

Legend:

Unmodified
Added
Removed
Modified
  • Ticket #36790

    • Property Cc pixilla@… mparchet@… mtughan@… pope@… mk@… added
    • Property Keywords strigi 0.7.7 fails to build removed
    • Property Owner changed from macports-tickets@… to clubjuggler@…
  • Ticket #36790 – Description

    initial v8  
    11Did an upgrade on my MacPorts and during updating strigi I receive some errors:
    2 
    3 .....
    4 :info:build /opt/local/bin/cmake -E cmake_progress_report [[br]] /opt/local/var/macports/build/_opt_local_var_macports_sources_rsync.macports.org_release_tarballs_ports_devel_strigi/strigi/work/build/CMakeFiles[[br]]
    5 :info:build make[2]: *** [libstreamanalyzer/plugins/endplugins/CMakeFiles/ffmpeg.dir/ffmpegendanalyzer.cpp.o] Error 1[[br]]
    6 :info:build make[2]: Leaving directory [[br]] `/opt/local/var/macports/build/_opt_local_var_macports_sources_rsync.macports.org_release_tarballs_ports_devel_strigi/strigi/work/build'[[br]]
    7 :info:build make[1]: *** [libstreamanalyzer/plugins/endplugins/CMakeFiles/ffmpeg.dir/all] Error 2[[br]]
    8 :info:build make[1]: *** Waiting for unfinished jobs....[[br]]
    9 :info:build Linking CXX shared module strigiea_riff.so[[br]]
    10 .......[[br]]
    11 :info:build make[1]: Leaving directory[[br]]
    12 `/opt/local/var/macports/build/_opt_local_var_macports_sources_rsync.macports.org_release_tarballs_ports_devel_strigi/strigi/work/build'[[br]]
    13 :info:build make: *** [all] Error 2[[br]]
    14 :info:build make: Leaving directory[[br]]
    15 `/opt/local/var/macports/build/_opt_local_var_macports_sources_rsync.macports.org_release_tarballs_ports_devel_strigi/strigi/work/build'[[br]]
    16 :info:build Command failed:  cd[[br]]
    17 "/opt/local/var/macports/build/_opt_local_var_macports_sources_rsync.macports.org_release_tarballs_ports_devel_strigi/strigi/work/build" && /usr/bin/make -j4 -w all[[br]]
    18 :info:build Exit code: 2[[br]]
    19 :error:build org.macports.build for port strigi returned: command execution failed[[br]]
    20 :debug:build Error code: CHILDSTATUS 9843 2[[br]]
    21 :debug:build Backtrace: command execution failed[[br]]
    22     while executing[[br]]
    23 "system -nice 0 $fullcmdstring"[[br]]
    24     ("eval" body line 1)[[br]]
    25     invoked from within[[br]]
    26 "eval system $notty $nice \$fullcmdstring"[[br]]
    27     invoked from within[[br]]
    28 "command_exec build"[[br]]
    29     (procedure "portbuild::build_main" line 8)[[br]]
    30     invoked from within[[br]]
    31 "$procedure $targetname"[[br]]
    32 :info:build Warning: targets not executed for strigi: org.macports.install org.macports.build org.macports.destroot[[br]]
    33 :notice:build Please see the log file for port strigi for details:[[br]]
     2{{{
     3:info:build /opt/local/bin/cmake -E cmake_progress_report /opt/local/var/macports/build/_opt_local_var_macports_sources_rsync.macports.org_release_tarballs_ports_devel_strigi/strigi/work/build/CMakeFiles
     4:info:build make[2]: *** [libstreamanalyzer/plugins/endplugins/CMakeFiles/ffmpeg.dir/ffmpegendanalyzer.cpp.o] Error 1
     5:info:build make[2]: Leaving directory  `/opt/local/var/macports/build/_opt_local_var_macports_sources_rsync.macports.org_release_tarballs_ports_devel_strigi/strigi/work/build'[[br]]
     6:info:build make[1]: *** [libstreamanalyzer/plugins/endplugins/CMakeFiles/ffmpeg.dir/all] Error 2
     7:info:build make[1]: *** Waiting for unfinished jobs....
     8:info:build Linking CXX shared module strigiea_riff.so
     9.......
     10:info:build make[1]: Leaving directory
     11`/opt/local/var/macports/build/_opt_local_var_macports_sources_rsync.macports.org_release_tarballs_ports_devel_strigi/strigi/work/build'
     12:info:build make: *** [all] Error 2
     13:info:build make: Leaving directory
     14`/opt/local/var/macports/build/_opt_local_var_macports_sources_rsync.macports.org_release_tarballs_ports_devel_strigi/strigi/work/build'
     15:info:build Command failed:  cd
     16"/opt/local/var/macports/build/_opt_local_var_macports_sources_rsync.macports.org_release_tarballs_ports_devel_strigi/strigi/work/build" && /usr/bin/make -j4 -w all
     17:info:build Exit code: 2
     18:error:build org.macports.build for port strigi returned: command execution failed
     19:debug:build Error code: CHILDSTATUS 9843 2
     20:debug:build Backtrace: command execution failed
     21    while executing
     22    "system -nice 0 $fullcmdstring"
     23        ("eval" body line 1)
     24            invoked from within
     25            "eval system $notty $nice \$fullcmdstring"
     26                invoked from within
     27                "command_exec build"
     28                    (procedure "portbuild::build_main" line 8)
     29                        invoked from within
     30                        "$procedure $targetname"
     31                        :info:build Warning: targets not executed for strigi: org.macports.install org.macports.build org.macports.destroot
     32                        :notice:build Please see the log file for port strigi for details:}}}