New Ticket     Tickets     Wiki     Browse Source     Timeline     Roadmap     Ticket Reports     Search
Last modified 7 years ago Last modified on 09/09/09 12:22:05

Snow Leopard Problems

General Issues

First of all, please read Migration.

Tickets for Broken Ports

#21853
mzscheme doesn't build under Snow Leopard or later
#22311
airport 0.1 Doesn't work in Snow Leopard
#24261
Strategoxt 0.17pre18253 build failure on Snow Leopard
#25740
Tomcat5 fails to build on Snow Leopard
#29476
sbcl +threads does not compile maxima (snow leopard, x86_64)
#34592
ImageMagick: do not link with linkclparser.dylib on Snow Leopard
#36194
hellanzb doesn't start (Snow Leopard 10.6.8) - previous fix not worling
#40223
virtualbox: 4.2.16 build fails on Snow Leopard
#42779
asn1c @0.9.24 compile fails due to missing symbols on Snow Leopard
#43267
glade @3.16.1: crashes on Snow Leopard
#45180
fswatch: build fails on Snow Leopard
#45291
defect: valgrind 3.10 does not built on Snow Leopard/Mac OS X 10.5.8 because libcoregrind_amd64_darwin_a-syswrap-darwin.o has no symbols
#45625
QtCurve 1.8.18_0 fails to build on Snow Leopard
#46851
adns build fails on 10.6 snow leopard
#50118
tesseract-3.04.00 | Snow Leopard 10.6.8 | long integers in helper.h file
#50678
makeicns does not build on Snow Leopard with libc++
#50713
unRAR 5.2.7 does nor build on Mac OS X 10.6.8, Snow Leopard, because "‘mprintf’ was not declared in this scope"
#50881
Using gcj 5.3.0 on Mac OS X 10.6.8, Snow Leopard, on a Java source file leads to an error
#50962
ghc 7.8.3 | on Snow Leopard | bus error: make/package-data.mk
#51099
Tomcat6 won't build on Mac OS X 10.6.8, Snow Leopard, because of missing tomcat-native.tar.gz file
#51380
p5-b-c @1.54: broken on Snow Leopard: previous declaration of ‘I64’ was here
#51520
llvm-3.9 @3.9-r270400_0+assertions+debug build failure on snow leopard due to missing strnlen function - and fix
#52008
aria2 @1.24.0 Snow Leopard build error related to AppleTLSContext.cc; and fix

#20309
qt4-x11 doesn't support 10.6 or later
#25513
tokyocabinet +debug: library not found for -lcrt0.o
#34990
shogun: Undefined symbols: _drot_ _dswap_ __gfortran_concat_string _dgemm_ etc.
#35887
xrg: XRGAppDelegate.m:82: error: request for member 'frame' in something not a structure or union
#36667
HandBrakeCLI @0.10.0_0: cannot link to libiconv
#37402
phantomjs: cc1plus: error: unrecognized command line option "-mavx"
#38493
rethinkdb: error: thread-local storage is unsupported for the current target
#38958
R @3.0.0_0: build failure on OS X 10.6.8
#40090
log4cxx @0.10.0: Undefined local symbol L318
#40112
Julius 4.2.3 fails to upgrade non-universal to universal on 10.6
#40494
aria2 @1.18.0: requires C++11 support
#40807
graphviz @2.34.0: dot hangs when generating doxymentation on 10.6
#44049
enblend: fails to build on 10.6
#46563
sslh 1.16 doesn't build on 10.6
#47301
aircrack-ng @1.2-rc1: Undefined symbols _strnlen _dprintf
#50009
rust should be made available for MacOSX 10.6
#50399
py-bob-io-base, py-bob-sp, py-bob-math: build fails during setup.py on 10.6 buildbot
#50736
org-mode @8.3.3, org-mode-devel @devel: emacs-24.5 hangs with 100% CPU use
#50737
Can't install camlimages (libcxx)
#50828
wxWidgets-3.0-libcxx on 10.6 buildbot
#50957
panda: broken on 10.6
#51634
libgomp configure error os x 10.6 gcc-5.4.0
#51686
bitcoin snowleopard install error
#51982
gcc5 fails to build on snowleopard
#52016
webkit2-gtk @2.12.3_0: configure fails on 10.6 due to old ruby - requires 1.9 or later
#52045
jsoncpp @1.7.4: unrecognized command line option "-std=c++11"
#52058
netcdf @4.4.1: error: redefinition of typedef ‘DCEparsestate’
#52067
lnav @0.8.1_1: no matching function for call to ‘getline(char**, size_t*, FILE*&)’

#20909
ncid-0.74 sip2ncid broken on 64-bit platforms