Ticket #26952: gimp-app-build.log

File gimp-app-build.log, 17.3 KB (added by hanche, 10 years ago)

Build log with -d flag

Line 
1#; port clean --all gimp-app
2--->  Cleaning gimp-app
3#; port extract gimp-app
4--->  Computing dependencies for gimp-app
5--->  Fetching gimp-app
6--->  Attempting to fetch ScriptExec.tar.gz from http://sunet.dl.sourceforge.net/gimp-app
7--->  Attempting to fetch gimp.app.skel.tar.gz from http://sunet.dl.sourceforge.net/gimp-app
8--->  Verifying checksum(s) for gimp-app
9--->  Extracting gimp-app
10#; port -d build gimp-app
11DEBUG: Changing to port directory: /opt/local/var/macports/sources/rsync.macports.org/release/ports/aqua/gimp-app
12DEBUG: OS darwin/10.4.0 (Mac OS X 10.6) arch i386
13DEBUG: org.macports.load registered provides 'load', a pre-existing procedure. Target override will not be provided
14DEBUG: org.macports.unload registered provides 'unload', a pre-existing procedure. Target override will not be provided
15DEBUG: org.macports.distfiles registered provides 'distfiles', a pre-existing procedure. Target override will not be provided
16DEBUG: Using group file /opt/local/var/macports/sources/rsync.macports.org/release/ports/_resources/port1.0/group/xcode-1.0.tcl
17DEBUG: Re-registering default for use_configure
18DEBUG: Re-registering default for universal_variant
19DEBUG: Re-registering default for build.pre_args
20DEBUG: Re-registering default for build.target
21DEBUG: Re-registering default for destroot.pre_args
22DEBUG: Re-registering default for destroot.target
23DEBUG: Re-registering default for destroot.destdir
24DEBUG: Reading variant descriptions from /opt/local/var/macports/sources/rsync.macports.org/release/ports/_resources/port1.0/variant_descriptions.conf
25DEBUG: universal_variant is false, so not adding the default universal variant
26DEBUG: Starting logging for gimp-app
27--->  Computing dependencies for gimp-app
28DEBUG: Executing org.macports.main (gimp-app)
29DEBUG: Skipping completed org.macports.fetch (gimp-app)
30DEBUG: Skipping completed org.macports.checksum (gimp-app)
31DEBUG: Skipping completed org.macports.extract (gimp-app)
32DEBUG: patch phase started at Fri Oct 22 22:32:26 CEST 2010
33DEBUG: Executing proc-pre-org.macports.patch-patch-0
34DEBUG: delete: /opt/local/var/macports/build/_opt_local_var_macports_sources_rsync.macports.org_release_ports_aqua_gimp-app/work/Gimp.app/Contents/Info.plist
35xinstall: /opt/local/var/macports/sources/rsync.macports.org/release/ports/aqua/gimp-app/files/Info.plist -> /opt/local/var/macports/build/_opt_local_var_macports_sources_rsync.macports.org_release_ports_aqua_gimp-app/work/Gimp.app/Contents/Info.plist
36DEBUG: delete: /opt/local/var/macports/build/_opt_local_var_macports_sources_rsync.macports.org_release_ports_aqua_gimp-app/work/Gimp.app/Contents/PkgInfo
37xinstall: /opt/local/var/macports/sources/rsync.macports.org/release/ports/aqua/gimp-app/files/PkgInfo -> /opt/local/var/macports/build/_opt_local_var_macports_sources_rsync.macports.org_release_ports_aqua_gimp-app/work/Gimp.app/Contents/PkgInfo
38DEBUG: delete: /opt/local/var/macports/build/_opt_local_var_macports_sources_rsync.macports.org_release_ports_aqua_gimp-app/work/Gimp.app/Contents/Resources/script
39xinstall: /opt/local/var/macports/sources/rsync.macports.org/release/ports/aqua/gimp-app/files/script -> /opt/local/var/macports/build/_opt_local_var_macports_sources_rsync.macports.org_release_ports_aqua_gimp-app/work/Gimp.app/Contents/Resources/script
40DEBUG: Executing org.macports.patch (gimp-app)
41--->  Applying patches to gimp-app
42--->  Applying /opt/local/var/macports/sources/rsync.macports.org/release/ports/aqua/gimp-app/files/patch-main.c.diff
43DEBUG: Environment: CPATH='/opt/local/include' CC_PRINT_OPTIONS_FILE='/opt/local/var/macports/build/_opt_local_var_macports_sources_rsync.macports.org_release_ports_aqua_gimp-app/work/.CC_PRINT_OPTIONS' LIBRARY_PATH='/opt/local/lib' CC_PRINT_OPTIONS='YES' MACOSX_DEPLOYMENT_TARGET='10.6'
44DEBUG: Assembled command: 'cd "/opt/local/var/macports/build/_opt_local_var_macports_sources_rsync.macports.org_release_ports_aqua_gimp-app/work/ScriptExec" && /usr/bin/patch -p0'
45patching file main.c
46DEBUG: Executing proc-post-org.macports.patch-patch-0
47--->  Configuring gimp-app
48DEBUG: Using compiler 'Mac OS X gcc 4.2'
49DEBUG: configure phase started at Fri Oct 22 22:32:26 CEST 2010
50DEBUG: Executing org.macports.configure (gimp-app)
51--->  Building gimp-app
52DEBUG: build phase started at Fri Oct 22 22:32:26 CEST 2010
53DEBUG: Executing proc-pre-org.macports.build-build-0
54(NOTE: project ScriptExec was written by an older Xcode version (39) -- temporarily upgrading it (without modifying project file))
55
56
57=== CLEAN NATIVE TARGET ScriptExec OF PROJECT ScriptExec WITH THE DEFAULT CONFIGURATION (Default) ===
58Check dependencies
59Clean.Remove clean build/Default/ScriptExec.app
60    /bin/rm -rf /opt/local/var/macports/build/_opt_local_var_macports_sources_rsync.macports.org_release_ports_aqua_gimp-app/work/ScriptExec/build/Default/ScriptExec.app
61
62Clean.Remove clean /var/folders/zz/zzzivhrRnAmviuee+++++++++++/-Caches-/com.apple.Xcode.0/SharedPrecompiledHeaders/ScriptExec_Prefix-eambjzimyyjxqdbnehsrhulsrtsw/ScriptExec_Prefix.pch.gch
63    /bin/rm -rf /var/folders/zz/zzzivhrRnAmviuee+++++++++++/-Caches-/com.apple.Xcode.0/SharedPrecompiledHeaders/ScriptExec_Prefix-eambjzimyyjxqdbnehsrhulsrtsw/ScriptExec_Prefix.pch.gch
64
65Clean.Remove clean build/ScriptExec.build/Default/ScriptExec.build
66    /bin/rm -rf /opt/local/var/macports/build/_opt_local_var_macports_sources_rsync.macports.org_release_ports_aqua_gimp-app/work/ScriptExec/build/ScriptExec.build/Default/ScriptExec.build
67
68** CLEAN SUCCEEDED **
69
70DEBUG: Executing org.macports.build (gimp-app)
71DEBUG: Assembled command: 'cd "/opt/local/var/macports/build/_opt_local_var_macports_sources_rsync.macports.org_release_ports_aqua_gimp-app/work/ScriptExec" && /usr/bin/xcodebuild  -alltargets -configuration Deployment build OBJROOT=build/ SYMROOT=build/ MACOSX_DEPLOYMENT_TARGET=10.6 ARCHS=x86_64 SDKROOT="" '
72(NOTE: project ScriptExec was written by an older Xcode version (39) -- temporarily upgrading it (without modifying project file))
73
74Build settings from command line:
75    ARCHS = x86_64
76    MACOSX_DEPLOYMENT_TARGET = 10.6
77    OBJROOT = build/
78    SDKROOT =
79    SYMROOT = build/
80
81
82=== BUILD NATIVE TARGET ScriptExec OF PROJECT ScriptExec WITH CONFIGURATION Deployment ===
83Check dependencies
84ProcessInfoPlistFile build/Deployment/ScriptExec.app/Contents/Info.plist Info.plist
85    cd /opt/local/var/macports/build/_opt_local_var_macports_sources_rsync.macports.org_release_ports_aqua_gimp-app/work/ScriptExec
86    builtin-infoPlistUtility Info.plist -genpkginfo /opt/local/var/macports/build/_opt_local_var_macports_sources_rsync.macports.org_release_ports_aqua_gimp-app/work/ScriptExec/build/Deployment/ScriptExec.app/Contents/PkgInfo -expandbuildsettings -platform macosx -o /opt/local/var/macports/build/_opt_local_var_macports_sources_rsync.macports.org_release_ports_aqua_gimp-app/work/ScriptExec/build/Deployment/ScriptExec.app/Contents/Info.plist
87
88CopyStringsFile build/Deployment/ScriptExec.app/Contents/Resources/English.lproj/InfoPlist.strings English.lproj/InfoPlist.strings
89    cd /opt/local/var/macports/build/_opt_local_var_macports_sources_rsync.macports.org_release_ports_aqua_gimp-app/work/ScriptExec
90    setenv ICONV /usr/bin/iconv
91    /Developer/Library/Xcode/Plug-ins/CoreBuildTasks.xcplugin/Contents/Resources/copystrings --validate --inputencoding utf-16 --outputencoding UTF-16 English.lproj/InfoPlist.strings --outdir /opt/local/var/macports/build/_opt_local_var_macports_sources_rsync.macports.org_release_ports_aqua_gimp-app/work/ScriptExec/build/Deployment/ScriptExec.app/Contents/Resources/English.lproj
92
93StripNIB MenuBar.nib
94    cd /opt/local/var/macports/build/_opt_local_var_macports_sources_rsync.macports.org_release_ports_aqua_gimp-app/work/ScriptExec
95    /Developer/usr/bin/ibtool --strip /opt/local/var/macports/build/_opt_local_var_macports_sources_rsync.macports.org_release_ports_aqua_gimp-app/work/ScriptExec/build/Deployment/ScriptExec.app/Contents/Resources/MenuBar.nib --output-format human-readable-text /opt/local/var/macports/build/_opt_local_var_macports_sources_rsync.macports.org_release_ports_aqua_gimp-app/work/ScriptExec/MenuBar.nib
96
97CpResource build/Deployment/ScriptExec.app/Contents/Resources/script script
98    cd /opt/local/var/macports/build/_opt_local_var_macports_sources_rsync.macports.org_release_ports_aqua_gimp-app/work/ScriptExec
99    /Developer/Library/PrivateFrameworks/DevToolsCore.framework/Resources/pbxcp -exclude .DS_Store -exclude CVS -exclude .svn -strip-debug-symbols -resolve-src-symlinks /opt/local/var/macports/build/_opt_local_var_macports_sources_rsync.macports.org_release_ports_aqua_gimp-app/work/ScriptExec/script /opt/local/var/macports/build/_opt_local_var_macports_sources_rsync.macports.org_release_ports_aqua_gimp-app/work/ScriptExec/build/Deployment/ScriptExec.app/Contents/Resources
100
101CpResource build/Deployment/ScriptExec.app/Contents/Resources/openDoc openDoc
102    cd /opt/local/var/macports/build/_opt_local_var_macports_sources_rsync.macports.org_release_ports_aqua_gimp-app/work/ScriptExec
103    /Developer/Library/PrivateFrameworks/DevToolsCore.framework/Resources/pbxcp -exclude .DS_Store -exclude CVS -exclude .svn -strip-debug-symbols -resolve-src-symlinks /opt/local/var/macports/build/_opt_local_var_macports_sources_rsync.macports.org_release_ports_aqua_gimp-app/work/ScriptExec/openDoc /opt/local/var/macports/build/_opt_local_var_macports_sources_rsync.macports.org_release_ports_aqua_gimp-app/work/ScriptExec/build/Deployment/ScriptExec.app/Contents/Resources
104
105CompileC build/ScriptExec.build/Deployment/ScriptExec.build/Objects-normal/x86_64/main.o main.c normal x86_64 c com.apple.compilers.gcc.4_2
106    cd /opt/local/var/macports/build/_opt_local_var_macports_sources_rsync.macports.org_release_ports_aqua_gimp-app/work/ScriptExec
107    setenv LANG en_US.US-ASCII
108    /Developer/usr/bin/gcc-4.2 -x c -arch x86_64 -fmessage-length=0 -pipe -Wno-trigraphs -fpascal-strings -fasm-blocks -Os -mdynamic-no-pic -fvisibility=hidden -mmacosx-version-min=10.6 -I/opt/local/var/macports/build/_opt_local_var_macports_sources_rsync.macports.org_release_ports_aqua_gimp-app/work/ScriptExec/build/ScriptExec.build/Deployment/ScriptExec.build/ScriptExec.hmap -Wmost -Wno-four-char-constants -Wno-unknown-pragmas -F/opt/local/var/macports/build/_opt_local_var_macports_sources_rsync.macports.org_release_ports_aqua_gimp-app/work/ScriptExec/build/Deployment -I/opt/local/var/macports/build/_opt_local_var_macports_sources_rsync.macports.org_release_ports_aqua_gimp-app/work/ScriptExec/build/Deployment/include -I/opt/local/var/macports/build/_opt_local_var_macports_sources_rsync.macports.org_release_ports_aqua_gimp-app/work/ScriptExec/build/ScriptExec.build/Deployment/ScriptExec.build/DerivedSources/x86_64 -I/opt/local/var/macports/build/_opt_local_var_macports_sources_rsync.macports.org_release_ports_aqua_gimp-app/work/ScriptExec/build/ScriptExec.build/Deployment/ScriptExec.build/DerivedSources -include /var/folders/zz/zzzivhrRnAmviuee+++++++++++/-Caches-/com.apple.Xcode.0/SharedPrecompiledHeaders/ScriptExec_Prefix-fjqslffpxdgvupftqlldkqzqbvow/ScriptExec_Prefix.pch -c /opt/local/var/macports/build/_opt_local_var_macports_sources_rsync.macports.org_release_ports_aqua_gimp-app/work/ScriptExec/main.c -o /opt/local/var/macports/build/_opt_local_var_macports_sources_rsync.macports.org_release_ports_aqua_gimp-app/work/ScriptExec/build/ScriptExec.build/Deployment/ScriptExec.build/Objects-normal/x86_64/main.o
109
110cc1: error: /var/folders/zz/zzzivhrRnAmviuee+++++++++++/-Caches-/com.apple.Xcode.0/SharedPrecompiledHeaders/ScriptExec_Prefix-fjqslffpxdgvupftqlldkqzqbvow/ScriptExec_Prefix.pch: No such file or directory
111cc1: error: one or more PCH files were found, but they were invalid
112cc1: error: use -Winvalid-pch for more information
113/opt/local/var/macports/build/_opt_local_var_macports_sources_rsync.macports.org_release_ports_aqua_gimp-app/work/ScriptExec/main.c: In function 'main':
114/opt/local/var/macports/build/_opt_local_var_macports_sources_rsync.macports.org_release_ports_aqua_gimp-app/work/ScriptExec/main.c:120: warning: implicit declaration of function 'InitCursor'
115/opt/local/var/macports/build/_opt_local_var_macports_sources_rsync.macports.org_release_ports_aqua_gimp-app/work/ScriptExec/main.c:145: warning: implicit declaration of function 'RunApplicationEventLoop'
116/opt/local/var/macports/build/_opt_local_var_macports_sources_rsync.macports.org_release_ports_aqua_gimp-app/work/ScriptExec/main.c: In function 'GetParameters':
117/opt/local/var/macports/build/_opt_local_var_macports_sources_rsync.macports.org_release_ports_aqua_gimp-app/work/ScriptExec/main.c:218: warning: pointer targets in passing argument 2 of '__builtin___strcpy_chk' differ in signedness
118/opt/local/var/macports/build/_opt_local_var_macports_sources_rsync.macports.org_release_ports_aqua_gimp-app/work/ScriptExec/main.c:218: warning: pointer targets in passing argument 2 of '__inline_strcpy_chk' differ in signedness
119/opt/local/var/macports/build/_opt_local_var_macports_sources_rsync.macports.org_release_ports_aqua_gimp-app/work/ScriptExec/main.c:220: warning: pointer targets in assignment differ in signedness
120/opt/local/var/macports/build/_opt_local_var_macports_sources_rsync.macports.org_release_ports_aqua_gimp-app/work/ScriptExec/main.c:223: warning: pointer targets in passing argument 2 of '__builtin___strcpy_chk' differ in signedness
121/opt/local/var/macports/build/_opt_local_var_macports_sources_rsync.macports.org_release_ports_aqua_gimp-app/work/ScriptExec/main.c:223: warning: pointer targets in passing argument 2 of '__inline_strcpy_chk' differ in signedness
122/opt/local/var/macports/build/_opt_local_var_macports_sources_rsync.macports.org_release_ports_aqua_gimp-app/work/ScriptExec/main.c: In function 'GetScript':
123/opt/local/var/macports/build/_opt_local_var_macports_sources_rsync.macports.org_release_ports_aqua_gimp-app/work/ScriptExec/main.c:254: warning: pointer targets in passing argument 2 of 'FSRefMakePath' differ in signedness
124/opt/local/var/macports/build/_opt_local_var_macports_sources_rsync.macports.org_release_ports_aqua_gimp-app/work/ScriptExec/main.c:255: warning: pointer targets in passing argument 1 of 'DoesFileExist' differ in signedness
125/opt/local/var/macports/build/_opt_local_var_macports_sources_rsync.macports.org_release_ports_aqua_gimp-app/work/ScriptExec/main.c:257: warning: pointer targets in return differ in signedness
126/opt/local/var/macports/build/_opt_local_var_macports_sources_rsync.macports.org_release_ports_aqua_gimp-app/work/ScriptExec/main.c: In function 'GetOpenDoc':
127/opt/local/var/macports/build/_opt_local_var_macports_sources_rsync.macports.org_release_ports_aqua_gimp-app/work/ScriptExec/main.c:288: warning: pointer targets in passing argument 2 of 'FSRefMakePath' differ in signedness
128/opt/local/var/macports/build/_opt_local_var_macports_sources_rsync.macports.org_release_ports_aqua_gimp-app/work/ScriptExec/main.c:289: warning: pointer targets in passing argument 1 of 'DoesFileExist' differ in signedness
129/opt/local/var/macports/build/_opt_local_var_macports_sources_rsync.macports.org_release_ports_aqua_gimp-app/work/ScriptExec/main.c:291: warning: pointer targets in return differ in signedness
130/opt/local/var/macports/build/_opt_local_var_macports_sources_rsync.macports.org_release_ports_aqua_gimp-app/work/ScriptExec/main.c: In function 'LoadMenuBar':
131/opt/local/var/macports/build/_opt_local_var_macports_sources_rsync.macports.org_release_ports_aqua_gimp-app/work/ScriptExec/main.c:304: warning: implicit declaration of function 'CreateNibReference'
132/opt/local/var/macports/build/_opt_local_var_macports_sources_rsync.macports.org_release_ports_aqua_gimp-app/work/ScriptExec/main.c:305: warning: implicit declaration of function 'SetMenuBarFromNib'
133/opt/local/var/macports/build/_opt_local_var_macports_sources_rsync.macports.org_release_ports_aqua_gimp-app/work/ScriptExec/main.c:306: warning: implicit declaration of function 'DisposeNibReference'
134/opt/local/var/macports/build/_opt_local_var_macports_sources_rsync.macports.org_release_ports_aqua_gimp-app/work/ScriptExec/main.c: In function 'RedFatalAlert':
135/opt/local/var/macports/build/_opt_local_var_macports_sources_rsync.macports.org_release_ports_aqua_gimp-app/work/ScriptExec/main.c:321: warning: implicit declaration of function 'CreateStandardAlert'
136/opt/local/var/macports/build/_opt_local_var_macports_sources_rsync.macports.org_release_ports_aqua_gimp-app/work/ScriptExec/main.c:324: warning: implicit declaration of function 'RunStandardAlert'
137** BUILD FAILED **
138
139
140The following build commands failed:
141ScriptExec:
142        CompileC build/ScriptExec.build/Deployment/ScriptExec.build/Objects-normal/x86_64/main.o /opt/local/var/macports/build/_opt_local_var_macports_sources_rsync.macports.org_release_ports_aqua_gimp-app/work/ScriptExec/main.c normal x86_64 c com.apple.compilers.gcc.4_2
143(1 failure)
144
145shell command "cd "/opt/local/var/macports/build/_opt_local_var_macports_sources_rsync.macports.org_release_ports_aqua_gimp-app/work/ScriptExec" && /usr/bin/xcodebuild  -alltargets -configuration Deployment build OBJROOT=build/ SYMROOT=build/ MACOSX_DEPLOYMENT_TARGET=10.6 ARCHS=x86_64 SDKROOT="" " returned error 1
146Error: Target org.macports.build returned: shell command failed
147DEBUG: Backtrace: shell command failed
148    while executing
149"$procedure $targetname"
150Warning: the following items did not execute (for gimp-app): org.macports.build
151Log for gimp-app is at: /opt/local/var/macports/logs/_opt_local_var_macports_sources_rsync.macports.org_release_ports_aqua_gimp-app/main.log
152Error: Status 1 encountered during processing.
153To report a bug, see <http://guide.macports.org/#project.tickets>