Ticket #41903: new_build_main.log

File new_build_main.log, 121.5 KB (added by watsodw, 7 years ago)
Line 
1version:1
2:debug:main Found Dependency: path: /usr/bin filename: unzip regex: ^unzip$
3:debug:main epoch: in tree: 0 installed: 0
4:debug:main pkgconfig 0.28_0 exists in the ports tree
5:debug:main pkgconfig 0.28_0  is the latest installed
6:debug:main pkgconfig 0.28_0 +universal is active
7:debug:main Merging existing variants '+universal' into variants
8:debug:main new fully merged portvariants: universal +
9:debug:main Changing to port directory: /opt/macports/var/macports/sources/rsync.macports.org/release/tarballs/ports/devel/pkgconfig
10:debug:main OS darwin/12.5.0 (Mac OS X 10.8) arch i386
11:debug:main adding the default universal variant
12:debug:main Reading variant descriptions from /opt/macports/var/macports/sources/rsync.macports.org/release/tarballs/ports/_resources/port1.0/variant_descriptions.conf
13:debug:main Executing variant universal provides universal
14:debug:main Running callback portconfigure::add_automatic_compiler_dependencies
15:debug:main Finished running callback portconfigure::add_automatic_compiler_dependencies
16:debug:main Running callback portbuild::add_automatic_buildsystem_dependencies
17:debug:main Finished running callback portbuild::add_automatic_buildsystem_dependencies
18:debug:main No need to upgrade! pkgconfig 0.28_0 >= pkgconfig 0.28_0
19:debug:main epoch: in tree: 0 installed: 0
20:debug:main libiconv 1.14_0 exists in the ports tree
21:debug:main libiconv 1.14_0  is the latest installed
22:debug:main libiconv 1.14_0 +universal is active
23:debug:main Merging existing variants '+universal' into variants
24:debug:main new fully merged portvariants: universal +
25:debug:main Changing to port directory: /opt/macports/var/macports/sources/rsync.macports.org/release/tarballs/ports/textproc/libiconv
26:debug:main OS darwin/12.5.0 (Mac OS X 10.8) arch i386
27:debug:main Reading variant descriptions from /opt/macports/var/macports/sources/rsync.macports.org/release/tarballs/ports/_resources/port1.0/variant_descriptions.conf
28:debug:main universal variant already exists, so not adding the default one
29:debug:main Executing variant universal provides universal
30:debug:main Running callback portconfigure::add_automatic_compiler_dependencies
31:debug:main Finished running callback portconfigure::add_automatic_compiler_dependencies
32:debug:main Running callback portbuild::add_automatic_buildsystem_dependencies
33:debug:main Finished running callback portbuild::add_automatic_buildsystem_dependencies
34:debug:main No need to upgrade! libiconv 1.14_0 >= libiconv 1.14_0
35:debug:main epoch: in tree: 0 installed: 0
36:debug:main qt4-mac 4.8.5_1 exists in the ports tree
37:debug:main qt4-mac 4.8.5_1 +openvg+universal is the latest installed
38:debug:main qt4-mac 4.8.5_1 +openvg+universal is active
39:debug:main Merging existing variants '+openvg+universal' into variants
40:debug:main new fully merged portvariants: universal + openvg +
41:debug:main Changing to port directory: /opt/macports/var/macports/sources/rsync.macports.org/release/tarballs/ports/aqua/qt4-mac
42:debug:main OS darwin/12.5.0 (Mac OS X 10.8) arch i386
43:debug:main compiler clang 500.2.79 not blacklisted because it doesn't match { clang <= 318.0.61 }
44:debug:main adding the default universal variant
45:debug:main Reading variant descriptions from /opt/macports/var/macports/sources/rsync.macports.org/release/tarballs/ports/_resources/port1.0/variant_descriptions.conf
46:debug:main Executing variant openvg provides openvg
47:debug:main Executing variant universal provides universal
48:debug:main Running callback portconfigure::add_automatic_compiler_dependencies
49:debug:main Finished running callback portconfigure::add_automatic_compiler_dependencies
50:debug:main Running callback portbuild::add_automatic_buildsystem_dependencies
51:debug:main Finished running callback portbuild::add_automatic_buildsystem_dependencies
52:debug:main No need to upgrade! qt4-mac 4.8.5_1 >= qt4-mac 4.8.5_1
53:debug:main epoch: in tree: 0 installed: 0
54:debug:main zlib 1.2.8_0 exists in the ports tree
55:debug:main zlib 1.2.8_0  is the latest installed
56:debug:main zlib 1.2.8_0 +universal is active
57:debug:main Merging existing variants '+universal' into variants
58:debug:main new fully merged portvariants: universal +
59:debug:main Changing to port directory: /opt/macports/var/macports/sources/rsync.macports.org/release/tarballs/ports/archivers/zlib
60:debug:main OS darwin/12.5.0 (Mac OS X 10.8) arch i386
61:debug:main adding the default universal variant
62:debug:main Reading variant descriptions from /opt/macports/var/macports/sources/rsync.macports.org/release/tarballs/ports/_resources/port1.0/variant_descriptions.conf
63:debug:main Executing variant universal provides universal
64:debug:main Running callback portconfigure::add_automatic_compiler_dependencies
65:debug:main Finished running callback portconfigure::add_automatic_compiler_dependencies
66:debug:main Running callback portbuild::add_automatic_buildsystem_dependencies
67:debug:main Finished running callback portbuild::add_automatic_buildsystem_dependencies
68:debug:main No need to upgrade! zlib 1.2.8_0 >= zlib 1.2.8_0
69:debug:main epoch: in tree: 0 installed: 0
70:debug:main dbus 1.6.12_0 exists in the ports tree
71:debug:main dbus 1.6.12_0 +startupitem is the latest installed
72:debug:main dbus 1.6.12_0 +startupitem+universal is active
73:debug:main Merging existing variants '+startupitem+universal' into variants
74:debug:main new fully merged portvariants: universal + startupitem +
75:debug:main Changing to port directory: /opt/macports/var/macports/sources/rsync.macports.org/release/tarballs/ports/devel/dbus
76:debug:main OS darwin/12.5.0 (Mac OS X 10.8) arch i386
77:debug:main Reading variant descriptions from /opt/macports/var/macports/sources/rsync.macports.org/release/tarballs/ports/_resources/port1.0/variant_descriptions.conf
78:debug:main universal variant already exists, so not adding the default one
79:debug:main Executing variant universal provides universal
80:debug:main Executing variant startupitem provides startupitem
81:debug:main Running callback portconfigure::add_automatic_compiler_dependencies
82:debug:main Finished running callback portconfigure::add_automatic_compiler_dependencies
83:debug:main Running callback portbuild::add_automatic_buildsystem_dependencies
84:debug:main Finished running callback portbuild::add_automatic_buildsystem_dependencies
85:debug:main No need to upgrade! dbus 1.6.12_0 >= dbus 1.6.12_0
86:debug:main epoch: in tree: 0 installed: 0
87:debug:main expat 2.1.0_0 exists in the ports tree
88:debug:main expat 2.1.0_0  is the latest installed
89:debug:main expat 2.1.0_0 +universal is active
90:debug:main Merging existing variants '+universal' into variants
91:debug:main new fully merged portvariants: universal +
92:debug:main Changing to port directory: /opt/macports/var/macports/sources/rsync.macports.org/release/tarballs/ports/textproc/expat
93:debug:main OS darwin/12.5.0 (Mac OS X 10.8) arch i386
94:debug:main adding the default universal variant
95:debug:main Reading variant descriptions from /opt/macports/var/macports/sources/rsync.macports.org/release/tarballs/ports/_resources/port1.0/variant_descriptions.conf
96:debug:main Executing variant universal provides universal
97:debug:main Running callback portconfigure::add_automatic_compiler_dependencies
98:debug:main Finished running callback portconfigure::add_automatic_compiler_dependencies
99:debug:main Running callback portbuild::add_automatic_buildsystem_dependencies
100:debug:main Finished running callback portbuild::add_automatic_buildsystem_dependencies
101:debug:main No need to upgrade! expat 2.1.0_0 >= expat 2.1.0_0
102:debug:main epoch: in tree: 1 installed: 1
103:debug:main openssl 1.0.1e_1 exists in the ports tree
104:debug:main openssl 1.0.1e_1  is the latest installed
105:debug:main openssl 1.0.1e_1 +universal is active
106:debug:main Merging existing variants '+universal' into variants
107:debug:main new fully merged portvariants: universal +
108:debug:main Changing to port directory: /opt/macports/var/macports/sources/rsync.macports.org/release/tarballs/ports/devel/openssl
109:debug:main OS darwin/12.5.0 (Mac OS X 10.8) arch i386
110:debug:main Reading variant descriptions from /opt/macports/var/macports/sources/rsync.macports.org/release/tarballs/ports/_resources/port1.0/variant_descriptions.conf
111:debug:main universal variant already exists, so not adding the default one
112:debug:main Executing variant universal provides universal
113:debug:main Running callback portconfigure::add_automatic_compiler_dependencies
114:debug:main Finished running callback portconfigure::add_automatic_compiler_dependencies
115:debug:main Running callback portbuild::add_automatic_buildsystem_dependencies
116:debug:main Finished running callback portbuild::add_automatic_buildsystem_dependencies
117:debug:main No need to upgrade! openssl 1.0.1e_1 >= openssl 1.0.1e_1
118:debug:main epoch: in tree: 0 installed: 0
119:debug:main tiff 4.0.3_2 exists in the ports tree
120:debug:main tiff 4.0.3_2 +universal is the latest installed
121:debug:main tiff 4.0.3_2 +universal is active
122:debug:main Merging existing variants '+universal' into variants
123:debug:main new fully merged portvariants: universal +
124:debug:main Changing to port directory: /opt/macports/var/macports/sources/rsync.macports.org/release/tarballs/ports/graphics/tiff
125:debug:main OS darwin/12.5.0 (Mac OS X 10.8) arch i386
126:debug:main Reading variant descriptions from /opt/macports/var/macports/sources/rsync.macports.org/release/tarballs/ports/_resources/port1.0/variant_descriptions.conf
127:debug:main universal variant already exists, so not adding the default one
128:debug:main Executing variant universal provides universal
129:debug:main Running callback portconfigure::add_automatic_compiler_dependencies
130:debug:main Finished running callback portconfigure::add_automatic_compiler_dependencies
131:debug:main Running callback portbuild::add_automatic_buildsystem_dependencies
132:debug:main Finished running callback portbuild::add_automatic_buildsystem_dependencies
133:debug:main No need to upgrade! tiff 4.0.3_2 >= tiff 4.0.3_2
134:debug:main epoch: in tree: 0 installed: 0
135:debug:main jpeg 9_1 exists in the ports tree
136:debug:main jpeg 9_1  is the latest installed
137:debug:main jpeg 9_1 +universal is active
138:debug:main Merging existing variants '+universal' into variants
139:debug:main new fully merged portvariants: universal +
140:debug:main Changing to port directory: /opt/macports/var/macports/sources/rsync.macports.org/release/tarballs/ports/graphics/jpeg
141:debug:main OS darwin/12.5.0 (Mac OS X 10.8) arch i386
142:debug:main adding the default universal variant
143:debug:main Reading variant descriptions from /opt/macports/var/macports/sources/rsync.macports.org/release/tarballs/ports/_resources/port1.0/variant_descriptions.conf
144:debug:main Executing variant universal provides universal
145:debug:main Running callback portconfigure::add_automatic_compiler_dependencies
146:debug:main Finished running callback portconfigure::add_automatic_compiler_dependencies
147:debug:main Running callback portbuild::add_automatic_buildsystem_dependencies
148:debug:main Finished running callback portbuild::add_automatic_buildsystem_dependencies
149:debug:main No need to upgrade! jpeg 9_1 >= jpeg 9_1
150:debug:main epoch: in tree: 0 installed: 0
151:debug:main xz 5.0.5_0 exists in the ports tree
152:debug:main xz 5.0.5_0 +universal is the latest installed
153:debug:main xz 5.0.5_0 +universal is active
154:debug:main Merging existing variants '+universal' into variants
155:debug:main new fully merged portvariants: universal +
156:debug:main Changing to port directory: /opt/macports/var/macports/sources/rsync.macports.org/release/tarballs/ports/archivers/xz
157:debug:main OS darwin/12.5.0 (Mac OS X 10.8) arch i386
158:debug:main adding the default universal variant
159:debug:main Reading variant descriptions from /opt/macports/var/macports/sources/rsync.macports.org/release/tarballs/ports/_resources/port1.0/variant_descriptions.conf
160:debug:main Executing variant universal provides universal
161:debug:main Running callback portconfigure::add_automatic_compiler_dependencies
162:debug:main Finished running callback portconfigure::add_automatic_compiler_dependencies
163:debug:main Running callback portbuild::add_automatic_buildsystem_dependencies
164:debug:main Finished running callback portbuild::add_automatic_buildsystem_dependencies
165:debug:main No need to upgrade! xz 5.0.5_0 >= xz 5.0.5_0
166:debug:main epoch: in tree: 0 installed: 0
167:debug:main gettext 0.18.3.1_1 exists in the ports tree
168:debug:main gettext 0.18.3.1_1 +universal is the latest installed
169:debug:main gettext 0.18.3.1_1 +universal is active
170:debug:main Merging existing variants '+universal' into variants
171:debug:main new fully merged portvariants: universal +
172:debug:main Changing to port directory: /opt/macports/var/macports/sources/rsync.macports.org/release/tarballs/ports/devel/gettext
173:debug:main OS darwin/12.5.0 (Mac OS X 10.8) arch i386
174:debug:main Reading variant descriptions from /opt/macports/var/macports/sources/rsync.macports.org/release/tarballs/ports/_resources/port1.0/variant_descriptions.conf
175:debug:main compiler clang 500.2.79 not blacklisted because it doesn't match {clang < 211.10.1}
176:debug:main universal variant already exists, so not adding the default one
177:debug:main Executing variant universal provides universal
178:debug:main Running callback portconfigure::add_automatic_compiler_dependencies
179:debug:main Finished running callback portconfigure::add_automatic_compiler_dependencies
180:debug:main Running callback portbuild::add_automatic_buildsystem_dependencies
181:debug:main Finished running callback portbuild::add_automatic_buildsystem_dependencies
182:debug:main No need to upgrade! gettext 0.18.3.1_1 >= gettext 0.18.3.1_1
183:debug:main epoch: in tree: 0 installed: 0
184:debug:main ncurses 5.9_2 exists in the ports tree
185:debug:main ncurses 5.9_2  is the latest installed
186:debug:main ncurses 5.9_2 +universal is active
187:debug:main Merging existing variants '+universal' into variants
188:debug:main new fully merged portvariants: universal +
189:debug:main Changing to port directory: /opt/macports/var/macports/sources/rsync.macports.org/release/tarballs/ports/devel/ncurses
190:debug:main OS darwin/12.5.0 (Mac OS X 10.8) arch i386
191:debug:main adding the default universal variant
192:debug:main Reading variant descriptions from /opt/macports/var/macports/sources/rsync.macports.org/release/tarballs/ports/_resources/port1.0/variant_descriptions.conf
193:debug:main Executing variant universal provides universal
194:debug:main Running callback portconfigure::add_automatic_compiler_dependencies
195:debug:main Finished running callback portconfigure::add_automatic_compiler_dependencies
196:debug:main Running callback portbuild::add_automatic_buildsystem_dependencies
197:debug:main Finished running callback portbuild::add_automatic_buildsystem_dependencies
198:debug:main No need to upgrade! ncurses 5.9_2 >= ncurses 5.9_2
199:debug:main epoch: in tree: 0 installed: 0
200:debug:main libpng 1.6.7_0 exists in the ports tree
201:debug:main libpng 1.6.7_0 +universal is the latest installed
202:debug:main libpng 1.6.7_0 +universal is active
203:debug:main Merging existing variants '+universal' into variants
204:debug:main new fully merged portvariants: universal +
205:debug:main Changing to port directory: /opt/macports/var/macports/sources/rsync.macports.org/release/tarballs/ports/graphics/libpng
206:debug:main OS darwin/12.5.0 (Mac OS X 10.8) arch i386
207:debug:main adding the default universal variant
208:debug:main Reading variant descriptions from /opt/macports/var/macports/sources/rsync.macports.org/release/tarballs/ports/_resources/port1.0/variant_descriptions.conf
209:debug:main Executing variant universal provides universal
210:debug:main Running callback portconfigure::add_automatic_compiler_dependencies
211:debug:main Finished running callback portconfigure::add_automatic_compiler_dependencies
212:debug:main Running callback portbuild::add_automatic_buildsystem_dependencies
213:debug:main Finished running callback portbuild::add_automatic_buildsystem_dependencies
214:debug:main No need to upgrade! libpng 1.6.7_0 >= libpng 1.6.7_0
215:debug:main epoch: in tree: 0 installed: 0
216:debug:main libmng 1.0.10_3 exists in the ports tree
217:debug:main libmng 1.0.10_3  is the latest installed
218:debug:main libmng 1.0.10_3 +universal is active
219:debug:main Merging existing variants '+universal' into variants
220:debug:main new fully merged portvariants: universal +
221:debug:main Changing to port directory: /opt/macports/var/macports/sources/rsync.macports.org/release/tarballs/ports/graphics/libmng
222:debug:main OS darwin/12.5.0 (Mac OS X 10.8) arch i386
223:debug:main adding the default universal variant
224:debug:main Reading variant descriptions from /opt/macports/var/macports/sources/rsync.macports.org/release/tarballs/ports/_resources/port1.0/variant_descriptions.conf
225:debug:main Executing variant universal provides universal
226:debug:main Running callback portconfigure::add_automatic_compiler_dependencies
227:debug:main Finished running callback portconfigure::add_automatic_compiler_dependencies
228:debug:main Running callback portbuild::add_automatic_buildsystem_dependencies
229:debug:main Finished running callback portbuild::add_automatic_buildsystem_dependencies
230:debug:main No need to upgrade! libmng 1.0.10_3 >= libmng 1.0.10_3
231:debug:main epoch: in tree: 0 installed: 0
232:debug:main lcms 1.19_5 exists in the ports tree
233:debug:main lcms 1.19_5  is the latest installed
234:debug:main lcms 1.19_5 +universal is active
235:debug:main Merging existing variants '+universal' into variants
236:debug:main new fully merged portvariants: universal +
237:debug:main Changing to port directory: /opt/macports/var/macports/sources/rsync.macports.org/release/tarballs/ports/graphics/lcms
238:debug:main OS darwin/12.5.0 (Mac OS X 10.8) arch i386
239:debug:main Reading variant descriptions from /opt/macports/var/macports/sources/rsync.macports.org/release/tarballs/ports/_resources/port1.0/variant_descriptions.conf
240:debug:main universal variant already exists, so not adding the default one
241:debug:main Executing variant universal provides universal
242:debug:main Running callback portconfigure::add_automatic_compiler_dependencies
243:debug:main Finished running callback portconfigure::add_automatic_compiler_dependencies
244:debug:main Running callback portbuild::add_automatic_buildsystem_dependencies
245:debug:main Finished running callback portbuild::add_automatic_buildsystem_dependencies
246:debug:main No need to upgrade! lcms 1.19_5 >= lcms 1.19_5
247:debug:main epoch: in tree: 1 installed: 1
248:debug:main mesa 8.0.4_2 exists in the ports tree
249:debug:main mesa 8.0.4_2 +iglx+python27+universal is the latest installed
250:debug:main mesa 8.0.4_2 +python27+universal is active
251:debug:main Merging existing variants '+python27+universal' into variants
252:debug:main new fully merged portvariants: universal + python27 +
253:debug:main Changing to port directory: /opt/macports/var/macports/sources/rsync.macports.org/release/tarballs/ports/x11/mesa
254:debug:main OS darwin/12.5.0 (Mac OS X 10.8) arch i386
255:debug:main Reading variant descriptions from /opt/macports/var/macports/sources/rsync.macports.org/release/tarballs/ports/_resources/port1.0/variant_descriptions.conf
256:debug:main universal variant already exists, so not adding the default one
257:debug:main Executing variant universal provides universal
258:debug:main Executing variant python27 provides python27
259:debug:main Running callback portconfigure::add_automatic_compiler_dependencies
260:debug:main Finished running callback portconfigure::add_automatic_compiler_dependencies
261:debug:main Running callback portbuild::add_automatic_buildsystem_dependencies
262:debug:main Finished running callback portbuild::add_automatic_buildsystem_dependencies
263:debug:main No need to upgrade! mesa 8.0.4_2 >= mesa 8.0.4_2
264:debug:main epoch: in tree: 0 installed: 0
265:debug:main xorg-glproto 1.4.17_0 exists in the ports tree
266:debug:main xorg-glproto 1.4.17_0  is the latest installed
267:debug:main xorg-glproto 1.4.17_0  is active
268:debug:main Merging existing variants '' into variants
269:debug:main new fully merged portvariants:
270:debug:main Changing to port directory: /opt/macports/var/macports/sources/rsync.macports.org/release/tarballs/ports/x11/xorg-glproto
271:debug:main OS darwin/12.5.0 (Mac OS X 10.8) arch i386
272:debug:main only one arch supported, so not adding the default universal variant
273:debug:main Running callback portconfigure::add_automatic_compiler_dependencies
274:debug:main Finished running callback portconfigure::add_automatic_compiler_dependencies
275:debug:main Running callback portbuild::add_automatic_buildsystem_dependencies
276:debug:main Finished running callback portbuild::add_automatic_buildsystem_dependencies
277:debug:main No need to upgrade! xorg-glproto 1.4.17_0 >= xorg-glproto 1.4.17_0
278:debug:main epoch: in tree: 0 installed: 0
279:debug:main xorg-dri2proto 2.8_0 exists in the ports tree
280:debug:main xorg-dri2proto 2.8_0  is the latest installed
281:debug:main xorg-dri2proto 2.8_0  is active
282:debug:main Merging existing variants '' into variants
283:debug:main new fully merged portvariants:
284:debug:main Changing to port directory: /opt/macports/var/macports/sources/rsync.macports.org/release/tarballs/ports/x11/xorg-dri2proto
285:debug:main OS darwin/12.5.0 (Mac OS X 10.8) arch i386
286:debug:main only one arch supported, so not adding the default universal variant
287:debug:main Running callback portconfigure::add_automatic_compiler_dependencies
288:debug:main Finished running callback portconfigure::add_automatic_compiler_dependencies
289:debug:main Running callback portbuild::add_automatic_buildsystem_dependencies
290:debug:main Finished running callback portbuild::add_automatic_buildsystem_dependencies
291:debug:main No need to upgrade! xorg-dri2proto 2.8_0 >= xorg-dri2proto 2.8_0
292:debug:main epoch: in tree: 0 installed: 0
293:debug:main xorg-libXfixes 5.0.1_0 exists in the ports tree
294:debug:main xorg-libXfixes 5.0.1_0  is the latest installed
295:debug:main xorg-libXfixes 5.0.1_0 +universal is active
296:debug:main Merging existing variants '+universal' into variants
297:debug:main new fully merged portvariants: universal +
298:debug:main Changing to port directory: /opt/macports/var/macports/sources/rsync.macports.org/release/tarballs/ports/x11/xorg-libXfixes
299:debug:main OS darwin/12.5.0 (Mac OS X 10.8) arch i386
300:debug:main adding the default universal variant
301:debug:main Reading variant descriptions from /opt/macports/var/macports/sources/rsync.macports.org/release/tarballs/ports/_resources/port1.0/variant_descriptions.conf
302:debug:main Executing variant universal provides universal
303:debug:main Running callback portconfigure::add_automatic_compiler_dependencies
304:debug:main Finished running callback portconfigure::add_automatic_compiler_dependencies
305:debug:main Running callback portbuild::add_automatic_buildsystem_dependencies
306:debug:main Finished running callback portbuild::add_automatic_buildsystem_dependencies
307:debug:main No need to upgrade! xorg-libXfixes 5.0.1_0 >= xorg-libXfixes 5.0.1_0
308:debug:main epoch: in tree: 0 installed: 0
309:debug:main xorg-libX11 1.6.2_0 exists in the ports tree
310:debug:main xorg-libX11 1.6.2_0 +universal is the latest installed
311:debug:main xorg-libX11 1.6.2_0 +universal is active
312:debug:main Merging existing variants '+universal' into variants
313:debug:main new fully merged portvariants: universal +
314:debug:main Changing to port directory: /opt/macports/var/macports/sources/rsync.macports.org/release/tarballs/ports/x11/xorg-libX11
315:debug:main OS darwin/12.5.0 (Mac OS X 10.8) arch i386
316:debug:main adding the default universal variant
317:debug:main Reading variant descriptions from /opt/macports/var/macports/sources/rsync.macports.org/release/tarballs/ports/_resources/port1.0/variant_descriptions.conf
318:debug:main Executing variant universal provides universal
319:debug:main Running callback portconfigure::add_automatic_compiler_dependencies
320:debug:main Finished running callback portconfigure::add_automatic_compiler_dependencies
321:debug:main Running callback portbuild::add_automatic_buildsystem_dependencies
322:debug:main Finished running callback portbuild::add_automatic_buildsystem_dependencies
323:debug:main No need to upgrade! xorg-libX11 1.6.2_0 >= xorg-libX11 1.6.2_0
324:debug:main epoch: in tree: 0 installed: 0
325:debug:main xorg-libXdmcp 1.1.1_0 exists in the ports tree
326:debug:main xorg-libXdmcp 1.1.1_0  is the latest installed
327:debug:main xorg-libXdmcp 1.1.1_0 +universal is active
328:debug:main Merging existing variants '+universal' into variants
329:debug:main new fully merged portvariants: universal +
330:debug:main Changing to port directory: /opt/macports/var/macports/sources/rsync.macports.org/release/tarballs/ports/x11/xorg-libXdmcp
331:debug:main OS darwin/12.5.0 (Mac OS X 10.8) arch i386
332:debug:main adding the default universal variant
333:debug:main Reading variant descriptions from /opt/macports/var/macports/sources/rsync.macports.org/release/tarballs/ports/_resources/port1.0/variant_descriptions.conf
334:debug:main Executing variant universal provides universal
335:debug:main Running callback portconfigure::add_automatic_compiler_dependencies
336:debug:main Finished running callback portconfigure::add_automatic_compiler_dependencies
337:debug:main Running callback portbuild::add_automatic_buildsystem_dependencies
338:debug:main Finished running callback portbuild::add_automatic_buildsystem_dependencies
339:debug:main No need to upgrade! xorg-libXdmcp 1.1.1_0 >= xorg-libXdmcp 1.1.1_0
340:debug:main epoch: in tree: 0 installed: 0
341:debug:main xorg-libXau 1.0.8_0 exists in the ports tree
342:debug:main xorg-libXau 1.0.8_0  is the latest installed
343:debug:main xorg-libXau 1.0.8_0 +universal is active
344:debug:main Merging existing variants '+universal' into variants
345:debug:main new fully merged portvariants: universal +
346:debug:main Changing to port directory: /opt/macports/var/macports/sources/rsync.macports.org/release/tarballs/ports/x11/xorg-libXau
347:debug:main OS darwin/12.5.0 (Mac OS X 10.8) arch i386
348:debug:main adding the default universal variant
349:debug:main Reading variant descriptions from /opt/macports/var/macports/sources/rsync.macports.org/release/tarballs/ports/_resources/port1.0/variant_descriptions.conf
350:debug:main Executing variant universal provides universal
351:debug:main Running callback portconfigure::add_automatic_compiler_dependencies
352:debug:main Finished running callback portconfigure::add_automatic_compiler_dependencies
353:debug:main Running callback portbuild::add_automatic_buildsystem_dependencies
354:debug:main Finished running callback portbuild::add_automatic_buildsystem_dependencies
355:debug:main No need to upgrade! xorg-libXau 1.0.8_0 >= xorg-libXau 1.0.8_0
356:debug:main epoch: in tree: 0 installed: 0
357:debug:main xorg-xproto 7.0.24_0 exists in the ports tree
358:debug:main xorg-xproto 7.0.24_0  is the latest installed
359:debug:main xorg-xproto 7.0.24_0  is active
360:debug:main Merging existing variants '' into variants
361:debug:main new fully merged portvariants:
362:debug:main Changing to port directory: /opt/macports/var/macports/sources/rsync.macports.org/release/tarballs/ports/x11/xorg-xproto
363:debug:main OS darwin/12.5.0 (Mac OS X 10.8) arch i386
364:debug:main only one arch supported, so not adding the default universal variant
365:debug:main Running callback portconfigure::add_automatic_compiler_dependencies
366:debug:main Finished running callback portconfigure::add_automatic_compiler_dependencies
367:debug:main Running callback portbuild::add_automatic_buildsystem_dependencies
368:debug:main Finished running callback portbuild::add_automatic_buildsystem_dependencies
369:debug:main No need to upgrade! xorg-xproto 7.0.24_0 >= xorg-xproto 7.0.24_0
370:debug:main epoch: in tree: 0 installed: 0
371:debug:main xorg-libxcb 1.9.1_0 exists in the ports tree
372:debug:main xorg-libxcb 1.9.1_0 +python27 is the latest installed
373:debug:main xorg-libxcb 1.9.1_0 +python27+universal is active
374:debug:main Merging existing variants '+python27+universal' into variants
375:debug:main new fully merged portvariants: universal + python27 +
376:debug:main Changing to port directory: /opt/macports/var/macports/sources/rsync.macports.org/release/tarballs/ports/x11/xorg-libxcb
377:debug:main OS darwin/12.5.0 (Mac OS X 10.8) arch i386
378:debug:main adding the default universal variant
379:debug:main Reading variant descriptions from /opt/macports/var/macports/sources/rsync.macports.org/release/tarballs/ports/_resources/port1.0/variant_descriptions.conf
380:debug:main Executing variant python27 provides python27
381:debug:main Executing variant universal provides universal
382:debug:main Running callback portconfigure::add_automatic_compiler_dependencies
383:debug:main Finished running callback portconfigure::add_automatic_compiler_dependencies
384:debug:main Running callback portbuild::add_automatic_buildsystem_dependencies
385:debug:main Finished running callback portbuild::add_automatic_buildsystem_dependencies
386:debug:main No need to upgrade! xorg-libxcb 1.9.1_0 >= xorg-libxcb 1.9.1_0
387:debug:main epoch: in tree: 0 installed: 0
388:debug:main xorg-xcb-proto 1.8_0 exists in the ports tree
389:debug:main xorg-xcb-proto 1.8_0 +python27 is the latest installed
390:debug:main xorg-xcb-proto 1.8_0 +python27 is active
391:debug:main Merging existing variants '+python27' into variants
392:debug:main new fully merged portvariants: python27 +
393:debug:main Changing to port directory: /opt/macports/var/macports/sources/rsync.macports.org/release/tarballs/ports/x11/xorg-xcb-proto
394:debug:main OS darwin/12.5.0 (Mac OS X 10.8) arch i386
395:debug:main only one arch supported, so not adding the default universal variant
396:debug:main Executing variant python27 provides python27
397:debug:main Running callback portconfigure::add_automatic_compiler_dependencies
398:debug:main Finished running callback portconfigure::add_automatic_compiler_dependencies
399:debug:main Running callback portbuild::add_automatic_buildsystem_dependencies
400:debug:main Finished running callback portbuild::add_automatic_buildsystem_dependencies
401:debug:main No need to upgrade! xorg-xcb-proto 1.8_0 >= xorg-xcb-proto 1.8_0
402:debug:main epoch: in tree: 0 installed: 0
403:debug:main libxml2 2.9.1_0 exists in the ports tree
404:debug:main libxml2 2.9.1_0  is the latest installed
405:debug:main libxml2 2.9.1_0 +universal is active
406:debug:main Merging existing variants '+universal' into variants
407:debug:main new fully merged portvariants: universal +
408:debug:main Changing to port directory: /opt/macports/var/macports/sources/rsync.macports.org/release/tarballs/ports/textproc/libxml2
409:debug:main OS darwin/12.5.0 (Mac OS X 10.8) arch i386
410:debug:main adding the default universal variant
411:debug:main Reading variant descriptions from /opt/macports/var/macports/sources/rsync.macports.org/release/tarballs/ports/_resources/port1.0/variant_descriptions.conf
412:debug:main Executing variant universal provides universal
413:debug:main Running callback portconfigure::add_automatic_compiler_dependencies
414:debug:main Finished running callback portconfigure::add_automatic_compiler_dependencies
415:debug:main Running callback portbuild::add_automatic_buildsystem_dependencies
416:debug:main Finished running callback portbuild::add_automatic_buildsystem_dependencies
417:debug:main No need to upgrade! libxml2 2.9.1_0 >= libxml2 2.9.1_0
418:debug:main epoch: in tree: 2 installed: 2
419:debug:main python27 2.7.6_0 exists in the ports tree
420:debug:main python27 2.7.6_0  is the latest installed
421:debug:main python27 2.7.6_0 +universal is active
422:debug:main Merging existing variants '+universal' into variants
423:debug:main new fully merged portvariants: universal +
424:debug:main Changing to port directory: /opt/macports/var/macports/sources/rsync.macports.org/release/tarballs/ports/lang/python27
425:debug:main OS darwin/12.5.0 (Mac OS X 10.8) arch i386
426:debug:main Reading variant descriptions from /opt/macports/var/macports/sources/rsync.macports.org/release/tarballs/ports/_resources/port1.0/variant_descriptions.conf
427:debug:main universal variant already exists, so not adding the default one
428:debug:main Executing variant universal provides universal
429:debug:main Running callback portconfigure::add_automatic_compiler_dependencies
430:debug:main Finished running callback portconfigure::add_automatic_compiler_dependencies
431:debug:main Running callback portbuild::add_automatic_buildsystem_dependencies
432:debug:main Finished running callback portbuild::add_automatic_buildsystem_dependencies
433:debug:main No need to upgrade! python27 2.7.6_0 >= python27 2.7.6_0
434:debug:main epoch: in tree: 0 installed: 0
435:debug:main sqlite3 3.8.2_0 exists in the ports tree
436:debug:main sqlite3 3.8.2_0 +universal is the latest installed
437:debug:main sqlite3 3.8.2_0 +universal is active
438:debug:main Merging existing variants '+universal' into variants
439:debug:main new fully merged portvariants: universal +
440:debug:main Changing to port directory: /opt/macports/var/macports/sources/rsync.macports.org/release/tarballs/ports/databases/sqlite3
441:debug:main OS darwin/12.5.0 (Mac OS X 10.8) arch i386
442:debug:main adding the default universal variant
443:debug:main Reading variant descriptions from /opt/macports/var/macports/sources/rsync.macports.org/release/tarballs/ports/_resources/port1.0/variant_descriptions.conf
444:debug:main Executing variant universal provides universal
445:debug:main Running callback portconfigure::add_automatic_compiler_dependencies
446:debug:main Finished running callback portconfigure::add_automatic_compiler_dependencies
447:debug:main Running callback portbuild::add_automatic_buildsystem_dependencies
448:debug:main Finished running callback portbuild::add_automatic_buildsystem_dependencies
449:debug:main No need to upgrade! sqlite3 3.8.2_0 >= sqlite3 3.8.2_0
450:debug:main epoch: in tree: 20090923 installed: 20090923
451:debug:main libedit 20121213-3.0_0 exists in the ports tree
452:debug:main libedit 20121213-3.0_0  is the latest installed
453:debug:main libedit 20121213-3.0_0 +universal is active
454:debug:main Merging existing variants '+universal' into variants
455:debug:main new fully merged portvariants: universal +
456:debug:main Changing to port directory: /opt/macports/var/macports/sources/rsync.macports.org/release/tarballs/ports/devel/libedit
457:debug:main OS darwin/12.5.0 (Mac OS X 10.8) arch i386
458:debug:main Reading variant descriptions from /opt/macports/var/macports/sources/rsync.macports.org/release/tarballs/ports/_resources/port1.0/variant_descriptions.conf
459:debug:main universal variant already exists, so not adding the default one
460:debug:main Executing variant universal provides universal
461:debug:main Running callback portconfigure::add_automatic_compiler_dependencies
462:debug:main Finished running callback portconfigure::add_automatic_compiler_dependencies
463:debug:main Running callback portbuild::add_automatic_buildsystem_dependencies
464:debug:main Finished running callback portbuild::add_automatic_buildsystem_dependencies
465:debug:main No need to upgrade! libedit 20121213-3.0_0 >= libedit 20121213-3.0_0
466:debug:main epoch: in tree: 0 installed: 0
467:debug:main db46 4.6.21_8 exists in the ports tree
468:debug:main db46 4.6.21_8  is the latest installed
469:debug:main db46 4.6.21_8 +universal is active
470:debug:main Merging existing variants '+universal' into variants
471:debug:main new fully merged portvariants: universal +
472:debug:main Changing to port directory: /opt/macports/var/macports/sources/rsync.macports.org/release/tarballs/ports/databases/db46
473:debug:main OS darwin/12.5.0 (Mac OS X 10.8) arch i386
474:debug:main Reading variant descriptions from /opt/macports/var/macports/sources/rsync.macports.org/release/tarballs/ports/_resources/port1.0/variant_descriptions.conf
475:debug:main universal variant already exists, so not adding the default one
476:debug:main Executing variant universal provides universal
477:debug:main Running callback portconfigure::add_automatic_compiler_dependencies
478:debug:main Finished running callback portconfigure::add_automatic_compiler_dependencies
479:debug:main Running callback portbuild::add_automatic_buildsystem_dependencies
480:debug:main Finished running callback portbuild::add_automatic_buildsystem_dependencies
481:debug:main No need to upgrade! db46 4.6.21_8 >= db46 4.6.21_8
482:debug:main epoch: in tree: 0 installed: 0
483:debug:main db_select 0.1_2 exists in the ports tree
484:debug:main db_select 0.1_2  is the latest installed
485:debug:main db_select 0.1_2  is active
486:debug:main Merging existing variants '' into variants
487:debug:main new fully merged portvariants:
488:debug:main Changing to port directory: /opt/macports/var/macports/sources/rsync.macports.org/release/tarballs/ports/sysutils/db_select
489:debug:main OS darwin/12.5.0 (Mac OS X 10.8) arch i386
490:debug:main universal_variant is false, so not adding the default universal variant
491:debug:main Running callback portconfigure::add_automatic_compiler_dependencies
492:debug:main Finished running callback portconfigure::add_automatic_compiler_dependencies
493:debug:main Running callback portbuild::add_automatic_buildsystem_dependencies
494:debug:main Finished running callback portbuild::add_automatic_buildsystem_dependencies
495:debug:main No need to upgrade! db_select 0.1_2 >= db_select 0.1_2
496:debug:main epoch: in tree: 0 installed: 0
497:debug:main bzip2 1.0.6_0 exists in the ports tree
498:debug:main bzip2 1.0.6_0  is the latest installed
499:debug:main bzip2 1.0.6_0 +universal is active
500:debug:main Merging existing variants '+universal' into variants
501:debug:main new fully merged portvariants: universal +
502:debug:main Changing to port directory: /opt/macports/var/macports/sources/rsync.macports.org/release/tarballs/ports/archivers/bzip2
503:debug:main OS darwin/12.5.0 (Mac OS X 10.8) arch i386
504:debug:main Reading variant descriptions from /opt/macports/var/macports/sources/rsync.macports.org/release/tarballs/ports/_resources/port1.0/variant_descriptions.conf
505:debug:main universal variant already exists, so not adding the default one
506:debug:main Executing variant universal provides universal
507:debug:main Running callback portconfigure::add_automatic_compiler_dependencies
508:debug:main Finished running callback portconfigure::add_automatic_compiler_dependencies
509:debug:main Running callback portbuild::add_automatic_buildsystem_dependencies
510:debug:main Finished running callback portbuild::add_automatic_buildsystem_dependencies
511:debug:main No need to upgrade! bzip2 1.0.6_0 >= bzip2 1.0.6_0
512:debug:main epoch: in tree: 0 installed: 0
513:debug:main python_select 0.3_3 exists in the ports tree
514:debug:main python_select 0.3_3  is the latest installed
515:debug:main python_select 0.3_3  is active
516:debug:main Merging existing variants '' into variants
517:debug:main new fully merged portvariants:
518:debug:main Changing to port directory: /opt/macports/var/macports/sources/rsync.macports.org/release/tarballs/ports/sysutils/python_select
519:debug:main OS darwin/12.5.0 (Mac OS X 10.8) arch i386
520:debug:main universal_variant is false, so not adding the default universal variant
521:debug:main Running callback portconfigure::add_automatic_compiler_dependencies
522:debug:main Finished running callback portconfigure::add_automatic_compiler_dependencies
523:debug:main Running callback portbuild::add_automatic_buildsystem_dependencies
524:debug:main Finished running callback portbuild::add_automatic_buildsystem_dependencies
525:debug:main No need to upgrade! python_select 0.3_3 >= python_select 0.3_3
526:debug:main epoch: in tree: 0 installed: 0
527:debug:main xorg-libpthread-stubs 0.3_0 exists in the ports tree
528:debug:main xorg-libpthread-stubs 0.3_0  is the latest installed
529:debug:main xorg-libpthread-stubs 0.3_0  is active
530:debug:main Merging existing variants '' into variants
531:debug:main new fully merged portvariants:
532:debug:main Changing to port directory: /opt/macports/var/macports/sources/rsync.macports.org/release/tarballs/ports/x11/xorg-libpthread-stubs
533:debug:main OS darwin/12.5.0 (Mac OS X 10.8) arch i386
534:debug:main only one arch supported, so not adding the default universal variant
535:debug:main Running callback portconfigure::add_automatic_compiler_dependencies
536:debug:main Finished running callback portconfigure::add_automatic_compiler_dependencies
537:debug:main Running callback portbuild::add_automatic_buildsystem_dependencies
538:debug:main Finished running callback portbuild::add_automatic_buildsystem_dependencies
539:debug:main No need to upgrade! xorg-libpthread-stubs 0.3_0 >= xorg-libpthread-stubs 0.3_0
540:debug:main epoch: in tree: 0 installed: 0
541:debug:main xorg-kbproto 1.0.6_0 exists in the ports tree
542:debug:main xorg-kbproto 1.0.6_0  is the latest installed
543:debug:main xorg-kbproto 1.0.6_0  is active
544:debug:main Merging existing variants '' into variants
545:debug:main new fully merged portvariants:
546:debug:main Changing to port directory: /opt/macports/var/macports/sources/rsync.macports.org/release/tarballs/ports/x11/xorg-kbproto
547:debug:main OS darwin/12.5.0 (Mac OS X 10.8) arch i386
548:debug:main only one arch supported, so not adding the default universal variant
549:debug:main Running callback portconfigure::add_automatic_compiler_dependencies
550:debug:main Finished running callback portconfigure::add_automatic_compiler_dependencies
551:debug:main Running callback portbuild::add_automatic_buildsystem_dependencies
552:debug:main Finished running callback portbuild::add_automatic_buildsystem_dependencies
553:debug:main No need to upgrade! xorg-kbproto 1.0.6_0 >= xorg-kbproto 1.0.6_0
554:debug:main epoch: in tree: 0 installed: 0
555:debug:main xorg-fixesproto 5.0_0 exists in the ports tree
556:debug:main xorg-fixesproto 5.0_0  is the latest installed
557:debug:main xorg-fixesproto 5.0_0  is active
558:debug:main Merging existing variants '' into variants
559:debug:main new fully merged portvariants:
560:debug:main Changing to port directory: /opt/macports/var/macports/sources/rsync.macports.org/release/tarballs/ports/x11/xorg-fixesproto
561:debug:main OS darwin/12.5.0 (Mac OS X 10.8) arch i386
562:debug:main only one arch supported, so not adding the default universal variant
563:debug:main Running callback portconfigure::add_automatic_compiler_dependencies
564:debug:main Finished running callback portconfigure::add_automatic_compiler_dependencies
565:debug:main Running callback portbuild::add_automatic_buildsystem_dependencies
566:debug:main Finished running callback portbuild::add_automatic_buildsystem_dependencies
567:debug:main No need to upgrade! xorg-fixesproto 5.0_0 >= xorg-fixesproto 5.0_0
568:debug:main epoch: in tree: 0 installed: 0
569:debug:main xorg-xextproto 7.2.99.901_0 exists in the ports tree
570:debug:main xorg-xextproto 7.2.99.901_0  is the latest installed
571:debug:main xorg-xextproto 7.2.99.901_0  is active
572:debug:main Merging existing variants '' into variants
573:debug:main new fully merged portvariants:
574:debug:main Changing to port directory: /opt/macports/var/macports/sources/rsync.macports.org/release/tarballs/ports/x11/xorg-xextproto
575:debug:main OS darwin/12.5.0 (Mac OS X 10.8) arch i386
576:debug:main only one arch supported, so not adding the default universal variant
577:debug:main Running callback portconfigure::add_automatic_compiler_dependencies
578:debug:main Finished running callback portconfigure::add_automatic_compiler_dependencies
579:debug:main Running callback portbuild::add_automatic_buildsystem_dependencies
580:debug:main Finished running callback portbuild::add_automatic_buildsystem_dependencies
581:debug:main No need to upgrade! xorg-xextproto 7.2.99.901_0 >= xorg-xextproto 7.2.99.901_0
582:debug:main epoch: in tree: 0 installed: 0
583:debug:main xorg-libXi 1.7.2_0 exists in the ports tree
584:debug:main xorg-libXi 1.7.2_0  is the latest installed
585:debug:main xorg-libXi 1.7.2_0 +universal is active
586:debug:main Merging existing variants '+universal' into variants
587:debug:main new fully merged portvariants: universal +
588:debug:main Changing to port directory: /opt/macports/var/macports/sources/rsync.macports.org/release/tarballs/ports/x11/xorg-libXi
589:debug:main OS darwin/12.5.0 (Mac OS X 10.8) arch i386
590:debug:main adding the default universal variant
591:debug:main Reading variant descriptions from /opt/macports/var/macports/sources/rsync.macports.org/release/tarballs/ports/_resources/port1.0/variant_descriptions.conf
592:debug:main Executing variant universal provides universal
593:debug:main Running callback portconfigure::add_automatic_compiler_dependencies
594:debug:main Finished running callback portconfigure::add_automatic_compiler_dependencies
595:debug:main Running callback portbuild::add_automatic_buildsystem_dependencies
596:debug:main Finished running callback portbuild::add_automatic_buildsystem_dependencies
597:debug:main No need to upgrade! xorg-libXi 1.7.2_0 >= xorg-libXi 1.7.2_0
598:debug:main epoch: in tree: 0 installed: 0
599:debug:main xorg-libXext 1.3.2_0 exists in the ports tree
600:debug:main xorg-libXext 1.3.2_0  is the latest installed
601:debug:main xorg-libXext 1.3.2_0 +universal is active
602:debug:main Merging existing variants '+universal' into variants
603:debug:main new fully merged portvariants: universal +
604:debug:main Changing to port directory: /opt/macports/var/macports/sources/rsync.macports.org/release/tarballs/ports/x11/xorg-libXext
605:debug:main OS darwin/12.5.0 (Mac OS X 10.8) arch i386
606:debug:main adding the default universal variant
607:debug:main Reading variant descriptions from /opt/macports/var/macports/sources/rsync.macports.org/release/tarballs/ports/_resources/port1.0/variant_descriptions.conf
608:debug:main Executing variant universal provides universal
609:debug:main Running callback portconfigure::add_automatic_compiler_dependencies
610:debug:main Finished running callback portconfigure::add_automatic_compiler_dependencies
611:debug:main Running callback portbuild::add_automatic_buildsystem_dependencies
612:debug:main Finished running callback portbuild::add_automatic_buildsystem_dependencies
613:debug:main No need to upgrade! xorg-libXext 1.3.2_0 >= xorg-libXext 1.3.2_0
614:debug:main epoch: in tree: 0 installed: 0
615:debug:main xorg-inputproto 2.3_0 exists in the ports tree
616:debug:main xorg-inputproto 2.3_0  is the latest installed
617:debug:main xorg-inputproto 2.3_0  is active
618:debug:main Merging existing variants '' into variants
619:debug:main new fully merged portvariants:
620:debug:main Changing to port directory: /opt/macports/var/macports/sources/rsync.macports.org/release/tarballs/ports/x11/xorg-inputproto
621:debug:main OS darwin/12.5.0 (Mac OS X 10.8) arch i386
622:debug:main only one arch supported, so not adding the default universal variant
623:debug:main Running callback portconfigure::add_automatic_compiler_dependencies
624:debug:main Finished running callback portconfigure::add_automatic_compiler_dependencies
625:debug:main Running callback portbuild::add_automatic_buildsystem_dependencies
626:debug:main Finished running callback portbuild::add_automatic_buildsystem_dependencies
627:debug:main No need to upgrade! xorg-inputproto 2.3_0 >= xorg-inputproto 2.3_0
628:debug:main epoch: in tree: 0 installed: 0
629:debug:main xorg-libXmu 1.1.2_0 exists in the ports tree
630:debug:main xorg-libXmu 1.1.2_0 +universal is the latest installed
631:debug:main xorg-libXmu 1.1.2_0 +universal is active
632:debug:main Merging existing variants '+universal' into variants
633:debug:main new fully merged portvariants: universal +
634:debug:main Changing to port directory: /opt/macports/var/macports/sources/rsync.macports.org/release/tarballs/ports/x11/xorg-libXmu
635:debug:main OS darwin/12.5.0 (Mac OS X 10.8) arch i386
636:debug:main adding the default universal variant
637:debug:main Reading variant descriptions from /opt/macports/var/macports/sources/rsync.macports.org/release/tarballs/ports/_resources/port1.0/variant_descriptions.conf
638:debug:main Executing variant universal provides universal
639:debug:main Running callback portconfigure::add_automatic_compiler_dependencies
640:debug:main Finished running callback portconfigure::add_automatic_compiler_dependencies
641:debug:main Running callback portbuild::add_automatic_buildsystem_dependencies
642:debug:main Finished running callback portbuild::add_automatic_buildsystem_dependencies
643:debug:main No need to upgrade! xorg-libXmu 1.1.2_0 >= xorg-libXmu 1.1.2_0
644:debug:main epoch: in tree: 0 installed: 0
645:debug:main xorg-libXt 1.1.4_0 exists in the ports tree
646:debug:main xorg-libXt 1.1.4_0  is the latest installed
647:debug:main xorg-libXt 1.1.4_0 +universal is active
648:debug:main Merging existing variants '+universal' into variants
649:debug:main new fully merged portvariants: universal +
650:debug:main Changing to port directory: /opt/macports/var/macports/sources/rsync.macports.org/release/tarballs/ports/x11/xorg-libXt
651:debug:main OS darwin/12.5.0 (Mac OS X 10.8) arch i386
652:debug:main adding the default universal variant
653:debug:main Reading variant descriptions from /opt/macports/var/macports/sources/rsync.macports.org/release/tarballs/ports/_resources/port1.0/variant_descriptions.conf
654:debug:main Executing variant universal provides universal
655:debug:main Running callback portconfigure::add_automatic_compiler_dependencies
656:debug:main Finished running callback portconfigure::add_automatic_compiler_dependencies
657:debug:main Running callback portbuild::add_automatic_buildsystem_dependencies
658:debug:main Finished running callback portbuild::add_automatic_buildsystem_dependencies
659:debug:main No need to upgrade! xorg-libXt 1.1.4_0 >= xorg-libXt 1.1.4_0
660:debug:main epoch: in tree: 0 installed: 0
661:debug:main xorg-libsm 1.2.1_0 exists in the ports tree
662:debug:main xorg-libsm 1.2.1_0  is the latest installed
663:debug:main xorg-libsm 1.2.1_0 +universal is active
664:debug:main Merging existing variants '+universal' into variants
665:debug:main new fully merged portvariants: universal +
666:debug:main Changing to port directory: /opt/macports/var/macports/sources/rsync.macports.org/release/tarballs/ports/x11/xorg-libsm
667:debug:main OS darwin/12.5.0 (Mac OS X 10.8) arch i386
668:debug:main adding the default universal variant
669:debug:main Reading variant descriptions from /opt/macports/var/macports/sources/rsync.macports.org/release/tarballs/ports/_resources/port1.0/variant_descriptions.conf
670:debug:main Executing variant universal provides universal
671:debug:main Running callback portconfigure::add_automatic_compiler_dependencies
672:debug:main Finished running callback portconfigure::add_automatic_compiler_dependencies
673:debug:main Running callback portbuild::add_automatic_buildsystem_dependencies
674:debug:main Finished running callback portbuild::add_automatic_buildsystem_dependencies
675:debug:main No need to upgrade! xorg-libsm 1.2.1_0 >= xorg-libsm 1.2.1_0
676:debug:main epoch: in tree: 0 installed: 0
677:debug:main xorg-libice 1.0.8_0 exists in the ports tree
678:debug:main xorg-libice 1.0.8_0  is the latest installed
679:debug:main xorg-libice 1.0.8_0 +universal is active
680:debug:main Merging existing variants '+universal' into variants
681:debug:main new fully merged portvariants: universal +
682:debug:main Changing to port directory: /opt/macports/var/macports/sources/rsync.macports.org/release/tarballs/ports/x11/xorg-libice
683:debug:main OS darwin/12.5.0 (Mac OS X 10.8) arch i386
684:debug:main adding the default universal variant
685:debug:main Reading variant descriptions from /opt/macports/var/macports/sources/rsync.macports.org/release/tarballs/ports/_resources/port1.0/variant_descriptions.conf
686:debug:main Executing variant universal provides universal
687:debug:main Running callback portconfigure::add_automatic_compiler_dependencies
688:debug:main Finished running callback portconfigure::add_automatic_compiler_dependencies
689:debug:main Running callback portbuild::add_automatic_buildsystem_dependencies
690:debug:main Finished running callback portbuild::add_automatic_buildsystem_dependencies
691:debug:main No need to upgrade! xorg-libice 1.0.8_0 >= xorg-libice 1.0.8_0
692:debug:main epoch: in tree: 0 installed: 0
693:debug:main muparser 1.32_0 exists in the ports tree
694:debug:main muparser 1.32_0  is the latest installed
695:debug:main muparser 1.32_0 +universal is active
696:debug:main Merging existing variants '+universal' into variants
697:debug:main new fully merged portvariants: universal +
698:debug:main Changing to port directory: /opt/macports/var/macports/sources/rsync.macports.org/release/tarballs/ports/math/muparser
699:debug:main OS darwin/12.5.0 (Mac OS X 10.8) arch i386
700:debug:main adding the default universal variant
701:debug:main Reading variant descriptions from /opt/macports/var/macports/sources/rsync.macports.org/release/tarballs/ports/_resources/port1.0/variant_descriptions.conf
702:debug:main Executing variant universal provides universal
703:debug:main Running callback portconfigure::add_automatic_compiler_dependencies
704:debug:main Finished running callback portconfigure::add_automatic_compiler_dependencies
705:debug:main Running callback portbuild::add_automatic_buildsystem_dependencies
706:debug:main Finished running callback portbuild::add_automatic_buildsystem_dependencies
707:debug:main No need to upgrade! muparser 1.32_0 >= muparser 1.32_0
708:debug:main epoch: in tree: 0 installed: 0
709:debug:main boost 1.55.0_0 exists in the ports tree
710:debug:main boost 1.55.0_0 +no_single+no_static+python27+regex_match_extra is the latest installed
711:debug:main boost 1.55.0_0 +no_single+no_static+python27+universal is active
712:debug:main Merging existing variants '+no_single+no_static+python27+universal' into variants
713:debug:main new fully merged portvariants: no_static + universal + no_single + python27 +
714:debug:main Changing to port directory: /opt/macports/var/macports/sources/rsync.macports.org/release/tarballs/ports/devel/boost
715:debug:main OS darwin/12.5.0 (Mac OS X 10.8) arch i386
716:debug:main compiler clang 500.2.79 not blacklisted because it doesn't match {clang < 421}
717:debug:main Reading variant descriptions from /opt/macports/var/macports/sources/rsync.macports.org/release/tarballs/ports/_resources/port1.0/variant_descriptions.conf
718:debug:main universal variant already exists, so not adding the default one
719:debug:main Executing variant python27 provides python27
720:debug:main Executing variant no_static provides no_static
721:debug:main Executing variant no_single provides no_single
722:debug:main Executing variant universal provides universal
723:debug:main Running callback portconfigure::add_automatic_compiler_dependencies
724:debug:main Finished running callback portconfigure::add_automatic_compiler_dependencies
725:debug:main Running callback portbuild::add_automatic_buildsystem_dependencies
726:debug:main Finished running callback portbuild::add_automatic_buildsystem_dependencies
727:debug:main No need to upgrade! boost 1.55.0_0 >= boost 1.55.0_0
728:debug:main epoch: in tree: 0 installed: 0
729:debug:main icu 51.2_1 exists in the ports tree
730:debug:main icu 51.2_1 +universal is the latest installed
731:debug:main icu 51.2_1 +universal is active
732:debug:main Merging existing variants '+universal' into variants
733:debug:main new fully merged portvariants: universal +
734:debug:main Changing to port directory: /opt/macports/var/macports/sources/rsync.macports.org/release/tarballs/ports/devel/icu
735:debug:main OS darwin/12.5.0 (Mac OS X 10.8) arch i386
736:debug:main Reading variant descriptions from /opt/macports/var/macports/sources/rsync.macports.org/release/tarballs/ports/_resources/port1.0/variant_descriptions.conf
737:debug:main universal variant already exists, so not adding the default one
738:debug:main Executing variant universal provides universal
739:debug:main Running callback portconfigure::add_automatic_compiler_dependencies
740:debug:main Finished running callback portconfigure::add_automatic_compiler_dependencies
741:debug:main Running callback portbuild::add_automatic_buildsystem_dependencies
742:debug:main Finished running callback portbuild::add_automatic_buildsystem_dependencies
743:debug:main No need to upgrade! icu 51.2_1 >= icu 51.2_1
744:debug:main epoch: in tree: 0 installed: 0
745:debug:main gsl 1.16_2 exists in the ports tree
746:debug:main gsl 1.16_2 +universal is the latest installed
747:debug:main gsl 1.16_2 +universal is active
748:debug:main Merging existing variants '+universal' into variants
749:debug:main new fully merged portvariants: universal +
750:debug:main Changing to port directory: /opt/macports/var/macports/sources/rsync.macports.org/release/tarballs/ports/math/gsl
751:debug:main OS darwin/12.5.0 (Mac OS X 10.8) arch i386
752:debug:main adding the default universal variant
753:debug:main Reading variant descriptions from /opt/macports/var/macports/sources/rsync.macports.org/release/tarballs/ports/_resources/port1.0/variant_descriptions.conf
754:debug:main Executing variant universal provides universal
755:debug:main Running callback portconfigure::add_automatic_compiler_dependencies
756:debug:main Finished running callback portconfigure::add_automatic_compiler_dependencies
757:debug:main Running callback portbuild::add_automatic_buildsystem_dependencies
758:debug:main Finished running callback portbuild::add_automatic_buildsystem_dependencies
759:debug:main No need to upgrade! gsl 1.16_2 >= gsl 1.16_2
760:debug:main epoch: in tree: 0 installed: 0
761:debug:main py27-sip 4.15.3_0 exists in the ports tree
762:debug:main py27-sip 4.15.3_0 +universal is the latest installed
763:debug:main py27-sip 4.15.3_0 +universal is active
764:debug:main Merging existing variants '+universal' into variants
765:debug:main new fully merged portvariants: universal +
766:debug:main Changing to port directory: /opt/macports/var/macports/sources/rsync.macports.org/release/tarballs/ports/python/py-sip
767:debug:main OS darwin/12.5.0 (Mac OS X 10.8) arch i386
768:debug:main Re-registering default for build.cmd
769:debug:main Re-registering default for destroot.cmd
770:debug:main Re-registering default for destroot.destdir
771:debug:main adding the default universal variant
772:debug:main Reading variant descriptions from /opt/macports/var/macports/sources/rsync.macports.org/release/tarballs/ports/_resources/port1.0/variant_descriptions.conf
773:debug:main Executing variant universal provides universal
774:debug:main Running callback portconfigure::add_automatic_compiler_dependencies
775:debug:main Finished running callback portconfigure::add_automatic_compiler_dependencies
776:debug:main Running callback portbuild::add_automatic_buildsystem_dependencies
777:debug:main Finished running callback portbuild::add_automatic_buildsystem_dependencies
778:debug:main No need to upgrade! py27-sip 4.15.3_0 >= py27-sip 4.15.3_0
779:debug:main epoch: in tree: 0 installed: 0
780:debug:main py27-pyqt4 4.10.3_2 exists in the ports tree
781:debug:main py27-pyqt4 4.10.3_2 +scintilla is the latest installed
782:debug:main py27-pyqt4 4.10.3_2 +scintilla is active
783:debug:main Merging existing variants '+scintilla' into variants
784:debug:main new fully merged portvariants: scintilla +
785:debug:main Changing to port directory: /opt/macports/var/macports/sources/rsync.macports.org/release/tarballs/ports/python/py-pyqt4
786:debug:main OS darwin/12.5.0 (Mac OS X 10.8) arch i386
787:debug:main Re-registering default for build.cmd
788:debug:main Re-registering default for destroot.cmd
789:debug:main Re-registering default for destroot.destdir
790:debug:main adding the default universal variant
791:debug:main Reading variant descriptions from /opt/macports/var/macports/sources/rsync.macports.org/release/tarballs/ports/_resources/port1.0/variant_descriptions.conf
792:debug:main Executing variant scintilla provides scintilla
793:debug:main Running callback portconfigure::add_automatic_compiler_dependencies
794:debug:main Finished running callback portconfigure::add_automatic_compiler_dependencies
795:debug:main Running callback portbuild::add_automatic_buildsystem_dependencies
796:debug:main Finished running callback portbuild::add_automatic_buildsystem_dependencies
797:debug:main No need to upgrade! py27-pyqt4 4.10.3_2 >= py27-pyqt4 4.10.3_2
798:debug:main epoch: in tree: 0 installed: 0
799:debug:main dbus-python27 0.84.0_0 exists in the ports tree
800:debug:main dbus-python27 0.84.0_0  is the latest installed
801:debug:main dbus-python27 0.84.0_0 +universal is active
802:debug:main Merging existing variants '+universal' into variants
803:debug:main new fully merged portvariants: universal +
804:debug:main Changing to port directory: /opt/macports/var/macports/sources/rsync.macports.org/release/tarballs/ports/devel/dbus-python27
805:debug:main OS darwin/12.5.0 (Mac OS X 10.8) arch i386
806:debug:main adding the default universal variant
807:debug:main Reading variant descriptions from /opt/macports/var/macports/sources/rsync.macports.org/release/tarballs/ports/_resources/port1.0/variant_descriptions.conf
808:debug:main Executing variant universal provides universal
809:debug:main Running callback portconfigure::add_automatic_compiler_dependencies
810:debug:main Finished running callback portconfigure::add_automatic_compiler_dependencies
811:debug:main Running callback portbuild::add_automatic_buildsystem_dependencies
812:debug:main Finished running callback portbuild::add_automatic_buildsystem_dependencies
813:debug:main No need to upgrade! dbus-python27 0.84.0_0 >= dbus-python27 0.84.0_0
814:debug:main epoch: in tree: 0 installed: 0
815:debug:main dbus-glib 0.100.2_0 exists in the ports tree
816:debug:main dbus-glib 0.100.2_0  is the latest installed
817:debug:main dbus-glib 0.100.2_0 +universal is active
818:debug:main Merging existing variants '+universal' into variants
819:debug:main new fully merged portvariants: universal +
820:debug:main Changing to port directory: /opt/macports/var/macports/sources/rsync.macports.org/release/tarballs/ports/devel/dbus-glib
821:debug:main OS darwin/12.5.0 (Mac OS X 10.8) arch i386
822:debug:main adding the default universal variant
823:debug:main Reading variant descriptions from /opt/macports/var/macports/sources/rsync.macports.org/release/tarballs/ports/_resources/port1.0/variant_descriptions.conf
824:debug:main Executing variant universal provides universal
825:debug:main Running callback portconfigure::add_automatic_compiler_dependencies
826:debug:main Finished running callback portconfigure::add_automatic_compiler_dependencies
827:debug:main Running callback portbuild::add_automatic_buildsystem_dependencies
828:debug:main Finished running callback portbuild::add_automatic_buildsystem_dependencies
829:debug:main No need to upgrade! dbus-glib 0.100.2_0 >= dbus-glib 0.100.2_0
830:debug:main epoch: in tree: 0 installed: 0
831:debug:main glib2 2.38.2_0 exists in the ports tree
832:debug:main glib2 2.38.2_0 +universal is the latest installed
833:debug:main glib2 2.38.2_0 +universal is active
834:debug:main Merging existing variants '+universal' into variants
835:debug:main new fully merged portvariants: universal +
836:debug:main Changing to port directory: /opt/macports/var/macports/sources/rsync.macports.org/release/tarballs/ports/devel/glib2
837:debug:main OS darwin/12.5.0 (Mac OS X 10.8) arch i386
838:debug:main compiler clang 500.2.79 not blacklisted because it doesn't match {clang < 318}
839:debug:main adding the default universal variant
840:debug:main Reading variant descriptions from /opt/macports/var/macports/sources/rsync.macports.org/release/tarballs/ports/_resources/port1.0/variant_descriptions.conf
841:debug:main Executing variant universal provides universal
842:debug:main Running callback portconfigure::add_automatic_compiler_dependencies
843:debug:main Finished running callback portconfigure::add_automatic_compiler_dependencies
844:debug:main Running callback portbuild::add_automatic_buildsystem_dependencies
845:debug:main Finished running callback portbuild::add_automatic_buildsystem_dependencies
846:debug:main No need to upgrade! glib2 2.38.2_0 >= glib2 2.38.2_0
847:debug:main epoch: in tree: 0 installed: 0
848:debug:main libffi 3.0.13_0 exists in the ports tree
849:debug:main libffi 3.0.13_0  is the latest installed
850:debug:main libffi 3.0.13_0 +universal is active
851:debug:main Merging existing variants '+universal' into variants
852:debug:main new fully merged portvariants: universal +
853:debug:main Changing to port directory: /opt/macports/var/macports/sources/rsync.macports.org/release/tarballs/ports/devel/libffi
854:debug:main OS darwin/12.5.0 (Mac OS X 10.8) arch i386
855:debug:main Reading variant descriptions from /opt/macports/var/macports/sources/rsync.macports.org/release/tarballs/ports/_resources/port1.0/variant_descriptions.conf
856:debug:main universal variant already exists, so not adding the default one
857:debug:main Executing variant universal provides universal
858:debug:main Running callback portconfigure::add_automatic_compiler_dependencies
859:debug:main Finished running callback portconfigure::add_automatic_compiler_dependencies
860:debug:main Running callback portbuild::add_automatic_buildsystem_dependencies
861:debug:main Finished running callback portbuild::add_automatic_buildsystem_dependencies
862:debug:main No need to upgrade! libffi 3.0.13_0 >= libffi 3.0.13_0
863:debug:main epoch: in tree: 0 installed: 0
864:debug:main perl5 5.12.4_0 exists in the ports tree
865:debug:main perl5 5.12.4_0 +perl5_12 is the latest installed
866:debug:main perl5 5.12.4_0 +perl5_12 is active
867:debug:main Merging existing variants '+perl5_12' into variants
868:debug:main new fully merged portvariants: perl5_12 +
869:debug:main Changing to port directory: /opt/macports/var/macports/sources/rsync.macports.org/release/tarballs/ports/lang/perl5
870:debug:main OS darwin/12.5.0 (Mac OS X 10.8) arch i386
871:debug:main universal_variant is false, so not adding the default universal variant
872:debug:main Executing variant perl5_12 provides perl5_12
873:debug:main Running callback portconfigure::add_automatic_compiler_dependencies
874:debug:main Finished running callback portconfigure::add_automatic_compiler_dependencies
875:debug:main Running callback portbuild::add_automatic_buildsystem_dependencies
876:debug:main Finished running callback portbuild::add_automatic_buildsystem_dependencies
877:debug:main No need to upgrade! perl5 5.12.4_0 >= perl5 5.12.4_0
878:debug:main epoch: in tree: 0 installed: 0
879:debug:main perl5.12 5.12.4_3 exists in the ports tree
880:debug:main perl5.12 5.12.4_3 +universal is the latest installed
881:debug:main perl5.12 5.12.4_3 +universal is active
882:debug:main Merging existing variants '+universal' into variants
883:debug:main new fully merged portvariants: universal +
884:debug:main Changing to port directory: /opt/macports/var/macports/sources/rsync.macports.org/release/tarballs/ports/lang/perl5.12
885:debug:main OS darwin/12.5.0 (Mac OS X 10.8) arch i386
886:debug:main adding the default universal variant
887:debug:main Reading variant descriptions from /opt/macports/var/macports/sources/rsync.macports.org/release/tarballs/ports/_resources/port1.0/variant_descriptions.conf
888:debug:main Executing variant universal provides universal
889:debug:main Running callback portconfigure::add_automatic_compiler_dependencies
890:debug:main Finished running callback portconfigure::add_automatic_compiler_dependencies
891:debug:main Running callback portbuild::add_automatic_buildsystem_dependencies
892:debug:main Finished running callback portbuild::add_automatic_buildsystem_dependencies
893:debug:main No need to upgrade! perl5.12 5.12.4_3 >= perl5.12 5.12.4_3
894:debug:main epoch: in tree: 0 installed: 0
895:debug:main gdbm 1.10_2 exists in the ports tree
896:debug:main gdbm 1.10_2  is the latest installed
897:debug:main gdbm 1.10_2 +universal is active
898:debug:main Merging existing variants '+universal' into variants
899:debug:main new fully merged portvariants: universal +
900:debug:main Changing to port directory: /opt/macports/var/macports/sources/rsync.macports.org/release/tarballs/ports/databases/gdbm
901:debug:main OS darwin/12.5.0 (Mac OS X 10.8) arch i386
902:debug:main adding the default universal variant
903:debug:main Reading variant descriptions from /opt/macports/var/macports/sources/rsync.macports.org/release/tarballs/ports/_resources/port1.0/variant_descriptions.conf
904:debug:main Executing variant universal provides universal
905:debug:main Running callback portconfigure::add_automatic_compiler_dependencies
906:debug:main Finished running callback portconfigure::add_automatic_compiler_dependencies
907:debug:main Running callback portbuild::add_automatic_buildsystem_dependencies
908:debug:main Finished running callback portbuild::add_automatic_buildsystem_dependencies
909:debug:main No need to upgrade! gdbm 1.10_2 >= gdbm 1.10_2
910:debug:main epoch: in tree: 0 installed: 0
911:debug:main py27-gobject 2.28.6_0 exists in the ports tree
912:debug:main py27-gobject 2.28.6_0  is the latest installed
913:debug:main py27-gobject 2.28.6_0 +universal is active
914:debug:main Merging existing variants '+universal' into variants
915:debug:main new fully merged portvariants: universal +
916:debug:main Changing to port directory: /opt/macports/var/macports/sources/rsync.macports.org/release/tarballs/ports/python/py27-gobject
917:debug:main OS darwin/12.5.0 (Mac OS X 10.8) arch i386
918:debug:main adding the default universal variant
919:debug:main Reading variant descriptions from /opt/macports/var/macports/sources/rsync.macports.org/release/tarballs/ports/_resources/port1.0/variant_descriptions.conf
920:debug:main Executing variant universal provides universal
921:debug:main Running callback portconfigure::add_automatic_compiler_dependencies
922:debug:main Finished running callback portconfigure::add_automatic_compiler_dependencies
923:debug:main Running callback portbuild::add_automatic_buildsystem_dependencies
924:debug:main Finished running callback portbuild::add_automatic_buildsystem_dependencies
925:debug:main No need to upgrade! py27-gobject 2.28.6_0 >= py27-gobject 2.28.6_0
926:debug:main epoch: in tree: 0 installed: 0
927:debug:main libxslt 1.1.28_0 exists in the ports tree
928:debug:main libxslt 1.1.28_0  is the latest installed
929:debug:main libxslt 1.1.28_0 +universal is active
930:debug:main Merging existing variants '+universal' into variants
931:debug:main new fully merged portvariants: universal +
932:debug:main Changing to port directory: /opt/macports/var/macports/sources/rsync.macports.org/release/tarballs/ports/textproc/libxslt
933:debug:main OS darwin/12.5.0 (Mac OS X 10.8) arch i386
934:debug:main adding the default universal variant
935:debug:main Reading variant descriptions from /opt/macports/var/macports/sources/rsync.macports.org/release/tarballs/ports/_resources/port1.0/variant_descriptions.conf
936:debug:main Executing variant universal provides universal
937:debug:main Running callback portconfigure::add_automatic_compiler_dependencies
938:debug:main Finished running callback portconfigure::add_automatic_compiler_dependencies
939:debug:main Running callback portbuild::add_automatic_buildsystem_dependencies
940:debug:main Finished running callback portbuild::add_automatic_buildsystem_dependencies
941:debug:main No need to upgrade! libxslt 1.1.28_0 >= libxslt 1.1.28_0
942:debug:main epoch: in tree: 0 installed: 0
943:debug:main qscintilla 2.7.2_0 exists in the ports tree
944:debug:main qscintilla 2.7.2_0  is the latest installed
945:debug:main qscintilla 2.7.2_0 +universal is active
946:debug:main Merging existing variants '+universal' into variants
947:debug:main new fully merged portvariants: universal +
948:debug:main Changing to port directory: /opt/macports/var/macports/sources/rsync.macports.org/release/tarballs/ports/devel/qscintilla
949:debug:main OS darwin/12.5.0 (Mac OS X 10.8) arch i386
950:debug:main adding the default universal variant
951:debug:main Reading variant descriptions from /opt/macports/var/macports/sources/rsync.macports.org/release/tarballs/ports/_resources/port1.0/variant_descriptions.conf
952:debug:main Executing variant universal provides universal
953:debug:main Running callback portconfigure::add_automatic_compiler_dependencies
954:debug:main Finished running callback portconfigure::add_automatic_compiler_dependencies
955:debug:main Running callback portbuild::add_automatic_buildsystem_dependencies
956:debug:main Finished running callback portbuild::add_automatic_buildsystem_dependencies
957:debug:main No need to upgrade! qscintilla 2.7.2_0 >= qscintilla 2.7.2_0
958:msg:main --->  Computing dependencies for qtiplot:info:main .:debug:main qtiplot has no conflicts
959:debug:main Found Dependency: path: /usr/bin filename: unzip regex: ^unzip$
960:debug:main Searching for dependency: unzip
961:debug:main Didn't find receipt, going to depspec regex for: unzip
962:debug:main Found Dependency: path: /usr/bin filename: unzip regex: ^unzip$
963:debug:main Searching for dependency: pkgconfig
964:debug:main Found Dependency: receipt exists for pkgconfig
965:debug:main Searching for dependency: qt4-mac
966:debug:main Found Dependency: receipt exists for qt4-mac
967:debug:main Searching for dependency: muparser
968:debug:main Found Dependency: receipt exists for muparser
969:debug:main Searching for dependency: boost
970:debug:main Found Dependency: receipt exists for boost
971:debug:main Searching for dependency: gsl
972:debug:main Found Dependency: receipt exists for gsl
973:debug:main Searching for dependency: libpng
974:debug:main Found Dependency: receipt exists for libpng
975:debug:main Searching for dependency: zlib
976:debug:main Found Dependency: receipt exists for zlib
977:debug:main Searching for dependency: python27
978:debug:main Found Dependency: receipt exists for python27
979:debug:main Searching for dependency: py27-sip
980:debug:main Found Dependency: receipt exists for py27-sip
981:debug:main Searching for dependency: py27-pyqt4
982:debug:main Found Dependency: receipt exists for py27-pyqt4
983:msg:main
984:debug:main Executing org.macports.main (qtiplot)
985:debug:main changing euid/egid - current euid: 0 - current egid: 0
986:debug:main egid changed to: 504
987:debug:main euid changed to: 63920313
988:debug:main Skipping completed org.macports.archivefetch (qtiplot)
989:debug:main Privilege de-escalation not attempted as not running as root.
990:debug:main Skipping completed org.macports.fetch (qtiplot)
991:debug:main Privilege de-escalation not attempted as not running as root.
992:debug:main Skipping completed org.macports.checksum (qtiplot)
993:debug:main Privilege de-escalation not attempted as not running as root.
994:debug:main Skipping completed org.macports.extract (qtiplot)
995:debug:main Privilege de-escalation not attempted as not running as root.
996:debug:main Skipping completed org.macports.patch (qtiplot)
997:debug:main Privilege de-escalation not attempted as not running as root.
998:debug:main Skipping completed org.macports.configure (qtiplot)
999:debug:main Privilege de-escalation not attempted as not running as root.
1000:debug:build build phase started at Tue Dec 24 07:39:57 CST 2013
1001:notice:build --->  Building qtiplot
1002:debug:build Executing org.macports.build (qtiplot)
1003:debug:build Environment: CPATH='/opt/macports/include' CC_PRINT_OPTIONS_FILE='/opt/macports/var/macports/build/_opt_macports_var_macports_sources_rsync.macports.org_release_tarballs_ports_aqua_qtiplot/qtiplot/work/.CC_PRINT_OPTIONS' QTDIR='/opt/macports' LIBRARY_PATH='/opt/macports/lib' CC_PRINT_OPTIONS='YES' MACOSX_DEPLOYMENT_TARGET='10.8' QMAKESPEC='macx-g++' MOC='/opt/macports/bin/moc' QMAKE='/opt/macports/bin/qmake'
1004:debug:build Assembled command: 'cd "/opt/macports/var/macports/build/_opt_macports_var_macports_sources_rsync.macports.org_release_tarballs_ports_aqua_qtiplot/qtiplot/work/qtiplot-0.9.8.9" && /usr/bin/make -j8 -w all'
1005:debug:build Executing command line:  cd "/opt/macports/var/macports/build/_opt_macports_var_macports_sources_rsync.macports.org_release_tarballs_ports_aqua_qtiplot/qtiplot/work/qtiplot-0.9.8.9" && /usr/bin/make -j8 -w all
1006:info:build make: Entering directory `/opt/macports/var/macports/build/_opt_macports_var_macports_sources_rsync.macports.org_release_tarballs_ports_aqua_qtiplot/qtiplot/work/qtiplot-0.9.8.9'
1007:info:build cd fitPlugins/ && /usr/bin/make -f Makefile all
1008:info:build cd 3rdparty/qwt/ && /usr/bin/make -f Makefile all
1009:info:build cd 3rdparty/qwtplot3d/ && /usr/bin/make -f Makefile all
1010:info:build cd qtiplot/ && /usr/bin/make -f Makefile all
1011:info:build make[1]: Entering directory `/opt/macports/var/macports/build/_opt_macports_var_macports_sources_rsync.macports.org_release_tarballs_ports_aqua_qtiplot/qtiplot/work/qtiplot-0.9.8.9/fitPlugins'
1012:info:build cd explin/ && /usr/bin/make -f Makefile all
1013:info:build cd exp_saturation/ && /usr/bin/make -f Makefile all
1014:info:build cd fitRational0/ && /usr/bin/make -f Makefile all
1015:info:build cd fitRational1/ && /usr/bin/make -f Makefile all
1016:info:build make[1]: Entering directory `/opt/macports/var/macports/build/_opt_macports_var_macports_sources_rsync.macports.org_release_tarballs_ports_aqua_qtiplot/qtiplot/work/qtiplot-0.9.8.9/3rdparty/qwt'
1017:info:build cd src/ && /usr/bin/make -f Makefile all
1018:info:build cd planck_wavelength/ && /usr/bin/make -f Makefile all
1019:info:build make[1]: Entering directory `/opt/macports/var/macports/build/_opt_macports_var_macports_sources_rsync.macports.org_release_tarballs_ports_aqua_qtiplot/qtiplot/work/qtiplot-0.9.8.9/3rdparty/qwtplot3d'
1020:info:build make[1]: Nothing to be done for `all'.
1021:info:build make[1]: Leaving directory `/opt/macports/var/macports/build/_opt_macports_var_macports_sources_rsync.macports.org_release_tarballs_ports_aqua_qtiplot/qtiplot/work/qtiplot-0.9.8.9/3rdparty/qwtplot3d'
1022:info:build make[1]: Entering directory `/opt/macports/var/macports/build/_opt_macports_var_macports_sources_rsync.macports.org_release_tarballs_ports_aqua_qtiplot/qtiplot/work/qtiplot-0.9.8.9/qtiplot'
1023:info:build /usr/bin/clang++ -c -pipe -O2 -Wall -W -DSCRIPTING_CONSOLE -DSCRIPTING_DIALOG -DSVN_REVISION="\"\"" -DQT_PLUGIN -DSCRIPTING_MUPARSER -DSCRIPTING_PYTHON -DGL2PS_HAVE_LIBPNG -DQT_NO_DEBUG -DQT_SVG_LIB -DQT_QT3SUPPORT_LIB -DQT3_SUPPORT -DQT_XML_LIB -DQT_OPENGL_LIB -DQT_GUI_LIB -DQT_NETWORK_LIB -DQT_CORE_LIB -DQT_SHARED -I/opt/macports/share/qt4/mkspecs/macx-g++ -I. -I/opt/macports/var/macports/build/_opt_macports_var_macports_sources_rsync.macports.org_release_tarballs_ports_aqua_qtiplot/qtiplot/work/qtiplot-0.9.8.9/tmp/qtiplot -I/opt/macports/Library/Frameworks/QtCore.framework/Versions/4/Headers -I/opt/macports/Library/Frameworks/QtNetwork.framework/Versions/4/Headers -I/opt/macports/Library/Frameworks/QtGui.framework/Versions/4/Headers -I/opt/macports/Library/Frameworks/QtOpenGL.framework/Versions/4/Headers -I/opt/macports/Library/Frameworks/QtXml.framework/Versions/4/Headers -I/opt/macports/Library/Frameworks/Qt3Support.framework/Versions/4/Headers -I/opt/macports/Library/Frameworks/QtSvg.framework/Versions/4/Headers -I../3rdparty/qwt/src -I../3rdparty/qwtplot3d/include -Iicons -Isrc/analysis -Isrc/analysis/dialogs -Isrc/core -Isrc/excel -Isrc/lib/include -Isrc/lib/3rdparty/qtcolorpicker/src -Isrc/plot2D -Isrc/plot2D/dialogs -Isrc/plot3D -Isrc/matrix -Isrc/table -Isrc/scripting -I/opt/macports/Library/Frameworks/Python.framework/Versions/2.7/include/python2.7 -I/System/Library/Frameworks/OpenGL.framework/Versions/A/Headers -I/System/Library/Frameworks/AGL.framework/Headers -I/opt/macports/Library/Frameworks/QtSvg.framework/Versions/4/Headers -I/opt/macports/Library/Frameworks/Qt3Support.framework/Versions/4/Headers -I/opt/macports/Library/Frameworks/QtXml.framework/Versions/4/Headers -I/opt/macports/Library/Frameworks/QtOpenGL.framework/Versions/4/Headers -I/opt/macports/Library/Frameworks/QtGui.framework/Versions/4/Headers -I/opt/macports/Library/Frameworks/QtNetwork.framework/Versions/4/Headers -I/opt/macports/Library/Frameworks/QtCore.framework/Versions/4/Headers -I/opt/macports/include -F/opt/macports/Library/Frameworks -F/opt/macports/lib -o ../tmp/qtiplot/qtcolorpicker.o src/lib/3rdparty/qtcolorpicker/src/qtcolorpicker.cpp
1024:info:build /usr/bin/clang++ -c -pipe -O2 -Wall -W -DSCRIPTING_CONSOLE -DSCRIPTING_DIALOG -DSVN_REVISION="\"\"" -DQT_PLUGIN -DSCRIPTING_MUPARSER -DSCRIPTING_PYTHON -DGL2PS_HAVE_LIBPNG -DQT_NO_DEBUG -DQT_SVG_LIB -DQT_QT3SUPPORT_LIB -DQT3_SUPPORT -DQT_XML_LIB -DQT_OPENGL_LIB -DQT_GUI_LIB -DQT_NETWORK_LIB -DQT_CORE_LIB -DQT_SHARED -I/opt/macports/share/qt4/mkspecs/macx-g++ -I. -I/opt/macports/var/macports/build/_opt_macports_var_macports_sources_rsync.macports.org_release_tarballs_ports_aqua_qtiplot/qtiplot/work/qtiplot-0.9.8.9/tmp/qtiplot -I/opt/macports/Library/Frameworks/QtCore.framework/Versions/4/Headers -I/opt/macports/Library/Frameworks/QtNetwork.framework/Versions/4/Headers -I/opt/macports/Library/Frameworks/QtGui.framework/Versions/4/Headers -I/opt/macports/Library/Frameworks/QtOpenGL.framework/Versions/4/Headers -I/opt/macports/Library/Frameworks/QtXml.framework/Versions/4/Headers -I/opt/macports/Library/Frameworks/Qt3Support.framework/Versions/4/Headers -I/opt/macports/Library/Frameworks/QtSvg.framework/Versions/4/Headers -I../3rdparty/qwt/src -I../3rdparty/qwtplot3d/include -Iicons -Isrc/analysis -Isrc/analysis/dialogs -Isrc/core -Isrc/excel -Isrc/lib/include -Isrc/lib/3rdparty/qtcolorpicker/src -Isrc/plot2D -Isrc/plot2D/dialogs -Isrc/plot3D -Isrc/matrix -Isrc/table -Isrc/scripting -I/opt/macports/Library/Frameworks/Python.framework/Versions/2.7/include/python2.7 -I/System/Library/Frameworks/OpenGL.framework/Versions/A/Headers -I/System/Library/Frameworks/AGL.framework/Headers -I/opt/macports/Library/Frameworks/QtSvg.framework/Versions/4/Headers -I/opt/macports/Library/Frameworks/Qt3Support.framework/Versions/4/Headers -I/opt/macports/Library/Frameworks/QtXml.framework/Versions/4/Headers -I/opt/macports/Library/Frameworks/QtOpenGL.framework/Versions/4/Headers -I/opt/macports/Library/Frameworks/QtGui.framework/Versions/4/Headers -I/opt/macports/Library/Frameworks/QtNetwork.framework/Versions/4/Headers -I/opt/macports/Library/Frameworks/QtCore.framework/Versions/4/Headers -I/opt/macports/include -F/opt/macports/Library/Frameworks -F/opt/macports/lib -o ../tmp/qtiplot/sipqtiImageWidget.o ../tmp/qtiplot/sipqtiImageWidget.cpp
1025:info:build make[2]: Entering directory `/opt/macports/var/macports/build/_opt_macports_var_macports_sources_rsync.macports.org_release_tarballs_ports_aqua_qtiplot/qtiplot/work/qtiplot-0.9.8.9/fitPlugins/fitRational0'
1026:info:build make[2]: Nothing to be done for `all'.
1027:info:build make[2]: Leaving directory `/opt/macports/var/macports/build/_opt_macports_var_macports_sources_rsync.macports.org_release_tarballs_ports_aqua_qtiplot/qtiplot/work/qtiplot-0.9.8.9/fitPlugins/fitRational0'
1028:info:build make[2]: Entering directory `/opt/macports/var/macports/build/_opt_macports_var_macports_sources_rsync.macports.org_release_tarballs_ports_aqua_qtiplot/qtiplot/work/qtiplot-0.9.8.9/fitPlugins/explin'
1029:info:build make[2]: Nothing to be done for `all'.
1030:info:build make[2]: Leaving directory `/opt/macports/var/macports/build/_opt_macports_var_macports_sources_rsync.macports.org_release_tarballs_ports_aqua_qtiplot/qtiplot/work/qtiplot-0.9.8.9/fitPlugins/explin'
1031:info:build make[2]: Entering directory `/opt/macports/var/macports/build/_opt_macports_var_macports_sources_rsync.macports.org_release_tarballs_ports_aqua_qtiplot/qtiplot/work/qtiplot-0.9.8.9/fitPlugins/fitRational1'
1032:info:build make[2]: Nothing to be done for `all'.
1033:info:build make[2]: Leaving directory `/opt/macports/var/macports/build/_opt_macports_var_macports_sources_rsync.macports.org_release_tarballs_ports_aqua_qtiplot/qtiplot/work/qtiplot-0.9.8.9/fitPlugins/fitRational1'
1034:info:build make[2]: Entering directory `/opt/macports/var/macports/build/_opt_macports_var_macports_sources_rsync.macports.org_release_tarballs_ports_aqua_qtiplot/qtiplot/work/qtiplot-0.9.8.9/fitPlugins/exp_saturation'
1035:info:build make[2]: Nothing to be done for `all'.
1036:info:build make[2]: Leaving directory `/opt/macports/var/macports/build/_opt_macports_var_macports_sources_rsync.macports.org_release_tarballs_ports_aqua_qtiplot/qtiplot/work/qtiplot-0.9.8.9/fitPlugins/exp_saturation'
1037:info:build /usr/bin/clang++ -c -pipe -O2 -Wall -W -DSCRIPTING_CONSOLE -DSCRIPTING_DIALOG -DSVN_REVISION="\"\"" -DQT_PLUGIN -DSCRIPTING_MUPARSER -DSCRIPTING_PYTHON -DGL2PS_HAVE_LIBPNG -DQT_NO_DEBUG -DQT_SVG_LIB -DQT_QT3SUPPORT_LIB -DQT3_SUPPORT -DQT_XML_LIB -DQT_OPENGL_LIB -DQT_GUI_LIB -DQT_NETWORK_LIB -DQT_CORE_LIB -DQT_SHARED -I/opt/macports/share/qt4/mkspecs/macx-g++ -I. -I/opt/macports/var/macports/build/_opt_macports_var_macports_sources_rsync.macports.org_release_tarballs_ports_aqua_qtiplot/qtiplot/work/qtiplot-0.9.8.9/tmp/qtiplot -I/opt/macports/Library/Frameworks/QtCore.framework/Versions/4/Headers -I/opt/macports/Library/Frameworks/QtNetwork.framework/Versions/4/Headers -I/opt/macports/Library/Frameworks/QtGui.framework/Versions/4/Headers -I/opt/macports/Library/Frameworks/QtOpenGL.framework/Versions/4/Headers -I/opt/macports/Library/Frameworks/QtXml.framework/Versions/4/Headers -I/opt/macports/Library/Frameworks/Qt3Support.framework/Versions/4/Headers -I/opt/macports/Library/Frameworks/QtSvg.framework/Versions/4/Headers -I../3rdparty/qwt/src -I../3rdparty/qwtplot3d/include -Iicons -Isrc/analysis -Isrc/analysis/dialogs -Isrc/core -Isrc/excel -Isrc/lib/include -Isrc/lib/3rdparty/qtcolorpicker/src -Isrc/plot2D -Isrc/plot2D/dialogs -Isrc/plot3D -Isrc/matrix -Isrc/table -Isrc/scripting -I/opt/macports/Library/Frameworks/Python.framework/Versions/2.7/include/python2.7 -I/System/Library/Frameworks/OpenGL.framework/Versions/A/Headers -I/System/Library/Frameworks/AGL.framework/Headers -I/opt/macports/Library/Frameworks/QtSvg.framework/Versions/4/Headers -I/opt/macports/Library/Frameworks/Qt3Support.framework/Versions/4/Headers -I/opt/macports/Library/Frameworks/QtXml.framework/Versions/4/Headers -I/opt/macports/Library/Frameworks/QtOpenGL.framework/Versions/4/Headers -I/opt/macports/Library/Frameworks/QtGui.framework/Versions/4/Headers -I/opt/macports/Library/Frameworks/QtNetwork.framework/Versions/4/Headers -I/opt/macports/Library/Frameworks/QtCore.framework/Versions/4/Headers -I/opt/macports/include -F/opt/macports/Library/Frameworks -F/opt/macports/lib -o ../tmp/qtiplot/sipqtiBoxCurve.o ../tmp/qtiplot/sipqtiBoxCurve.cpp
1038:info:build make[2]: Entering directory `/opt/macports/var/macports/build/_opt_macports_var_macports_sources_rsync.macports.org_release_tarballs_ports_aqua_qtiplot/qtiplot/work/qtiplot-0.9.8.9/3rdparty/qwt/src'
1039:info:build make[2]: Nothing to be done for `all'.
1040:info:build /usr/bin/clang++ -c -pipe -O2 -Wall -W -DSCRIPTING_CONSOLE -DSCRIPTING_DIALOG -DSVN_REVISION="\"\"" -DQT_PLUGIN -DSCRIPTING_MUPARSER -DSCRIPTING_PYTHON -DGL2PS_HAVE_LIBPNG -DQT_NO_DEBUG -DQT_SVG_LIB -DQT_QT3SUPPORT_LIB -DQT3_SUPPORT -DQT_XML_LIB -DQT_OPENGL_LIB -DQT_GUI_LIB -DQT_NETWORK_LIB -DQT_CORE_LIB -DQT_SHARED -I/opt/macports/share/qt4/mkspecs/macx-g++ -I. -I/opt/macports/var/macports/build/_opt_macports_var_macports_sources_rsync.macports.org_release_tarballs_ports_aqua_qtiplot/qtiplot/work/qtiplot-0.9.8.9/tmp/qtiplot -I/opt/macports/Library/Frameworks/QtCore.framework/Versions/4/Headers -I/opt/macports/Library/Frameworks/QtNetwork.framework/Versions/4/Headers -I/opt/macports/Library/Frameworks/QtGui.framework/Versions/4/Headers -I/opt/macports/Library/Frameworks/QtOpenGL.framework/Versions/4/Headers -I/opt/macports/Library/Frameworks/QtXml.framework/Versions/4/Headers -I/opt/macports/Library/Frameworks/Qt3Support.framework/Versions/4/Headers -I/opt/macports/Library/Frameworks/QtSvg.framework/Versions/4/Headers -I../3rdparty/qwt/src -I../3rdparty/qwtplot3d/include -Iicons -Isrc/analysis -Isrc/analysis/dialogs -Isrc/core -Isrc/excel -Isrc/lib/include -Isrc/lib/3rdparty/qtcolorpicker/src -Isrc/plot2D -Isrc/plot2D/dialogs -Isrc/plot3D -Isrc/matrix -Isrc/table -Isrc/scripting -I/opt/macports/Library/Frameworks/Python.framework/Versions/2.7/include/python2.7 -I/System/Library/Frameworks/OpenGL.framework/Versions/A/Headers -I/System/Library/Frameworks/AGL.framework/Headers -I/opt/macports/Library/Frameworks/QtSvg.framework/Versions/4/Headers -I/opt/macports/Library/Frameworks/Qt3Support.framework/Versions/4/Headers -I/opt/macports/Library/Frameworks/QtXml.framework/Versions/4/Headers -I/opt/macports/Library/Frameworks/QtOpenGL.framework/Versions/4/Headers -I/opt/macports/Library/Frameworks/QtGui.framework/Versions/4/Headers -I/opt/macports/Library/Frameworks/QtNetwork.framework/Versions/4/Headers -I/opt/macports/Library/Frameworks/QtCore.framework/Versions/4/Headers -I/opt/macports/include -F/opt/macports/Librarmake[2]: Leaving directory `/opt/macports/var/macports/build/_opt_macports_var_macports_sources_rsync.macports.org_release_tarballs_ports_aqua_qtiplot/qtiplot/work/qtiplot-0.9.8.9/3rdparty/qwt/src'
1041:info:build y/Frameworks -F/opt/macports/lib -o ../tmp/qtiplot/sipqtiPieCurve.o ../tmp/qtiplot/sipqtiPieCurve.cpp
1042:info:build /usr/bin/clang++ -c -pipe -O2 -Wall -W -DSCRIPTING_CONSOLE -DSCRIPTING_DIALOG -DSVN_REVISION="\"\"" -DQT_PLUGIN -DSCRIPTING_MUPARSER -DSCRIPTING_PYTHON -DGL2PS_HAVE_LIBPNG -DQT_NO_DEBUG -DQT_SVG_LIB -DQT_QT3SUPPORT_LIB -DQT3_SUPPORT -DQT_XML_LIB -DQT_OPENGL_LIB -DQT_GUI_LIB -DQT_NETWORK_LIB -DQT_CORE_LIB -DQT_SHARED -I/opt/macports/share/qt4/mkspecs/macx-g++ -I. -I/opt/macports/var/macports/build/_opt_macports_var_macports_sources_rsync.macports.org_release_tarballs_ports_aqua_qtiplot/qtiplot/work/qtiplot-0.9.8.9/tmp/qtiplot -I/opt/macports/Library/Frameworks/QtCore.framework/Versions/4/Headers -I/opt/macports/Library/Frameworks/QtNetwork.framework/Versions/4/Headers -I/opt/macports/Library/Frameworks/QtGui.framework/Versions/4/Headers -I/opt/macports/Library/Frameworks/QtOpenGL.framework/Versions/4/Headers -I/opt/macports/Library/Frameworks/QtXml.framework/Versions/4/Headers -I/opt/macports/Library/Frameworks/Qt3Support.framework/Versions/4/Headers -I/opt/macports/Library/Frameworks/QtSvg.framework/Versions/4/Headers -I../3rdparty/qwt/src -I../3rdparty/qwtplot3d/include -Iicons -Isrc/analysis -Isrc/analysis/dialogs -Isrc/core -Isrc/excel -Isrc/lib/include -Isrc/lib/3rdparty/qtcolorpicker/src -Isrc/plot2D -Isrc/plot2D/dialogs -Isrc/plot3D -Isrc/matrix -Isrc/table -Isrc/scripting -I/opt/macports/Library/Frameworks/Python.framework/Versions/2.7/include/python2.7 -I/System/Library/Frameworks/OpenGL.framework/Versions/A/Headers -I/System/Library/Frameworks/AGL.framework/Headers -I/opt/macports/Library/Frameworks/QtSvg.framework/Versions/4/Headers -I/opt/macports/Library/Frameworks/Qt3Support.framework/Versions/4/Headers -I/opt/macports/Library/Frameworks/QtXml.framework/Versions/4/Headers -I/opt/macports/Library/Frameworks/QtOpenGL.framework/Versions/4/Headers -I/opt/macports/Library/Frameworks/QtGui.framework/Versions/4/Headers -I/opt/macports/Library/Frameworks/QtNetwork.framework/Versions/4/Headers -I/opt/macports/Library/Frameworks/QtCore.framework/Versions/4/Headers -I/opt/macports/include -F/opt/macports/Library/Frameworks -F/opt/macports/lib -o ../tmp/qtiplot/sipqtiPlotCurve.o ../tmp/qtiplot/sipqtiPlotCurve.cpp
1043:info:build /usr/bin/clang++ -c -pipe -O2 -Wall -W -DSCRIPTING_CONSOLE -DSCRIPTING_DIALOG -DSVN_REVISION="\"\"" -DQT_PLUGIN -DSCRIPTING_MUPARSER -DSCRIPTING_PYTHON -DGL2PS_HAVE_LIBPNG -DQT_NO_DEBUG -DQT_SVG_LIB -DQT_QT3SUPPORT_LIB -DQT3_SUPPORT -DQT_XML_LIB -DQT_OPENGL_LIB -DQT_GUI_LIB -DQT_NETWORK_LIB -DQT_CORE_LIB -DQT_SHARED -I/opt/macports/share/qt4/mkspecs/macx-g++ -I. -I/opt/macports/var/macports/build/_opt_macports_var_macports_sources_rsync.macports.org_release_tarballs_ports_aqua_qtiplot/qtiplot/work/qtiplot-0.9.8.9/tmp/qtiplot -I/opt/macports/Library/Frameworks/QtCore.framework/Versions/4/Headers -I/opt/macports/Library/Frameworks/QtNetwork.framework/Versions/4/Headers -I/opt/macports/Library/Frameworks/QtGui.framework/Versions/4/Headers -I/opt/macports/Library/Frameworks/QtOpenGL.framework/Versions/4/Headers -I/opt/macports/Library/Frameworks/QtXml.framework/Versions/4/Headers -I/opt/macports/Library/Frameworks/Qt3Support.framework/Versions/4/Headers -I/opt/macports/Library/Frameworks/QtSvg.framework/Versions/4/Headers -I../3rdparty/qwt/src -I../3rdparty/qwtplot3d/include -Iicons -Isrc/analysis -Isrc/analysis/dialogs -Isrc/core -Isrc/excel -Isrc/lib/include -Isrc/lib/3rdparty/qtcolorpicker/src -Isrc/plot2D -Isrc/plot2D/dialogs -Isrc/plot3D -Isrc/matrix -Isrc/table -Isrc/scripting -I/opt/macports/Library/Frameworks/Python.framework/Versions/2.7/include/python2.7 -I/System/Library/Frameworks/OpenGL.framework/Versions/A/Headers -I/System/Library/Frameworks/AGL.framework/Headers -I/opt/macports/Library/Frameworks/QtSvg.framework/Versions/4/Headers -I/opt/macports/Library/Frameworks/Qt3Support.framework/Versions/4/Headers -I/opt/macports/Library/Frameworks/QtXml.framework/Versions/4/Headers -I/opt/macports/Library/Frameworks/QtOpenGL.framework/Versions/4/Headers -I/opt/macports/Library/Frameworks/QtGui.framework/Versions/4/Headers -I/opt/macports/Library/Frameworks/QtNetwork.framework/Versions/4/Headers -I/opt/macports/Library/Frameworks/QtCore.framework/Versions/4/Headers -I/opt/macports/include -F/opt/macports/Library/Frameworks -F/opt/macports/lib -o ../tmp/qtiplot/sipqtiFunctionCurve.o ../tmp/qtiplot/sipqtiFunctionCurve.cpp
1044:info:build make[1]: Leaving directory `/opt/macports/var/macports/build/_opt_macports_var_macports_sources_rsync.macports.org_release_tarballs_ports_aqua_qtiplot/qtiplot/work/qtiplot-0.9.8.9/3rdparty/qwt'
1045:info:build /usr/bin/clang++ -c -pipe -O2 -Wall -W -DSCRIPTING_CONSOLE -DSCRIPTING_DIALOG -DSVN_REVISION="\"\"" -DQT_PLUGIN -DSCRIPTING_MUPARSER -DSCRIPTING_PYTHON -DGL2PS_HAVE_LIBPNG -DQT_NO_DEBUG -DQT_SVG_LIB -DQT_QT3SUPPORT_LIB -DQT3_SUPPORT -DQT_XML_LIB -DQT_OPENGL_LIB -DQT_GUI_LIB -DQT_NETWORK_LIB -DQT_CORE_LIB -DQT_SHARED -I/opt/macports/share/qt4/mkspecs/macx-g++ -I. -I/opt/macports/var/macports/build/_opt_macports_var_macports_sources_rsync.macports.org_release_tarballs_ports_aqua_qtiplot/qtiplot/work/qtiplot-0.9.8.9/tmp/qtiplot -I/opt/macports/Library/Frameworks/QtCore.framework/Versions/4/Headers -I/opt/macports/Library/Frameworks/QtNetwork.framework/Versions/4/Headers -I/opt/macports/Library/Frameworks/QtGui.framework/Versions/4/Headers -I/opt/macports/Library/Frameworks/QtOpenGL.framework/Versions/4/Headers -I/opt/macports/Library/Frameworks/QtXml.framework/Versions/4/Headers -I/opt/macports/Library/Frameworks/Qt3Support.framework/Versions/4/Headers -I/opt/macports/Library/Frameworks/QtSvg.framework/Versions/4/Headers -I../3rdparty/qwt/src -I../3rdparty/qwtplot3d/include -Iicons -Isrc/analysis -Isrc/analysis/dialogs -Isrc/core -Isrc/excel -Isrc/lib/include -Isrc/lib/3rdparty/qtcolorpicker/src -Isrc/plot2D -Isrc/plot2D/dialogs -Isrc/plot3D -Isrc/matrix -Isrc/table -Isrc/scripting -I/opt/macports/Library/Frameworks/Python.framework/Versions/2.7/include/python2.7 -I/System/Library/Frameworks/OpenGL.framework/Versions/A/Headers -I/System/Library/Frameworks/AGL.framework/Headers -I/opt/macports/Library/Frameworks/QtSvg.framework/Versions/4/Headers -I/opt/macports/Library/Frameworks/Qt3Support.framework/Versions/4/Headers -I/opt/macports/Library/Frameworks/QtXml.framework/Versions/4/Headers -I/opt/macports/Library/Frameworks/QtOpenGL.framework/Versions/4/Headers -I/opt/macports/Library/Frameworks/QtGui.framework/Versions/4/Headers -I/opt/macports/Library/Frameworks/QtNetwork.framework/Versions/4/Headers -I/opt/macports/Library/Frameworks/QtCore.framework/Versions/4/Headers -I/opt/macports/include -F/opt/macports/Library/Frameworks -F/opt/macports/lib -o ../tmp/qtiplot/sipqtiDataCurve.o ../tmp/qtiplot/sipqtiDataCurve.cpp
1046:info:build make[2]: Entering directory `/opt/macports/var/macports/build/_opt_macports_var_macports_sources_rsync.macports.org_release_tarballs_ports_aqua_qtiplot/qtiplot/work/qtiplot-0.9.8.9/fitPlugins/planck_wavelength'
1047:info:build make[2]: Nothing to be done for `all'.
1048:info:build make[2]: Leaving directory `/opt/macports/var/macports/build/_opt_macports_var_macports_sources_rsync.macports.org_release_tarballs_ports_aqua_qtiplot/qtiplot/work/qtiplot-0.9.8.9/fitPlugins/planck_wavelength'
1049:info:build make[1]: Leaving directory `/opt/macports/var/macports/build/_opt_macports_var_macports_sources_rsync.macports.org_release_tarballs_ports_aqua_qtiplot/qtiplot/work/qtiplot-0.9.8.9/fitPlugins'
1050:info:build /usr/bin/clang++ -c -pipe -O2 -Wall -W -DSCRIPTING_CONSOLE -DSCRIPTING_DIALOG -DSVN_REVISION="\"\"" -DQT_PLUGIN -DSCRIPTING_MUPARSER -DSCRIPTING_PYTHON -DGL2PS_HAVE_LIBPNG -DQT_NO_DEBUG -DQT_SVG_LIB -DQT_QT3SUPPORT_LIB -DQT3_SUPPORT -DQT_XML_LIB -DQT_OPENGL_LIB -DQT_GUI_LIB -DQT_NETWORK_LIB -DQT_CORE_LIB -DQT_SHARED -I/opt/macports/share/qt4/mkspecs/macx-g++ -I. -I/opt/macports/var/macports/build/_opt_macports_var_macports_sources_rsync.macports.org_release_tarballs_ports_aqua_qtiplot/qtiplot/work/qtiplot-0.9.8.9/tmp/qtiplot -I/opt/macports/Library/Frameworks/QtCore.framework/Versions/4/Headers -I/opt/macports/Library/Frameworks/QtNetwork.framework/Versions/4/Headers -I/opt/macports/Library/Frameworks/QtGui.framework/Versions/4/Headers -I/opt/macports/Library/Frameworks/QtOpenGL.framework/Versions/4/Headers -I/opt/macports/Library/Frameworks/QtXml.framework/Versions/4/Headers -I/opt/macports/Library/Frameworks/Qt3Support.framework/Versions/4/Headers -I/opt/macports/Library/Frameworks/QtSvg.framework/Versions/4/Headers -I../3rdparty/qwt/src -I../3rdparty/qwtplot3d/include -Iicons -Isrc/analysis -Isrc/analysis/dialogs -Isrc/core -Isrc/excel -Isrc/lib/include -Isrc/lib/3rdparty/qtcolorpicker/src -Isrc/plot2D -Isrc/plot2D/dialogs -Isrc/plot3D -Isrc/matrix -Isrc/table -Isrc/scripting -I/opt/macports/Library/Frameworks/Python.framework/Versions/2.7/include/python2.7 -I/System/Library/Frameworks/OpenGL.framework/Versions/A/Headers -I/System/Library/Frameworks/AGL.framework/Headers -I/opt/macports/Library/Frameworks/QtSvg.framework/Versions/4/Headers -I/opt/macports/Library/Frameworks/Qt3Support.framework/Versions/4/Headers -I/opt/macports/Library/Frameworks/QtXml.framework/Versions/4/Headers -I/opt/macports/Library/Frameworks/QtOpenGL.framework/Versions/4/Headers -I/opt/macports/Library/Frameworks/QtGui.framework/Versions/4/Headers -I/opt/macports/Library/Frameworks/QtNetwork.framework/Versions/4/Headers -I/opt/macports/Library/Frameworks/QtCore.framework/Versions/4/Headers -I/opt/macports/include -F/opt/macports/Library/Frameworks -F/opt/macports/lib -o ../tmp/qtiplot/sipqtiErrorBarsCurve.o ../tmp/qtiplot/sipqtiErrorBarsCurve.cpp
1051:info:build In file included from src/scripting/qti.sip:1575:
1052:info:build icons/../src/plot2D/BoxCurve.h:100:7: warning: 'BoxCurve::drawSymbols' hides overloaded virtual function [-Woverloaded-virtual]
1053:info:build         void drawSymbols(QPainter *painter, const QwtScaleMap &xMap,
1054:info:build              ^
1055:info:build src/plot2D/PlotCurve.h:79:18: note: hidden overloaded virtual function 'PlotCurve::drawSymbols' declared here
1056:info:build     virtual void drawSymbols(QPainter *p, const QwtSymbol &,
1057:info:build                  ^
1058:info:build In file included from src/lib/3rdparty/qtcolorpicker/src/qtcolorpicker.cpp:58:
1059:info:build In file included from /opt/macports/include/QtGui/QFocusEvent:1:
1060:info:build In file included from /opt/macports/Library/Frameworks/QtGui.framework/Versions/4/Headers/qevent.h:52:
1061:info:build /opt/macports/include/QtGui/qmime.h:119:10: warning: private field 'type' is not used [-Wunused-private-field]
1062:info:build /usr/bin/clang++ -c -pipe -O2 -Wall -W -DSCRIPTING_CONSOLE -DSCRIPTING_DIALOG -DSVN_REVISION="\"\"" -DQT_PLUGIN -DSCRIPTING_MUPARSER -DSCRIPTING_PYTHON -DGL2PS_HAVE_LIBPNG -DQT_NO_DEBUG -DQT_SVG_LIB -DQT_QT3SUPPORT_LIB -DQT3_SUPPORT -DQT_XML_LIB -DQT_OPENGL_LIB -DQT_GUI_LIB -DQT_NETWORK_LIB -DQT_CORE_LIB -DQT_SHARED -I/opt/macports/share/qt4/mkspecs/macx-g++ -I. -I/opt/macports/var/macports/build/_opt_macports_var_macports_sources_rsync.macports.org_release_tarballs_ports_aqua_qtiplot/qtiplot/work/qtiplot-0.9.8.9/tmp/qtiplot -I/opt/macports/Library/Frameworks/QtCore.framework/Versions/4/Headers -I/opt/macports/Library/Frameworks/QtNetwork.framework/Versions/4/Headers -I/opt/macports/Library/Frameworks/QtGui.framework/Versions/4/Headers -I/opt/macports/Library/Frameworks/QtOpenGL.framework/Versions/4/Headers -I/opt/macports/Library/Frameworks/QtXml.framework/Versions/4/Headers -I/opt/macports/Library/Frameworks/Qt3Support.framework/Versions/4/Headers -I/opt/macports/Library/Frameworks/QtSvg.framework/Versions/4/Headers -I../3rdparty/qwt/src -I../3rdparty/qwtplot3d/include -Iicons -Isrc/analysis -Isrc/analysis/dialogs -Isrc/core -Isrc/excel -Isrc/lib/include -Isrc/lib/3rdparty/qtcolorpicker/src -Isrc/plot2D -Isrc/plot2D/dialogs -Isrc/plot3D -Isrc/matrix -Isrc/table -Isrc/scripting -I/opt/macports/Library/Frameworks/Python.framework/Versions/2.7/include/python2.7 -I/System/Library/Frameworks/OpenGL.framework/Versions/A/Headers -I/System/Library/Frameworks/AGL.framework/Headers -I/opt/macports/Library/Frameworks/QtSvg.framework/Versions/4/Headers -I/opt/macports/Library/Frameworks/Qt3Support.framework/Versions/4/Headers -I/opt/macports/Library/Frameworks/QtXml.framework/Versions/4/Headers -I/opt/macports/Library/Frameworks/QtOpenGL.framework/Versions/4/Headers -I/opt/macports/Library/Frameworks/QtGui.framework/Versions/4/Headers -I/opt/macports/Library/Frameworks/QtNetwork.framework/Versions/4/Headers -I/opt/macports/Library/Frameworks/QtCore.framework/Versions/4/Headers -I/opt/macports/include -F/opt/macports/Library/Frameworks -F/opt/macports/lib -o ../tmp/qtiplot/sipqtiVectorCurve.o ../tmp/qtiplot/sipqtiVectorCurve.cpp
1063:info:build     char type;
1064:info:build          ^
1065:info:build In file included from src/scripting/qti.sip:1772:
1066:info:build icons/../src/plot2D/Graph.h:201:8: warning: 'Graph::print' hides overloaded virtual function [-Woverloaded-virtual]
1067:info:build                 void print(QPainter *, const QRect &rect, const QwtPlotPrintFilter & = QwtPlotPrintFilter());
1068:info:build                      ^
1069:info:build ../3rdparty/qwt/src/qwt_plot.h:145:18: note: hidden overloaded virtual function 'QwtPlot::print' declared here
1070:info:build     virtual void print(QPainter *, const QRect &rect,
1071:info:build                  ^
1072:info:build In file included from src/scripting/qti.sip:1772:
1073:info:build icons/../src/plot2D/Graph.h:343:8: warning: 'Graph::print' hides overloaded virtual function [-Woverloaded-virtual]
1074:info:build                 void print();
1075:info:build                      ^
1076:info:build ../3rdparty/qwt/src/qwt_plot.h:145:18: note: hidden overloaded virtual function 'QwtPlot::print' declared here
1077:info:build     virtual void print(QPainter *, const QRect &rect,
1078:info:build                  ^
1079:info:build In file included from src/scripting/qti.sip:1772:
1080:info:build icons/../src/plot2D/Graph.h:857:8: warning: 'Graph::printCanvas' hides overloaded virtual function [-Woverloaded-virtual]
1081:info:build                 void printCanvas(QPainter *painter, const QRect &canvasRect,
1082:info:build                      ^
1083:info:build ../3rdparty/qwt/src/qwt_plot.h:304:18: note: hidden overloaded virtual function 'QwtPlot::printCanvas' declared here
1084:info:build     virtual void printCanvas(QPainter *,
1085:info:build                  ^
1086:info:build src/scripting/qti.sip:119:12: warning: unused function 'setCellDataHelper' [-Wunused-function]
1087:info:build static int setCellDataHelper(Table* table, int row, int col, PyObject* item) {
1088:info:build            ^
1089:info:build src/scripting/qti.sip:233:12: warning: unused function 'cellDataHelper' [-Wunused-function]
1090:info:build static int cellDataHelper(Table* table, int row, int col, PyObject** item) {
1091:info:build            ^
1092:info:build src/scripting/qti.sip:119:12: warning: unused function 'setCellDataHelper' [-Wunused-function]
1093:info:build static int setCellDataHelper(Table* table, int row, int col, PyObject* item) {
1094:info:build            ^
1095:info:build src/scripting/qti.sip:233:12: warning: unused function 'cellDataHelper' [-Wunused-function]
1096:info:build static int cellDataHelper(Table* table, int row, int col, PyObject** item) {
1097:info:build            ^
1098:info:build src/scripting/qti.sip:119:12: warning: unused function 'setCellDataHelper' [-Wunused-function]
1099:info:build static int setCellDataHelper(Table* table, int row, int col, PyObject* item) {
1100:info:build            ^
1101:info:build src/scripting/qti.sip:233:12: warning: unused function 'cellDataHelper' [-Wunused-function]
1102:info:build static int cellDataHelper(Table* table, int row, int col, PyObject** item) {
1103:info:build            ^
1104:info:build 2 warnings generated.
1105:info:build 3 warnings generated.
1106:info:build /usr/bin/clang++ -c -pipe -O2 -Wall -W -DSCRIPTING_CONSOLE -DSCRIPTING_DIALOG -DSVN_REVISION="\"\"" -DQT_PLUGIN -DSCRIPTING_MUPARSER -DSCRIPTING_PYTHON -DGL2PS_HAVE_LIBPNG -DQT_NO_DEBUG -DQT_SVG_LIB -DQT_QT3SUPPORT_LIB -DQT3_SUPPORT -DQT_XML_LIB -DQT_OPENGL_LIB -DQT_GUI_LIB -DQT_NETWORK_LIB -DQT_CORE_LIB -DQT_SHARED -I/opt/macports/share/qt4/mkspecs/macx-g++ -I. -I/opt/macports/var/macports/build/_opt_macports_var_macports_sources_rsync.macports.org_release_tarballs_ports_aqua_qtiplot/qtiplot/work/qtiplot-0.9.8.9/tmp/qtiplot -I/opt/macports/Library/Frameworks/QtCore.framework/Versions/4/Headers -I/opt/macports/Library/Frameworks/QtNetwork.framework/Versions/4/Headers -I/opt/macports/Library/Frameworks/QtGui.framework/Versions/4/Headers -I/opt/macports/Library/Frameworks/QtOpenGL.framework/Versions/4/Headers -I/opt/macports/Library/Frameworks/QtXml.framework/Versions/4/Headers -I/opt/macports/Library/Frameworks/Qt3Support.framework/Versions/4/Headers -I/opt/macports/Library/Frameworks/QtSvg.framework/Versions/4/Headers -I../3rdparty/qwt/src -I../3rdparty/qwtplot3d/include -Iicons -Isrc/analysis -Isrc/analysis/dialogs -Isrc/core -Isrc/excel -Isrc/lib/include -Isrc/lib/3rdparty/qtcolorpicker/src -Isrc/plot2D -Isrc/plot2D/dialogs -Isrc/plot3D -Isrc/matrix -Isrc/table -Isrc/scripting -I/opt/macports/Library/Frameworks/Python.framework/Versions/2.7/include/python2.7 -I/System/Library/Frameworks/OpenGL.framework/Versions/A/Headers -I/System/Library/Frameworks/AGL.framework/Headers -I/opt/macports/Library/Frameworks/QtSvg.framework/Versions/4/Headers -I/opt/macports/Library/Frameworks/Qt3Support.framework/Versions/4/Headers -I/opt/macports/Library/Frameworks/QtXml.framework/Versions/4/Headers -I/opt/macports/Library/Frameworks/QtOpenGL.framework/Versions/4/Headers -I/opt/macports/Library/Frameworks/QtGui.framework/Versions/4/Headers -I/opt/macports/Library/Frameworks/QtNetwork.framework/Versions/4/Headers -I/opt/macports/Library/Frameworks/QtCore.framework/Versions/4/Headers -I/opt/macports/include -F/opt/macports/Library/Frameworks -F/opt/macports/lib -o ../tmp/qtiplot/sipqtiQwtHistogram.o ../tmp/qtiplot/sipqtiQwtHistogram.cpp
1107:info:build /usr/bin/clang++ -c -pipe -O2 -Wall -W -DSCRIPTING_CONSOLE -DSCRIPTING_DIALOG -DSVN_REVISION="\"\"" -DQT_PLUGIN -DSCRIPTING_MUPARSER -DSCRIPTING_PYTHON -DGL2PS_HAVE_LIBPNG -DQT_NO_DEBUG -DQT_SVG_LIB -DQT_QT3SUPPORT_LIB -DQT3_SUPPORT -DQT_XML_LIB -DQT_OPENGL_LIB -DQT_GUI_LIB -DQT_NETWORK_LIB -DQT_CORE_LIB -DQT_SHARED -I/opt/macports/share/qt4/mkspecs/macx-g++ -I. -I/opt/macports/var/macports/build/_opt_macports_var_macports_sources_rsync.macports.org_release_tarballs_ports_aqua_qtiplot/qtiplot/work/qtiplot-0.9.8.9/tmp/qtiplot -I/opt/macports/Library/Frameworks/QtCore.framework/Versions/4/Headers -I/opt/macports/Library/Frameworks/QtNetwork.framework/Versions/4/Headers -I/opt/macports/Library/Frameworks/QtGui.framework/Versions/4/Headers -I/opt/macports/Library/Frameworks/QtOpenGL.framework/Versions/4/Headers -I/opt/macports/Library/Frameworks/QtXml.framework/Versions/4/Headers -I/opt/macports/Library/Frameworks/Qt3Support.framework/Versions/4/Headers -I/opt/macports/Library/Frameworks/QtSvg.framework/Versions/4/Headers -I../3rdparty/qwt/src -I../3rdparty/qwtplot3d/include -Iicons -Isrc/analysis -Isrc/analysis/dialogs -Isrc/core -Isrc/excel -Isrc/lib/include -Isrc/lib/3rdparty/qtcolorpicker/src -Isrc/plot2D -Isrc/plot2D/dialogs -Isrc/plot3D -Isrc/matrix -Isrc/table -Isrc/scripting -I/opt/macports/Library/Frameworks/Python.framework/Versions/2.7/include/python2.7 -I/System/Library/Frameworks/OpenGL.framework/Versions/A/Headers -I/System/Library/Frameworks/AGL.framework/Headers -I/opt/macports/Library/Frameworks/QtSvg.framework/Versions/4/Headers -I/opt/macports/Library/Frameworks/Qt3Support.framework/Versions/4/Headers -I/opt/macports/Library/Frameworks/QtXml.framework/Versions/4/Headers -I/opt/macports/Library/Frameworks/QtOpenGL.framework/Versions/4/Headers -I/opt/macports/Library/Frameworks/QtGui.framework/Versions/4/Headers -I/opt/macports/Library/Frameworks/QtNetwork.framework/Versions/4/Headers -I/opt/macports/Library/Frameworks/QtCore.framework/Versions/4/Headers -I/opt/macports/include -F/opt/macports/Library/Frameworks -F/opt/macports/lib -o ../tmp/qtiplot/sipqtiQwtPlotSpectrogram.o ../tmp/qtiplot/sipqtiQwtPlotSpectrogram.cpp
1108:info:build In file included from src/scripting/qti.sip:1441:
1109:info:build In file included from icons/../src/plot2D/PieCurve.h:31:
1110:info:build In file included from src/plot2D/LegendWidget.h:33:
1111:info:build src/plot2D/Graph.h:201:8: warning: 'Graph::print' hides overloaded virtual function [-Woverloaded-virtual]
1112:info:build                 void print(QPainter *, const QRect &rect, const QwtPlotPrintFilter & = QwtPlotPrintFilter());
1113:info:build                      ^
1114:info:build ../3rdparty/qwt/src/qwt_plot.h:145:18: note: hidden overloaded virtual function 'QwtPlot::print' declared here
1115:info:build     virtual void print(QPainter *, const QRect &rect,
1116:info:build                  ^
1117:info:build In file included from src/scripting/qti.sip:1441:
1118:info:build In file included from icons/../src/plot2D/PieCurve.h:31:
1119:info:build In file included from src/plot2D/LegendWidget.h:33:
1120:info:build src/plot2D/Graph.h:343:8: warning: 'Graph::print' hides overloaded virtual function [-Woverloaded-virtual]
1121:info:build                 void print();
1122:info:build                      ^
1123:info:build ../3rdparty/qwt/src/qwt_plot.h:145:18: note: hidden overloaded virtual function 'QwtPlot::print' declared here
1124:info:build     virtual void print(QPainter *, const QRect &rect,
1125:info:build                  ^
1126:info:build In file included from src/scripting/qti.sip:1441:
1127:info:build In file included from icons/../src/plot2D/PieCurve.h:31:
1128:info:build In file included from src/plot2D/LegendWidget.h:33:
1129:info:build src/plot2D/Graph.h:857:8: warning: 'Graph::printCanvas' hides overloaded virtual function [-Woverloaded-virtual]
1130:info:build                 void printCanvas(QPainter *painter, const QRect &canvasRect,
1131:info:build                      ^
1132:info:build ../3rdparty/qwt/src/qwt_plot.h:304:18: note: hidden overloaded virtual function 'QwtPlot::printCanvas' declared here
1133:info:build     virtual void printCanvas(QPainter *,
1134:info:build                  ^
1135:info:build /usr/bin/clang++ -c -pipe -O2 -Wall -W -DSCRIPTING_CONSOLE -DSCRIPTING_DIALOG -DSVN_REVISION="\"\"" -DQT_PLUGIN -DSCRIPTING_MUPARSER -DSCRIPTING_PYTHON -DGL2PS_HAVE_LIBPNG -DQT_NO_DEBUG -DQT_SVG_LIB -DQT_QT3SUPPORT_LIB -DQT3_SUPPORT -DQT_XML_LIB -DQT_OPENGL_LIB -DQT_GUI_LIB -DQT_NETWORK_LIB -DQT_CORE_LIB -DQT_SHARED -I/opt/macports/share/qt4/mkspecs/macx-g++ -I. -I/opt/macports/var/macports/build/_opt_macports_var_macports_sources_rsync.macports.org_release_tarballs_ports_aqua_qtiplot/qtiplot/work/qtiplot-0.9.8.9/tmp/qtiplot -I/opt/macports/Library/Frameworks/QtCore.framework/Versions/4/Headers -I/opt/macports/Library/Frameworks/QtNetwork.framework/Versions/4/Headers -I/opt/macports/Library/Frameworks/QtGui.framework/Versions/4/Headers -I/opt/macports/Library/Frameworks/QtOpenGL.framework/Versions/4/Headers -I/opt/macports/Library/Frameworks/QtXml.framework/Versions/4/Headers -I/opt/macports/Library/Frameworks/Qt3Support.framework/Versions/4/Headers -I/opt/macports/Library/Frameworks/QtSvg.framework/Versions/4/Headers -I../3rdparty/qwt/src -I../3rdparty/qwtplot3d/include -Iicons -Isrc/analysis -Isrc/analysis/dialogs -Isrc/core -Isrc/excel -Isrc/lib/include -Isrc/lib/3rdparty/qtcolorpicker/src -Isrc/plot2D -Isrc/plot2D/dialogs -Isrc/plot3D -Isrc/matrix -Isrc/table -Isrc/scripting -I/opt/macports/Library/Frameworks/Python.framework/Versions/2.7/include/python2.7 -I/System/Library/Frameworks/OpenGL.framework/Versions/A/Headers -I/System/Library/Frameworks/AGL.framework/Headers -I/opt/macports/Library/Frameworks/QtSvg.framework/Versions/4/Headers -I/opt/macports/Library/Frameworks/Qt3Support.framework/Versions/4/Headers -I/opt/macports/Library/Frameworks/QtXml.framework/Versions/4/Headers -I/opt/macports/Library/Frameworks/QtOpenGL.framework/Versions/4/Headers -I/opt/macports/Library/Frameworks/QtGui.framework/Versions/4/Headers -I/opt/macports/Library/Frameworks/QtNetwork.framework/Versions/4/Headers -I/opt/macports/Library/Frameworks/QtCore.framework/Versions/4/Headers -I/opt/macports/include -F/opt/macports/Library/Frameworks -F/opt/macports/lib -o ../tmp/qtiplot/sipqtiSpectrogram.o ../tmp/qtiplot/sipqtiSpectrogram.cpp
1136:info:build 2 warnings generated.
1137:info:build /usr/bin/clang++ -c -pipe -O2 -Wall -W -DSCRIPTING_CONSOLE -DSCRIPTING_DIALOG -DSVN_REVISION="\"\"" -DQT_PLUGIN -DSCRIPTING_MUPARSER -DSCRIPTING_PYTHON -DGL2PS_HAVE_LIBPNG -DQT_NO_DEBUG -DQT_SVG_LIB -DQT_QT3SUPPORT_LIB -DQT3_SUPPORT -DQT_XML_LIB -DQT_OPENGL_LIB -DQT_GUI_LIB -DQT_NETWORK_LIB -DQT_CORE_LIB -DQT_SHARED -I/opt/macports/share/qt4/mkspecs/macx-g++ -I. -I/opt/macports/var/macports/build/_opt_macports_var_macports_sources_rsync.macports.org_release_tarballs_ports_aqua_qtiplot/qtiplot/work/qtiplot-0.9.8.9/tmp/qtiplot -I/opt/macports/Library/Frameworks/QtCore.framework/Versions/4/Headers -I/opt/macports/Library/Frameworks/QtNetwork.framework/Versions/4/Headers -I/opt/macports/Library/Frameworks/QtGui.framework/Versions/4/Headers -I/opt/macports/Library/Frameworks/QtOpenGL.framework/Versions/4/Headers -I/opt/macports/Library/Frameworks/QtXml.framework/Versions/4/Headers -I/opt/macports/Library/Frameworks/Qt3Support.framework/Versions/4/Headers -I/opt/macports/Library/Frameworks/QtSvg.framework/Versions/4/Headers -I../3rdparty/qwt/src -I../3rdparty/qwtplot3d/include -Iicons -Isrc/analysis -Isrc/analysis/dialogs -Isrc/core -Isrc/excel -Isrc/lib/include -Isrc/lib/3rdparty/qtcolorpicker/src -Isrc/plot2D -Isrc/plot2D/dialogs -Isrc/plot3D -Isrc/matrix -Isrc/table -Isrc/scripting -I/opt/macports/Library/Frameworks/Python.framework/Versions/2.7/include/python2.7 -I/System/Library/Frameworks/OpenGL.framework/Versions/A/Headers -I/System/Library/Frameworks/AGL.framework/Headers -I/opt/macports/Library/Frameworks/QtSvg.framework/Versions/4/Headers -I/opt/macports/Library/Frameworks/Qt3Support.framework/Versions/4/Headers -I/opt/macports/Library/Frameworks/QtXml.framework/Versions/4/Headers -I/opt/macports/Library/Frameworks/QtOpenGL.framework/Versions/4/Headers -I/opt/macports/Library/Frameworks/QtGui.framework/Versions/4/Headers -I/opt/macports/Library/Frameworks/QtNetwork.framework/Versions/4/Headers -I/opt/macports/Library/Frameworks/QtCore.framework/Versions/4/Headers -I/opt/macports/include -F/opt/macports/Library/Frameworks -F/opt/macports/lib -o ../tmp/qtiplot/sipqtiMultiLayer.o ../tmp/qtiplot/sipqtiMultiLayer.cpp
1138:info:build ../tmp/qtiplot/sipqtiImageWidget.cpp:874:22: error: 'paintEvent' is a private member of 'ImageWidget'
1139:info:build         ImageWidget::paintEvent(a0);
1140:info:build                      ^
1141:info:build icons/../src/plot2D/ImageWidget.h:73:7: note: declared private here
1142:info:build         void paintEvent(QPaintEvent *e);
1143:info:build              ^
1144:info:build src/scripting/qti.sip:119:12: warning: unused function 'setCellDataHelper' [-Wunused-function]
1145:info:build static int setCellDataHelper(Table* table, int row, int col, PyObject* item) {
1146:info:build            ^
1147:info:build src/scripting/qti.sip:233:12: warning: unused function 'cellDataHelper' [-Wunused-function]
1148:info:build static int cellDataHelper(Table* table, int row, int col, PyObject** item) {
1149:info:build            ^
1150:info:build In file included from src/scripting/qti.sip:1441:
1151:info:build In file included from icons/../src/plot2D/PieCurve.h:31:
1152:info:build In file included from src/plot2D/LegendWidget.h:33:
1153:info:build In file included from src/plot2D/Graph.h:44:
1154:info:build In file included from src/plot2D/dialogs/AxesDialog.h:36:
1155:info:build In file included from /opt/macports/Library/Frameworks/QtGui.framework/Versions/4/Headers/QTextEdit:1:
1156:info:build In file included from /opt/macports/Library/Frameworks/QtGui.framework/Versions/4/Headers/qtextedit.h:55:
1157:info:build In file included from /opt/macports/include/QtGui/qtextlayout.h:50:
1158:info:build In file included from /opt/macports/include/QtGui/qevent.h:52:
1159:info:build /opt/macports/include/QtGui/qmime.h:119:10: warning: private field 'type' is not used [-Wunused-private-field]
1160:info:build     char type;
1161:info:build          ^
1162:info:build In file included from src/scripting/qti.sip:1772:
1163:info:build In file included from icons/../src/plot2D/Graph.h:44:
1164:info:build In file included from src/plot2D/dialogs/AxesDialog.h:36:
1165:info:build In file included from /opt/macports/Library/Frameworks/QtGui.framework/Versions/4/Headers/QTextEdit:1:
1166:info:build In file included from /opt/macports/Library/Frameworks/QtGui.framework/Versions/4/Headers/qtextedit.h:55:
1167:info:build In file included from /opt/macports/include/QtGui/qtextlayout.h:50:
1168:info:build In file included from /opt/macports/include/QtGui/qevent.h:52:
1169:info:build /opt/macports/include/QtGui/qmime.h:119:10: warning: private field 'type' is not used [-Wunused-private-field]
1170:info:build     char type;
1171:info:build          ^
1172:info:build 4 warnings and 1 error generated.
1173:info:build make[1]: *** [../tmp/qtiplot/sipqtiImageWidget.o] Error 1
1174:info:build make[1]: *** Waiting for unfinished jobs....
1175:info:build 6 warnings generated.
1176:info:build 1 warning generated.
1177:info:build src/scripting/qti.sip:119:12: warning: unused function 'setCellDataHelper' [-Wunused-function]
1178:info:build static int setCellDataHelper(Table* table, int row, int col, PyObject* item) {
1179:info:build            ^
1180:info:build src/scripting/qti.sip:233:12: warning: unused function 'cellDataHelper' [-Wunused-function]
1181:info:build static int cellDataHelper(Table* table, int row, int col, PyObject** item) {
1182:info:build            ^
1183:info:build 2 warnings generated.
1184:info:build In file included from src/scripting/qti.sip:1772:
1185:info:build icons/../src/plot2D/Graph.h:201:8: warning: 'Graph::print' hides overloaded virtual function [-Woverloaded-virtual]
1186:info:build                 void print(QPainter *, const QRect &rect, const QwtPlotPrintFilter & = QwtPlotPrintFilter());
1187:info:build                      ^
1188:info:build ../3rdparty/qwt/src/qwt_plot.h:145:18: note: hidden overloaded virtual function 'QwtPlot::print' declared here
1189:info:build     virtual void print(QPainter *, const QRect &rect,
1190:info:build                  ^
1191:info:build In file included from src/scripting/qti.sip:1772:
1192:info:build icons/../src/plot2D/Graph.h:343:8: warning: 'Graph::print' hides overloaded virtual function [-Woverloaded-virtual]
1193:info:build                 void print();
1194:info:build                      ^
1195:info:build ../3rdparty/qwt/src/qwt_plot.h:145:18: note: hidden overloaded virtual function 'QwtPlot::print' declared here
1196:info:build     virtual void print(QPainter *, const QRect &rect,
1197:info:build                  ^
1198:info:build In file included from src/scripting/qti.sip:1772:
1199:info:build icons/../src/plot2D/Graph.h:857:8: warning: 'Graph::printCanvas' hides overloaded virtual function [-Woverloaded-virtual]
1200:info:build                 void printCanvas(QPainter *painter, const QRect &canvasRect,
1201:info:build                      ^
1202:info:build ../3rdparty/qwt/src/qwt_plot.h:304:18: note: hidden overloaded virtual function 'QwtPlot::printCanvas' declared here
1203:info:build     virtual void printCanvas(QPainter *,
1204:info:build                  ^
1205:info:build In file included from src/scripting/qti.sip:1644:
1206:info:build In file included from icons/../src/plot2D/Spectrogram.h:34:
1207:info:build src/scripting/muParserScript.h:55:10: warning: 'muParserScript::setQObject' hides overloaded virtual function [-Woverloaded-virtual]
1208:info:build     bool setQObject(QObject *val, const char *name);
1209:info:build          ^
1210:info:build src/scripting/Script.h:89:18: note: hidden overloaded virtual function 'Script::setQObject' declared here
1211:info:build     virtual bool setQObject(const QObject*, const char*) { return false; }
1212:info:build                  ^
1213:info:build src/scripting/qti.sip:119:12: warning: unused function 'setCellDataHelper' [-Wunused-function]
1214:info:build static int setCellDataHelper(Table* table, int row, int col, PyObject* item) {
1215:info:build            ^
1216:info:build src/scripting/qti.sip:233:12: warning: unused function 'cellDataHelper' [-Wunused-function]
1217:info:build static int cellDataHelper(Table* table, int row, int col, PyObject** item) {
1218:info:build            ^
1219:info:build 2 warnings generated.
1220:info:build In file included from src/scripting/qti.sip:1772:
1221:info:build In file included from icons/../src/plot2D/Graph.h:44:
1222:info:build In file included from src/plot2D/dialogs/AxesDialog.h:36:
1223:info:build In file included from /opt/macports/Library/Frameworks/QtGui.framework/Versions/4/Headers/QTextEdit:1:
1224:info:build In file included from /opt/macports/Library/Frameworks/QtGui.framework/Versions/4/Headers/qtextedit.h:55:
1225:info:build In file included from /opt/macports/include/QtGui/qtextlayout.h:50:
1226:info:build In file included from /opt/macports/include/QtGui/qevent.h:52:
1227:info:build /opt/macports/include/QtGui/qmime.h:119:10: warning: private field 'type' is not used [-Wunused-private-field]
1228:info:build     char type;
1229:info:build          ^
1230:info:build In file included from src/scripting/qti.sip:1772:
1231:info:build icons/../src/plot2D/Graph.h:201:8: warning: 'Graph::print' hides overloaded virtual function [-Woverloaded-virtual]
1232:info:build                 void print(QPainter *, const QRect &rect, const QwtPlotPrintFilter & = QwtPlotPrintFilter());
1233:info:build                      ^
1234:info:build ../3rdparty/qwt/src/qwt_plot.h:145:18: note: hidden overloaded virtual function 'QwtPlot::print' declared here
1235:info:build     virtual void print(QPainter *, const QRect &rect,
1236:info:build                  ^
1237:info:build In file included from src/scripting/qti.sip:1772:
1238:info:build icons/../src/plot2D/Graph.h:343:8: warning: 'Graph::print' hides overloaded virtual function [-Woverloaded-virtual]
1239:info:build                 void print();
1240:info:build                      ^
1241:info:build ../3rdparty/qwt/src/qwt_plot.h:145:18: note: hidden overloaded virtual function 'QwtPlot::print' declared here
1242:info:build     virtual void print(QPainter *, const QRect &rect,
1243:info:build                  ^
1244:info:build In file included from src/scripting/qti.sip:1772:
1245:info:build icons/../src/plot2D/Graph.h:857:8: warning: 'Graph::printCanvas' hides overloaded virtual function [-Woverloaded-virtual]
1246:info:build                 void printCanvas(QPainter *painter, const QRect &canvasRect,
1247:info:build                      ^
1248:info:build ../3rdparty/qwt/src/qwt_plot.h:304:18: note: hidden overloaded virtual function 'QwtPlot::printCanvas' declared here
1249:info:build     virtual void printCanvas(QPainter *,
1250:info:build                  ^
1251:info:build In file included from src/scripting/qti.sip:1772:
1252:info:build In file included from icons/../src/plot2D/Graph.h:44:
1253:info:build In file included from src/plot2D/dialogs/AxesDialog.h:36:
1254:info:build In file included from /opt/macports/Library/Frameworks/QtGui.framework/Versions/4/Headers/QTextEdit:1:
1255:info:build In file included from /opt/macports/Library/Frameworks/QtGui.framework/Versions/4/Headers/qtextedit.h:55:
1256:info:build In file included from /opt/macports/include/QtGui/qtextlayout.h:50:
1257:info:build In file included from /opt/macports/include/QtGui/qevent.h:52:
1258:info:build /opt/macports/include/QtGui/qmime.h:119:10: warning: private field 'type' is not used [-Wunused-private-field]
1259:info:build     char type;
1260:info:build          ^
1261:info:build 4 warnings generated.
1262:info:build 5 warnings generated.
1263:info:build make[1]: Leaving directory `/opt/macports/var/macports/build/_opt_macports_var_macports_sources_rsync.macports.org_release_tarballs_ports_aqua_qtiplot/qtiplot/work/qtiplot-0.9.8.9/qtiplot'
1264:info:build make: *** [sub-qtiplot-all] Error 2
1265:info:build make: Leaving directory `/opt/macports/var/macports/build/_opt_macports_var_macports_sources_rsync.macports.org_release_tarballs_ports_aqua_qtiplot/qtiplot/work/qtiplot-0.9.8.9'
1266:info:build Command failed:  cd "/opt/macports/var/macports/build/_opt_macports_var_macports_sources_rsync.macports.org_release_tarballs_ports_aqua_qtiplot/qtiplot/work/qtiplot-0.9.8.9" && /usr/bin/make -j8 -w all
1267:info:build Exit code: 2
1268:error:build org.macports.build for port qtiplot returned: command execution failed
1269:debug:build Error code: CHILDSTATUS 38388 2
1270:debug:build Backtrace: command execution failed
1271    while executing
1272"system -nice 0 $fullcmdstring"
1273    ("eval" body line 1)
1274    invoked from within
1275"eval system $notty $nice \$fullcmdstring"
1276    invoked from within
1277"command_exec build"
1278    (procedure "portbuild::build_main" line 8)
1279    invoked from within
1280"$procedure $targetname"
1281:info:build Warning: targets not executed for qtiplot: org.macports.activate org.macports.build org.macports.destroot org.macports.install
1282:notice:build Please see the log file for port qtiplot for details:
1283    /opt/macports/var/macports/logs/_opt_macports_var_macports_sources_rsync.macports.org_release_tarballs_ports_aqua_qtiplot/qtiplot/main.log