Ticket #51294: main.log

File main.log, 16.7 KB (added by red.carpet.guitar@…, 5 years ago)

mai.log

Line 
1version:1
2:debug:main Attempting ln -sf /opt/local/var/macports/build/_opt_local_var_macports_sources_rsync.macports.org_release_tarballs_ports_textproc_doxygen/doxygen/work /opt/local/var/macports/sources/rsync.macports.org/release/tarballs/ports/textproc/doxygen/work
3:debug:main changing euid/egid - current euid: 0 - current egid: 0
4:debug:main egid changed to: 501
5:debug:main euid changed to: 502
6:debug:main Executing org.macports.main (doxygen)
7:debug:main Privilege de-escalation not attempted as not running as root.
8:debug:main Skipping completed org.macports.archivefetch (doxygen)
9:debug:main Privilege de-escalation not attempted as not running as root.
10:debug:main Skipping completed org.macports.fetch (doxygen)
11:debug:main Privilege de-escalation not attempted as not running as root.
12:debug:main Skipping completed org.macports.checksum (doxygen)
13:debug:main Privilege de-escalation not attempted as not running as root.
14:debug:main Skipping completed org.macports.extract (doxygen)
15:debug:main Privilege de-escalation not attempted as not running as root.
16:debug:main Skipping completed org.macports.patch (doxygen)
17:debug:main Privilege de-escalation not attempted as not running as root.
18:debug:main Skipping completed org.macports.configure (doxygen)
19:debug:main Privilege de-escalation not attempted as not running as root.
20:debug:build build phase started at Tue May  3 00:04:33 IST 2016
21:notice:build --->  Building doxygen
22:debug:build Executing org.macports.build (doxygen)
23:debug:build Environment:
24CC_PRINT_OPTIONS='YES'
25CC_PRINT_OPTIONS_FILE='/opt/local/var/macports/build/_opt_local_var_macports_sources_rsync.macports.org_release_tarballs_ports_textproc_doxygen/doxygen/work/.CC_PRINT_OPTIONS'
26CPATH='/opt/local/include'
27LIBRARY_PATH='/opt/local/lib'
28MACOSX_DEPLOYMENT_TARGET='10.10'
29:debug:build Assembled command: 'cd "/opt/local/var/macports/build/_opt_local_var_macports_sources_rsync.macports.org_release_tarballs_ports_textproc_doxygen/doxygen/work/doxygen-1.8.10" && /usr/bin/make -j4 -w all VERBOSE=ON'
30:debug:build Executing command line:  cd "/opt/local/var/macports/build/_opt_local_var_macports_sources_rsync.macports.org_release_tarballs_ports_textproc_doxygen/doxygen/work/doxygen-1.8.10" && /usr/bin/make -j4 -w all VERBOSE=ON
31:info:build make: Entering directory `/opt/local/var/macports/build/_opt_local_var_macports_sources_rsync.macports.org_release_tarballs_ports_textproc_doxygen/doxygen/work/doxygen-1.8.10'
32:info:build /opt/local/bin/cmake -H/opt/local/var/macports/build/_opt_local_var_macports_sources_rsync.macports.org_release_tarballs_ports_textproc_doxygen/doxygen/work/doxygen-1.8.10 -B/opt/local/var/macports/build/_opt_local_var_macports_sources_rsync.macports.org_release_tarballs_ports_textproc_doxygen/doxygen/work/doxygen-1.8.10 --check-build-system CMakeFiles/Makefile.cmake 0
33:info:build /opt/local/bin/cmake -E cmake_progress_start /opt/local/var/macports/build/_opt_local_var_macports_sources_rsync.macports.org_release_tarballs_ports_textproc_doxygen/doxygen/work/doxygen-1.8.10/CMakeFiles /opt/local/var/macports/build/_opt_local_var_macports_sources_rsync.macports.org_release_tarballs_ports_textproc_doxygen/doxygen/work/doxygen-1.8.10/CMakeFiles/progress.marks
34:info:build /Applications/Xcode.app/Contents/Developer/usr/bin/make -f CMakeFiles/Makefile2 all
35:info:build make[1]: Entering directory `/opt/local/var/macports/build/_opt_local_var_macports_sources_rsync.macports.org_release_tarballs_ports_textproc_doxygen/doxygen/work/doxygen-1.8.10'
36:info:build /Applications/Xcode.app/Contents/Developer/usr/bin/make -f libmd5/CMakeFiles/md5.dir/build.make libmd5/CMakeFiles/md5.dir/depend
37:info:build /Applications/Xcode.app/Contents/Developer/usr/bin/make -f qtools/CMakeFiles/qtools.dir/build.make qtools/CMakeFiles/qtools.dir/depend
38:info:build /Applications/Xcode.app/Contents/Developer/usr/bin/make -f vhdlparser/CMakeFiles/vhdlparser.dir/build.make vhdlparser/CMakeFiles/vhdlparser.dir/depend
39:info:build /Applications/Xcode.app/Contents/Developer/usr/bin/make -f src/CMakeFiles/_doxygen.dir/build.make src/CMakeFiles/_doxygen.dir/depend
40:info:build make[2]: Entering directory `/opt/local/var/macports/build/_opt_local_var_macports_sources_rsync.macports.org_release_tarballs_ports_textproc_doxygen/doxygen/work/doxygen-1.8.10'
41:info:build cd /opt/local/var/macports/build/_opt_local_var_macports_sources_rsync.macports.org_release_tarballs_ports_textproc_doxygen/doxygen/work/doxygen-1.8.10 && /opt/local/bin/cmake -E cmake_depends "Unix Makefiles" /opt/local/var/macports/build/_opt_local_var_macports_sources_rsync.macports.org_release_tarballs_ports_textproc_doxygen/doxygen/work/doxygen-1.8.10 /opt/local/var/macports/build/_opt_local_var_macports_sources_rsync.macports.org_release_tarballs_ports_textproc_doxygen/doxygen/work/doxygen-1.8.10/libmd5 /opt/local/var/macports/build/_opt_local_var_macports_sources_rsync.macports.org_release_tarballs_ports_textproc_doxygen/doxygen/work/doxygen-1.8.10 /opt/local/var/macports/build/_opt_local_var_macports_sources_rsync.macports.org_release_tarballs_ports_textproc_doxygen/doxygen/work/doxygen-1.8.10/libmd5 /opt/local/var/macports/build/_opt_local_var_macports_sources_rsync.macports.org_release_tarballs_ports_textproc_doxygen/doxygen/work/doxygen-1.8.10/libmd5/CMakeFiles/md5.dir/DependInfo.cmake --color=
42:info:build make[2]: Leaving directory `/opt/local/var/macports/build/_opt_local_var_macports_sources_rsync.macports.org_release_tarballs_ports_textproc_doxygen/doxygen/work/doxygen-1.8.10'
43:info:build /Applications/Xcode.app/Contents/Developer/usr/bin/make -f libmd5/CMakeFiles/md5.dir/build.make libmd5/CMakeFiles/md5.dir/build
44:info:build make[2]: Entering directory `/opt/local/var/macports/build/_opt_local_var_macports_sources_rsync.macports.org_release_tarballs_ports_textproc_doxygen/doxygen/work/doxygen-1.8.10'
45:info:build make[2]: Nothing to be done for `libmd5/CMakeFiles/md5.dir/build'.
46:info:build make[2]: Leaving directory `/opt/local/var/macports/build/_opt_local_var_macports_sources_rsync.macports.org_release_tarballs_ports_textproc_doxygen/doxygen/work/doxygen-1.8.10'
47:info:build make[2]: Entering directory `/opt/local/var/macports/build/_opt_local_var_macports_sources_rsync.macports.org_release_tarballs_ports_textproc_doxygen/doxygen/work/doxygen-1.8.10'
48:info:build cd /opt/local/var/macports/build/_opt_local_var_macports_sources_rsync.macports.org_release_tarballs_ports_textproc_doxygen/doxygen/work/doxygen-1.8.10 && /opt/local/bin/cmake -E cmake_depends "Unix Makefiles" /opt/local/var/macports/build/_opt_local_var_macports_sources_rsync.macports.org_release_tarballs_ports_textproc_doxygen/doxygen/work/doxygen-1.8.10 /opt/local/var/macports/build/_opt_local_var_macports_sources_rsync.macports.org_release_tarballs_ports_textproc_doxygen/doxygen/work/doxygen-1.8.10/qtools /opt/local/var/macports/build/_opt_local_var_macports_sources_rsync.macports.org_release_tarballs_ports_textproc_doxygen/doxygen/work/doxygen-1.8.10 /opt/local/var/macports/build/_opt_local_var_macports_sources_rsync.macports.org_release_tarballs_ports_textproc_doxygen/doxygen/work/doxygen-1.8.10/qtools /opt/local/var/macports/build/_opt_local_var_macports_sources_rsync.macports.org_release_tarballs_ports_textproc_doxygen/doxygen/work/doxygen-1.8.10/qtools/CMakeFiles/qtools.dir/DependInfo.cmake --color=
49:info:build [  2%] Built target md5
50:info:build /Applications/Xcode.app/Contents/Developer/usr/bin/make -f src/CMakeFiles/doxycfg.dir/build.make src/CMakeFiles/doxycfg.dir/depend
51:info:build make[2]: Entering directory `/opt/local/var/macports/build/_opt_local_var_macports_sources_rsync.macports.org_release_tarballs_ports_textproc_doxygen/doxygen/work/doxygen-1.8.10'
52:info:build cd /opt/local/var/macports/build/_opt_local_var_macports_sources_rsync.macports.org_release_tarballs_ports_textproc_doxygen/doxygen/work/doxygen-1.8.10 && /opt/local/bin/cmake -E cmake_depends "Unix Makefiles" /opt/local/var/macports/build/_opt_local_var_macports_sources_rsync.macports.org_release_tarballs_ports_textproc_doxygen/doxygen/work/doxygen-1.8.10 /opt/local/var/macports/build/_opt_local_var_macports_sources_rsync.macports.org_release_tarballs_ports_textproc_doxygen/doxygen/work/doxygen-1.8.10/vhdlparser /opt/local/var/macports/build/_opt_local_var_macports_sources_rsync.macports.org_release_tarballs_ports_textproc_doxygen/doxygen/work/doxygen-1.8.10 /opt/local/var/macports/build/_opt_local_var_macports_sources_rsync.macports.org_release_tarballs_ports_textproc_doxygen/doxygen/work/doxygen-1.8.10/vhdlparser /opt/local/var/macports/build/_opt_local_var_macports_sources_rsync.macports.org_release_tarballs_ports_textproc_doxygen/doxygen/work/doxygen-1.8.10/vhdlparser/CMakeFiles/vhdlparser.dir/DependInfo.cmake --color=
53:info:build make[2]: Entering directory `/opt/local/var/macports/build/_opt_local_var_macports_sources_rsync.macports.org_release_tarballs_ports_textproc_doxygen/doxygen/work/doxygen-1.8.10'
54:info:build cd /opt/local/var/macports/build/_opt_local_var_macports_sources_rsync.macports.org_release_tarballs_ports_textproc_doxygen/doxygen/work/doxygen-1.8.10 && /opt/local/bin/cmake -E cmake_depends "Unix Makefiles" /opt/local/var/macports/build/_opt_local_var_macports_sources_rsync.macports.org_release_tarballs_ports_textproc_doxygen/doxygen/work/doxygen-1.8.10 /opt/local/var/macports/build/_opt_local_var_macports_sources_rsync.macports.org_release_tarballs_ports_textproc_doxygen/doxygen/work/doxygen-1.8.10/src /opt/local/var/macports/build/_opt_local_var_macports_sources_rsync.macports.org_release_tarballs_ports_textproc_doxygen/doxygen/work/doxygen-1.8.10 /opt/local/var/macports/build/_opt_local_var_macports_sources_rsync.macports.org_release_tarballs_ports_textproc_doxygen/doxygen/work/doxygen-1.8.10/src /opt/local/var/macports/build/_opt_local_var_macports_sources_rsync.macports.org_release_tarballs_ports_textproc_doxygen/doxygen/work/doxygen-1.8.10/src/CMakeFiles/doxycfg.dir/DependInfo.cmake --color=
55:info:build make[2]: Leaving directory `/opt/local/var/macports/build/_opt_local_var_macports_sources_rsync.macports.org_release_tarballs_ports_textproc_doxygen/doxygen/work/doxygen-1.8.10'
56:info:build /Applications/Xcode.app/Contents/Developer/usr/bin/make -f vhdlparser/CMakeFiles/vhdlparser.dir/build.make vhdlparser/CMakeFiles/vhdlparser.dir/build
57:info:build make[2]: Entering directory `/opt/local/var/macports/build/_opt_local_var_macports_sources_rsync.macports.org_release_tarballs_ports_textproc_doxygen/doxygen/work/doxygen-1.8.10'
58:info:build make[2]: Entering directory `/opt/local/var/macports/build/_opt_local_var_macports_sources_rsync.macports.org_release_tarballs_ports_textproc_doxygen/doxygen/work/doxygen-1.8.10'
59:info:build make[2]: Nothing to be done for `vhdlparser/CMakeFiles/vhdlparser.dir/build'.
60:info:build make[2]: Leaving directory `/opt/local/var/macports/build/_opt_local_var_macports_sources_rsync.macports.org_release_tarballs_ports_textproc_doxygen/doxygen/work/doxygen-1.8.10'
61:info:build [  3%] Generating /opt/local/var/macports/build/_opt_local_var_macports_sources_rsync.macports.org_release_tarballs_ports_textproc_doxygen/doxygen/work/doxygen-1.8.10/generated_src/resources.cpp
62:info:build cd /opt/local/var/macports/build/_opt_local_var_macports_sources_rsync.macports.org_release_tarballs_ports_textproc_doxygen/doxygen/work/doxygen-1.8.10/src && /usr/bin/python /opt/local/var/macports/build/_opt_local_var_macports_sources_rsync.macports.org_release_tarballs_ports_textproc_doxygen/doxygen/work/doxygen-1.8.10/src/res2cc_cmd.py /opt/local/var/macports/build/_opt_local_var_macports_sources_rsync.macports.org_release_tarballs_ports_textproc_doxygen/doxygen/work/doxygen-1.8.10/templates /opt/local/var/macports/build/_opt_local_var_macports_sources_rsync.macports.org_release_tarballs_ports_textproc_doxygen/doxygen/work/doxygen-1.8.10/generated_src/resources.cpp
63:info:build make[2]: Leaving directory `/opt/local/var/macports/build/_opt_local_var_macports_sources_rsync.macports.org_release_tarballs_ports_textproc_doxygen/doxygen/work/doxygen-1.8.10'
64:info:build /Applications/Xcode.app/Contents/Developer/usr/bin/make -f src/CMakeFiles/doxycfg.dir/build.make src/CMakeFiles/doxycfg.dir/build
65:info:build [  8%] Built target vhdlparser
66:info:build make[2]: Entering directory `/opt/local/var/macports/build/_opt_local_var_macports_sources_rsync.macports.org_release_tarballs_ports_textproc_doxygen/doxygen/work/doxygen-1.8.10'
67:info:build make[2]: Nothing to be done for `src/CMakeFiles/doxycfg.dir/build'.
68:info:build make[2]: Leaving directory `/opt/local/var/macports/build/_opt_local_var_macports_sources_rsync.macports.org_release_tarballs_ports_textproc_doxygen/doxygen/work/doxygen-1.8.10'
69:info:build [ 12%] Built target doxycfg
70:info:build make[2]: Leaving directory `/opt/local/var/macports/build/_opt_local_var_macports_sources_rsync.macports.org_release_tarballs_ports_textproc_doxygen/doxygen/work/doxygen-1.8.10'
71:info:build /Applications/Xcode.app/Contents/Developer/usr/bin/make -f qtools/CMakeFiles/qtools.dir/build.make qtools/CMakeFiles/qtools.dir/build
72:info:build make[2]: Entering directory `/opt/local/var/macports/build/_opt_local_var_macports_sources_rsync.macports.org_release_tarballs_ports_textproc_doxygen/doxygen/work/doxygen-1.8.10'
73:info:build make[2]: Nothing to be done for `qtools/CMakeFiles/qtools.dir/build'.
74:info:build make[2]: Leaving directory `/opt/local/var/macports/build/_opt_local_var_macports_sources_rsync.macports.org_release_tarballs_ports_textproc_doxygen/doxygen/work/doxygen-1.8.10'
75:info:build [ 30%] Built target qtools
76:info:build Traceback (most recent call last):
77:info:build   File "/opt/local/var/macports/build/_opt_local_var_macports_sources_rsync.macports.org_release_tarballs_ports_textproc_doxygen/doxygen/work/doxygen-1.8.10/src/res2cc_cmd.py", line 118, in <module>
78:info:build   File "/opt/local/var/macports/build/_opt_local_var_macports_sources_rsync.macports.org_release_tarballs_ports_textproc_doxygen/doxygen/work/doxygen-1.8.10/src/res2cc_cmd.py", line 104, in main
79:info:build   File "/opt/local/var/macports/build/_opt_local_var_macports_sources_rsync.macports.org_release_tarballs_ports_textproc_doxygen/doxygen/work/doxygen-1.8.10/src/res2cc_cmd.py", line 61, in factory
80:info:build   File "/opt/local/var/macports/build/_opt_local_var_macports_sources_rsync.macports.org_release_tarballs_ports_textproc_doxygen/doxygen/work/doxygen-1.8.10/src/res2cc_cmd.py", line 65, in __init__
81:info:build   File "/opt/local/var/macports/build/_opt_local_var_macports_sources_rsync.macports.org_release_tarballs_ports_textproc_doxygen/doxygen/work/doxygen-1.8.10/src/res2cc_cmd.py", line 30, in __init__
82:info:build IOError: [Errno 24] Too many open files: '/opt/local/var/macports/build/_opt_local_var_macports_sources_rsync.macports.org_release_tarballs_ports_textproc_doxygen/doxygen/work/doxygen-1.8.10/templates/html/search.js'
83:info:build make[2]: *** [generated_src/resources.cpp] Error 1
84:info:build make[2]: Leaving directory `/opt/local/var/macports/build/_opt_local_var_macports_sources_rsync.macports.org_release_tarballs_ports_textproc_doxygen/doxygen/work/doxygen-1.8.10'
85:info:build make[1]: *** [src/CMakeFiles/_doxygen.dir/all] Error 2
86:info:build make[1]: Leaving directory `/opt/local/var/macports/build/_opt_local_var_macports_sources_rsync.macports.org_release_tarballs_ports_textproc_doxygen/doxygen/work/doxygen-1.8.10'
87:info:build make: *** [all] Error 2
88:info:build make: Leaving directory `/opt/local/var/macports/build/_opt_local_var_macports_sources_rsync.macports.org_release_tarballs_ports_textproc_doxygen/doxygen/work/doxygen-1.8.10'
89:info:build Command failed:  cd "/opt/local/var/macports/build/_opt_local_var_macports_sources_rsync.macports.org_release_tarballs_ports_textproc_doxygen/doxygen/work/doxygen-1.8.10" && /usr/bin/make -j4 -w all VERBOSE=ON
90:info:build Exit code: 2
91:error:build org.macports.build for port doxygen returned: command execution failed
92:debug:build Error code: CHILDSTATUS 593 2
93:debug:build Backtrace: command execution failed
94    while executing
95"system -nice 0 $fullcmdstring"
96    ("eval" body line 1)
97    invoked from within
98"eval system $notty $nice \$fullcmdstring"
99    invoked from within
100"command_exec build"
101    (procedure "portbuild::build_main" line 8)
102    invoked from within
103"portbuild::build_main org.macports.build"
104    ("eval" body line 1)
105    invoked from within
106"eval $procedure $targetname"
107:info:build Warning: targets not executed for doxygen: org.macports.activate org.macports.build org.macports.destroot org.macports.install
108:error:build Failed to install doxygen
109:debug:build Registry error: libpaper not registered as installed & active.
110    invoked from within
111"registry_active $subport"
112    invoked from within
113"$workername eval registry_active \$subport"
114:notice:build Please see the log file for port doxygen for details:
115    /opt/local/var/macports/logs/_opt_local_var_macports_sources_rsync.macports.org_release_tarballs_ports_textproc_doxygen/doxygen/main.log