Ticket #55706: gle-graphics.log.2018-01-15_10.46.19

File gle-graphics.log.2018-01-15_10.46.19, 112.7 KB (added by majoc-at-astro (majoc-at-astro), 3 years ago)
Line 
1version:1
2:debug:main epoch: in tree: 0 installed: 0
3:debug:main pkgconfig 0.29.2_0 exists in the ports tree
4:debug:main pkgconfig 0.29.2_0  is the latest installed
5:debug:main pkgconfig 0.29.2_0  is active
6:debug:main Merging existing variants '' into variants
7:debug:main new fully merged portvariants:
8:debug:main Changing to port directory: /opt/local/var/macports/sources/rsync.macports.org/macports/release/tarballs/ports/devel/pkgconfig
9:debug:main OS darwin/17.3.0 (Mac OS X 10.13) arch i386
10:debug:main adding the default universal variant
11:debug:main Reading variant descriptions from /opt/local/var/macports/sources/rsync.macports.org/macports/release/tarballs/ports/_resources/port1.0/variant_descriptions.conf
12:debug:main Running callback portconfigure::add_automatic_compiler_dependencies
13:debug:main Finished running callback portconfigure::add_automatic_compiler_dependencies
14:debug:main Running callback portbuild::add_automatic_buildsystem_dependencies
15:debug:main Finished running callback portbuild::add_automatic_buildsystem_dependencies
16:debug:main No need to upgrade! pkgconfig 0.29.2_0 >= pkgconfig 0.29.2_0
17:debug:main epoch: in tree: 0 installed: 0
18:debug:main libiconv 1.15_0 exists in the ports tree
19:debug:main libiconv 1.15_0  is the latest installed
20:debug:main libiconv 1.15_0  is active
21:debug:main Merging existing variants '' into variants
22:debug:main new fully merged portvariants:
23:debug:main Changing to port directory: /opt/local/var/macports/sources/rsync.macports.org/macports/release/tarballs/ports/textproc/libiconv
24:debug:main OS darwin/17.3.0 (Mac OS X 10.13) arch i386
25:debug:main Reading variant descriptions from /opt/local/var/macports/sources/rsync.macports.org/macports/release/tarballs/ports/_resources/port1.0/variant_descriptions.conf
26:debug:main Sourcing PortGroup muniversal 1.0 from /opt/local/var/macports/sources/rsync.macports.org/macports/release/tarballs/ports/_resources/port1.0/group/muniversal-1.0.tcl
27:debug:main universal variant already exists, so not adding the default one
28:debug:main Running callback portconfigure::add_automatic_compiler_dependencies
29:debug:main Finished running callback portconfigure::add_automatic_compiler_dependencies
30:debug:main Running callback portbuild::add_automatic_buildsystem_dependencies
31:debug:main Finished running callback portbuild::add_automatic_buildsystem_dependencies
32:debug:main No need to upgrade! libiconv 1.15_0 >= libiconv 1.15_0
33:debug:main epoch: in tree: 0 installed: 0
34:debug:main cairo 1.14.12_0 exists in the ports tree
35:debug:main cairo 1.14.12_0 +quartz+x11 is the latest installed
36:debug:main cairo 1.14.12_0 +quartz+x11 is active
37:debug:main Merging existing variants '+quartz+x11' into variants
38:debug:main new fully merged portvariants: x11 + quartz +
39:debug:main Changing to port directory: /opt/local/var/macports/sources/rsync.macports.org/macports/release/tarballs/ports/graphics/cairo
40:debug:main OS darwin/17.3.0 (Mac OS X 10.13) arch i386
41:debug:main Sourcing PortGroup compiler_blacklist_versions 1.0 from /opt/local/var/macports/sources/rsync.macports.org/macports/release/tarballs/ports/_resources/port1.0/group/compiler_blacklist_versions-1.0.tcl
42:debug:main Reading variant descriptions from /opt/local/var/macports/sources/rsync.macports.org/macports/release/tarballs/ports/_resources/port1.0/variant_descriptions.conf
43:debug:main Sourcing PortGroup muniversal 1.0 from /opt/local/var/macports/sources/rsync.macports.org/macports/release/tarballs/ports/_resources/port1.0/group/muniversal-1.0.tcl
44:debug:main Sourcing PortGroup xcodeversion 1.0 from /opt/local/var/macports/sources/rsync.macports.org/macports/release/tarballs/ports/_resources/port1.0/group/xcodeversion-1.0.tcl
45:debug:main compiler clang 900.0.39.2 not blacklisted because it doesn't match {clang < 318.0.61}
46:debug:main universal variant already exists, so not adding the default one
47:debug:main Executing variant quartz provides quartz
48:debug:main Executing variant x11 provides x11
49:debug:main Running callback portconfigure::add_automatic_compiler_dependencies
50:debug:main Finished running callback portconfigure::add_automatic_compiler_dependencies
51:debug:main Running callback portbuild::add_automatic_buildsystem_dependencies
52:debug:main Finished running callback portbuild::add_automatic_buildsystem_dependencies
53:debug:main No need to upgrade! cairo 1.14.12_0 >= cairo 1.14.12_0
54:debug:main epoch: in tree: 0 installed: 0
55:debug:main libpixman 0.34.0_0 exists in the ports tree
56:debug:main libpixman 0.34.0_0  is the latest installed
57:debug:main libpixman 0.34.0_0  is active
58:debug:main Merging existing variants '' into variants
59:debug:main new fully merged portvariants:
60:debug:main Changing to port directory: /opt/local/var/macports/sources/rsync.macports.org/macports/release/tarballs/ports/graphics/libpixman
61:debug:main OS darwin/17.3.0 (Mac OS X 10.13) arch i386
62:debug:main Sourcing PortGroup compiler_blacklist_versions 1.0 from /opt/local/var/macports/sources/rsync.macports.org/macports/release/tarballs/ports/_resources/port1.0/group/compiler_blacklist_versions-1.0.tcl
63:debug:main Reading variant descriptions from /opt/local/var/macports/sources/rsync.macports.org/macports/release/tarballs/ports/_resources/port1.0/variant_descriptions.conf
64:debug:main Sourcing PortGroup muniversal 1.0 from /opt/local/var/macports/sources/rsync.macports.org/macports/release/tarballs/ports/_resources/port1.0/group/muniversal-1.0.tcl
65:debug:main compiler clang 900.0.39.2 not blacklisted because it doesn't match {clang < 211.10.1}
66:debug:main universal variant already exists, so not adding the default one
67:debug:main Running callback portconfigure::add_automatic_compiler_dependencies
68:debug:main Finished running callback portconfigure::add_automatic_compiler_dependencies
69:debug:main Running callback portbuild::add_automatic_buildsystem_dependencies
70:debug:main Finished running callback portbuild::add_automatic_buildsystem_dependencies
71:debug:main No need to upgrade! libpixman 0.34.0_0 >= libpixman 0.34.0_0
72:debug:main epoch: in tree: 0 installed: 0
73:debug:main glib2 2.54.2_1 exists in the ports tree
74:debug:main glib2 2.54.2_1 +x11 is the latest installed
75:debug:main glib2 2.54.2_1 +x11 is active
76:debug:main Merging existing variants '+x11' into variants
77:debug:main new fully merged portvariants: x11 +
78:debug:main Changing to port directory: /opt/local/var/macports/sources/rsync.macports.org/macports/release/tarballs/ports/devel/glib2
79:debug:main OS darwin/17.3.0 (Mac OS X 10.13) arch i386
80:debug:main Sourcing PortGroup compiler_blacklist_versions 1.0 from /opt/local/var/macports/sources/rsync.macports.org/macports/release/tarballs/ports/_resources/port1.0/group/compiler_blacklist_versions-1.0.tcl
81:debug:main compiler clang 900.0.39.2 not blacklisted because it doesn't match {clang < 600}
82:debug:main Reading variant descriptions from /opt/local/var/macports/sources/rsync.macports.org/macports/release/tarballs/ports/_resources/port1.0/variant_descriptions.conf
83:debug:main adding the default universal variant
84:debug:main Executing variant x11 provides x11
85:debug:main Running callback portconfigure::add_automatic_compiler_dependencies
86:debug:main Finished running callback portconfigure::add_automatic_compiler_dependencies
87:debug:main Running callback portbuild::add_automatic_buildsystem_dependencies
88:debug:main Finished running callback portbuild::add_automatic_buildsystem_dependencies
89:debug:main No need to upgrade! glib2 2.54.2_1 >= glib2 2.54.2_1
90:debug:main epoch: in tree: 2 installed: 2
91:debug:main gettext 0.19.8.1_0 exists in the ports tree
92:debug:main gettext 0.19.8.1_0  is the latest installed
93:debug:main gettext 0.19.8.1_0  is active
94:debug:main Merging existing variants '' into variants
95:debug:main new fully merged portvariants:
96:debug:main Changing to port directory: /opt/local/var/macports/sources/rsync.macports.org/macports/release/tarballs/ports/devel/gettext
97:debug:main OS darwin/17.3.0 (Mac OS X 10.13) arch i386
98:debug:main Sourcing PortGroup compiler_blacklist_versions 1.0 from /opt/local/var/macports/sources/rsync.macports.org/macports/release/tarballs/ports/_resources/port1.0/group/compiler_blacklist_versions-1.0.tcl
99:debug:main Reading variant descriptions from /opt/local/var/macports/sources/rsync.macports.org/macports/release/tarballs/ports/_resources/port1.0/variant_descriptions.conf
100:debug:main Sourcing PortGroup muniversal 1.0 from /opt/local/var/macports/sources/rsync.macports.org/macports/release/tarballs/ports/_resources/port1.0/group/muniversal-1.0.tcl
101:debug:main compiler clang 900.0.39.2 not blacklisted because it doesn't match {clang < 211.10.1}
102:debug:main universal variant already exists, so not adding the default one
103:debug:main Running callback portconfigure::add_automatic_compiler_dependencies
104:debug:main Finished running callback portconfigure::add_automatic_compiler_dependencies
105:debug:main Running callback portbuild::add_automatic_buildsystem_dependencies
106:debug:main Finished running callback portbuild::add_automatic_buildsystem_dependencies
107:debug:main No need to upgrade! gettext 0.19.8.1_0 >= gettext 0.19.8.1_0
108:debug:main epoch: in tree: 0 installed: 0
109:debug:main ncurses 6.0-20171125_0 exists in the ports tree
110:debug:main ncurses 6.0-20171125_0  is the latest installed
111:debug:main ncurses 6.0-20171125_0  is active
112:debug:main Merging existing variants '' into variants
113:debug:main new fully merged portvariants:
114:debug:main Changing to port directory: /opt/local/var/macports/sources/rsync.macports.org/macports/release/tarballs/ports/devel/ncurses
115:debug:main OS darwin/17.3.0 (Mac OS X 10.13) arch i386
116:debug:main adding the default universal variant
117:debug:main Reading variant descriptions from /opt/local/var/macports/sources/rsync.macports.org/macports/release/tarballs/ports/_resources/port1.0/variant_descriptions.conf
118:debug:main Running callback portconfigure::add_automatic_compiler_dependencies
119:debug:main Finished running callback portconfigure::add_automatic_compiler_dependencies
120:debug:main Running callback portbuild::add_automatic_buildsystem_dependencies
121:debug:main Finished running callback portbuild::add_automatic_buildsystem_dependencies
122:debug:main No need to upgrade! ncurses 6.0-20171125_0 >= ncurses 6.0-20171125_0
123:debug:main epoch: in tree: 0 installed: 0
124:debug:main libffi 3.2.1_0 exists in the ports tree
125:debug:main libffi 3.2.1_0  is the latest installed
126:debug:main libffi 3.2.1_0  is active
127:debug:main Merging existing variants '' into variants
128:debug:main new fully merged portvariants:
129:debug:main Changing to port directory: /opt/local/var/macports/sources/rsync.macports.org/macports/release/tarballs/ports/devel/libffi
130:debug:main OS darwin/17.3.0 (Mac OS X 10.13) arch i386
131:debug:main Reading variant descriptions from /opt/local/var/macports/sources/rsync.macports.org/macports/release/tarballs/ports/_resources/port1.0/variant_descriptions.conf
132:debug:main Sourcing PortGroup muniversal 1.0 from /opt/local/var/macports/sources/rsync.macports.org/macports/release/tarballs/ports/_resources/port1.0/group/muniversal-1.0.tcl
133:debug:main universal variant already exists, so not adding the default one
134:debug:main Running callback portconfigure::add_automatic_compiler_dependencies
135:debug:main Finished running callback portconfigure::add_automatic_compiler_dependencies
136:debug:main Running callback portbuild::add_automatic_buildsystem_dependencies
137:debug:main Finished running callback portbuild::add_automatic_buildsystem_dependencies
138:debug:main No need to upgrade! libffi 3.2.1_0 >= libffi 3.2.1_0
139:debug:main epoch: in tree: 0 installed: 0
140:debug:main pcre 8.41_0 exists in the ports tree
141:debug:main pcre 8.41_0  is the latest installed
142:debug:main pcre 8.41_0  is active
143:debug:main Merging existing variants '' into variants
144:debug:main new fully merged portvariants:
145:debug:main Changing to port directory: /opt/local/var/macports/sources/rsync.macports.org/macports/release/tarballs/ports/devel/pcre
146:debug:main OS darwin/17.3.0 (Mac OS X 10.13) arch i386
147:debug:main adding the default universal variant
148:debug:main Reading variant descriptions from /opt/local/var/macports/sources/rsync.macports.org/macports/release/tarballs/ports/_resources/port1.0/variant_descriptions.conf
149:debug:main Running callback portconfigure::add_automatic_compiler_dependencies
150:debug:main Finished running callback portconfigure::add_automatic_compiler_dependencies
151:debug:main Running callback portbuild::add_automatic_buildsystem_dependencies
152:debug:main Finished running callback portbuild::add_automatic_buildsystem_dependencies
153:debug:main No need to upgrade! pcre 8.41_0 >= pcre 8.41_0
154:debug:main epoch: in tree: 0 installed: 0
155:debug:main bzip2 1.0.6_0 exists in the ports tree
156:debug:main bzip2 1.0.6_0  is the latest installed
157:debug:main bzip2 1.0.6_0  is active
158:debug:main Merging existing variants '' into variants
159:debug:main new fully merged portvariants:
160:debug:main Changing to port directory: /opt/local/var/macports/sources/rsync.macports.org/macports/release/tarballs/ports/archivers/bzip2
161:debug:main OS darwin/17.3.0 (Mac OS X 10.13) arch i386
162:debug:main Reading variant descriptions from /opt/local/var/macports/sources/rsync.macports.org/macports/release/tarballs/ports/_resources/port1.0/variant_descriptions.conf
163:debug:main universal variant already exists, so not adding the default one
164:debug:main Running callback portconfigure::add_automatic_compiler_dependencies
165:debug:main Finished running callback portconfigure::add_automatic_compiler_dependencies
166:debug:main Running callback portbuild::add_automatic_buildsystem_dependencies
167:debug:main Finished running callback portbuild::add_automatic_buildsystem_dependencies
168:debug:main No need to upgrade! bzip2 1.0.6_0 >= bzip2 1.0.6_0
169:debug:main epoch: in tree: 20090923 installed: 20090923
170:debug:main libedit 20170329-3.1_2 exists in the ports tree
171:debug:main libedit 20170329-3.1_2  is the latest installed
172:debug:main libedit 20170329-3.1_2  is active
173:debug:main Merging existing variants '' into variants
174:debug:main new fully merged portvariants:
175:debug:main Changing to port directory: /opt/local/var/macports/sources/rsync.macports.org/macports/release/tarballs/ports/devel/libedit
176:debug:main OS darwin/17.3.0 (Mac OS X 10.13) arch i386
177:debug:main Reading variant descriptions from /opt/local/var/macports/sources/rsync.macports.org/macports/release/tarballs/ports/_resources/port1.0/variant_descriptions.conf
178:debug:main Sourcing PortGroup muniversal 1.0 from /opt/local/var/macports/sources/rsync.macports.org/macports/release/tarballs/ports/_resources/port1.0/group/muniversal-1.0.tcl
179:debug:main universal variant already exists, so not adding the default one
180:debug:main Running callback portconfigure::add_automatic_compiler_dependencies
181:debug:main Finished running callback portconfigure::add_automatic_compiler_dependencies
182:debug:main Running callback portbuild::add_automatic_buildsystem_dependencies
183:debug:main Finished running callback portbuild::add_automatic_buildsystem_dependencies
184:debug:main No need to upgrade! libedit 20170329-3.1_2 >= libedit 20170329-3.1_2
185:debug:main epoch: in tree: 0 installed: 0
186:debug:main zlib 1.2.11_0 exists in the ports tree
187:debug:main zlib 1.2.11_0  is the latest installed
188:debug:main zlib 1.2.11_0  is active
189:debug:main Merging existing variants '' into variants
190:debug:main new fully merged portvariants:
191:debug:main Changing to port directory: /opt/local/var/macports/sources/rsync.macports.org/macports/release/tarballs/ports/archivers/zlib
192:debug:main OS darwin/17.3.0 (Mac OS X 10.13) arch i386
193:debug:main Sourcing PortGroup xcodeversion 1.0 from /opt/local/var/macports/sources/rsync.macports.org/macports/release/tarballs/ports/_resources/port1.0/group/xcodeversion-1.0.tcl
194:debug:main adding the default universal variant
195:debug:main Reading variant descriptions from /opt/local/var/macports/sources/rsync.macports.org/macports/release/tarballs/ports/_resources/port1.0/variant_descriptions.conf
196:debug:main Running callback portconfigure::add_automatic_compiler_dependencies
197:debug:main Finished running callback portconfigure::add_automatic_compiler_dependencies
198:debug:main Running callback portbuild::add_automatic_buildsystem_dependencies
199:debug:main Finished running callback portbuild::add_automatic_buildsystem_dependencies
200:debug:main No need to upgrade! zlib 1.2.11_0 >= zlib 1.2.11_0
201:debug:main epoch: in tree: 0 installed: 0
202:debug:main fontconfig 2.12.6_1 exists in the ports tree
203:debug:main fontconfig 2.12.6_1  is the latest installed
204:debug:main fontconfig 2.12.6_1  is active
205:debug:main Merging existing variants '' into variants
206:debug:main new fully merged portvariants:
207:debug:main Changing to port directory: /opt/local/var/macports/sources/rsync.macports.org/macports/release/tarballs/ports/graphics/fontconfig
208:debug:main OS darwin/17.3.0 (Mac OS X 10.13) arch i386
209:debug:main Reading variant descriptions from /opt/local/var/macports/sources/rsync.macports.org/macports/release/tarballs/ports/_resources/port1.0/variant_descriptions.conf
210:debug:main Sourcing PortGroup muniversal 1.0 from /opt/local/var/macports/sources/rsync.macports.org/macports/release/tarballs/ports/_resources/port1.0/group/muniversal-1.0.tcl
211:debug:main universal variant already exists, so not adding the default one
212:debug:main Running callback portconfigure::add_automatic_compiler_dependencies
213:debug:main Finished running callback portconfigure::add_automatic_compiler_dependencies
214:debug:main Running callback portbuild::add_automatic_buildsystem_dependencies
215:debug:main Finished running callback portbuild::add_automatic_buildsystem_dependencies
216:debug:main No need to upgrade! fontconfig 2.12.6_1 >= fontconfig 2.12.6_1
217:debug:main epoch: in tree: 0 installed: 0
218:debug:main expat 2.2.5_0 exists in the ports tree
219:debug:main expat 2.2.5_0  is the latest installed
220:debug:main expat 2.2.5_0  is active
221:debug:main Merging existing variants '' into variants
222:debug:main new fully merged portvariants:
223:debug:main Changing to port directory: /opt/local/var/macports/sources/rsync.macports.org/macports/release/tarballs/ports/textproc/expat
224:debug:main OS darwin/17.3.0 (Mac OS X 10.13) arch i386
225:debug:main adding the default universal variant
226:debug:main Reading variant descriptions from /opt/local/var/macports/sources/rsync.macports.org/macports/release/tarballs/ports/_resources/port1.0/variant_descriptions.conf
227:debug:main Running callback portconfigure::add_automatic_compiler_dependencies
228:debug:main Finished running callback portconfigure::add_automatic_compiler_dependencies
229:debug:main Running callback portbuild::add_automatic_buildsystem_dependencies
230:debug:main Finished running callback portbuild::add_automatic_buildsystem_dependencies
231:debug:main No need to upgrade! expat 2.2.5_0 >= expat 2.2.5_0
232:debug:main epoch: in tree: 0 installed: 0
233:debug:main freetype 2.8_0 exists in the ports tree
234:debug:main freetype 2.8_0  is the latest installed
235:debug:main freetype 2.8_0  is active
236:debug:main Merging existing variants '' into variants
237:debug:main new fully merged portvariants:
238:debug:main Changing to port directory: /opt/local/var/macports/sources/rsync.macports.org/macports/release/tarballs/ports/print/freetype
239:debug:main OS darwin/17.3.0 (Mac OS X 10.13) arch i386
240:debug:main Reading variant descriptions from /opt/local/var/macports/sources/rsync.macports.org/macports/release/tarballs/ports/_resources/port1.0/variant_descriptions.conf
241:debug:main Sourcing PortGroup muniversal 1.0 from /opt/local/var/macports/sources/rsync.macports.org/macports/release/tarballs/ports/_resources/port1.0/group/muniversal-1.0.tcl
242:debug:main universal variant already exists, so not adding the default one
243:debug:main Running callback portconfigure::add_automatic_compiler_dependencies
244:debug:main Finished running callback portconfigure::add_automatic_compiler_dependencies
245:debug:main Running callback portbuild::add_automatic_buildsystem_dependencies
246:debug:main Finished running callback portbuild::add_automatic_buildsystem_dependencies
247:debug:main No need to upgrade! freetype 2.8_0 >= freetype 2.8_0
248:debug:main epoch: in tree: 0 installed: 0
249:debug:main libpng 1.6.34_0 exists in the ports tree
250:debug:main libpng 1.6.34_0  is the latest installed
251:debug:main libpng 1.6.34_0  is active
252:debug:main Merging existing variants '' into variants
253:debug:main new fully merged portvariants:
254:debug:main Changing to port directory: /opt/local/var/macports/sources/rsync.macports.org/macports/release/tarballs/ports/graphics/libpng
255:debug:main OS darwin/17.3.0 (Mac OS X 10.13) arch i386
256:debug:main adding the default universal variant
257:debug:main Reading variant descriptions from /opt/local/var/macports/sources/rsync.macports.org/macports/release/tarballs/ports/_resources/port1.0/variant_descriptions.conf
258:debug:main Running callback portconfigure::add_automatic_compiler_dependencies
259:debug:main Finished running callback portconfigure::add_automatic_compiler_dependencies
260:debug:main Running callback portbuild::add_automatic_buildsystem_dependencies
261:debug:main Finished running callback portbuild::add_automatic_buildsystem_dependencies
262:debug:main No need to upgrade! libpng 1.6.34_0 >= libpng 1.6.34_0
263:debug:main epoch: in tree: 0 installed: 0
264:debug:main xrender 0.9.10_0 exists in the ports tree
265:debug:main xrender 0.9.10_0  is the latest installed
266:debug:main xrender 0.9.10_0  is active
267:debug:main Merging existing variants '' into variants
268:debug:main new fully merged portvariants:
269:debug:main Changing to port directory: /opt/local/var/macports/sources/rsync.macports.org/macports/release/tarballs/ports/x11/xrender
270:debug:main OS darwin/17.3.0 (Mac OS X 10.13) arch i386
271:debug:main adding the default universal variant
272:debug:main Reading variant descriptions from /opt/local/var/macports/sources/rsync.macports.org/macports/release/tarballs/ports/_resources/port1.0/variant_descriptions.conf
273:debug:main Running callback portconfigure::add_automatic_compiler_dependencies
274:debug:main Finished running callback portconfigure::add_automatic_compiler_dependencies
275:debug:main Running callback portbuild::add_automatic_buildsystem_dependencies
276:debug:main Finished running callback portbuild::add_automatic_buildsystem_dependencies
277:debug:main No need to upgrade! xrender 0.9.10_0 >= xrender 0.9.10_0
278:debug:main epoch: in tree: 0 installed: 0
279:debug:main xorg-libX11 1.6.5_0 exists in the ports tree
280:debug:main xorg-libX11 1.6.5_0  is the latest installed
281:debug:main xorg-libX11 1.6.5_0  is active
282:debug:main Merging existing variants '' into variants
283:debug:main new fully merged portvariants:
284:debug:main Changing to port directory: /opt/local/var/macports/sources/rsync.macports.org/macports/release/tarballs/ports/x11/xorg-libX11
285:debug:main OS darwin/17.3.0 (Mac OS X 10.13) arch i386
286:debug:main adding the default universal variant
287:debug:main Reading variant descriptions from /opt/local/var/macports/sources/rsync.macports.org/macports/release/tarballs/ports/_resources/port1.0/variant_descriptions.conf
288:debug:main Running callback portconfigure::add_automatic_compiler_dependencies
289:debug:main Finished running callback portconfigure::add_automatic_compiler_dependencies
290:debug:main Running callback portbuild::add_automatic_buildsystem_dependencies
291:debug:main Finished running callback portbuild::add_automatic_buildsystem_dependencies
292:debug:main No need to upgrade! xorg-libX11 1.6.5_0 >= xorg-libX11 1.6.5_0
293:debug:main epoch: in tree: 0 installed: 0
294:debug:main xorg-libXdmcp 1.1.2_0 exists in the ports tree
295:debug:main xorg-libXdmcp 1.1.2_0  is the latest installed
296:debug:main xorg-libXdmcp 1.1.2_0  is active
297:debug:main Merging existing variants '' into variants
298:debug:main new fully merged portvariants:
299:debug:main Changing to port directory: /opt/local/var/macports/sources/rsync.macports.org/macports/release/tarballs/ports/x11/xorg-libXdmcp
300:debug:main OS darwin/17.3.0 (Mac OS X 10.13) arch i386
301:debug:main adding the default universal variant
302:debug:main Reading variant descriptions from /opt/local/var/macports/sources/rsync.macports.org/macports/release/tarballs/ports/_resources/port1.0/variant_descriptions.conf
303:debug:main Running callback portconfigure::add_automatic_compiler_dependencies
304:debug:main Finished running callback portconfigure::add_automatic_compiler_dependencies
305:debug:main Running callback portbuild::add_automatic_buildsystem_dependencies
306:debug:main Finished running callback portbuild::add_automatic_buildsystem_dependencies
307:debug:main No need to upgrade! xorg-libXdmcp 1.1.2_0 >= xorg-libXdmcp 1.1.2_0
308:debug:main epoch: in tree: 0 installed: 0
309:debug:main xorg-libXau 1.0.8_0 exists in the ports tree
310:debug:main xorg-libXau 1.0.8_0  is the latest installed
311:debug:main xorg-libXau 1.0.8_0  is active
312:debug:main Merging existing variants '' into variants
313:debug:main new fully merged portvariants:
314:debug:main Changing to port directory: /opt/local/var/macports/sources/rsync.macports.org/macports/release/tarballs/ports/x11/xorg-libXau
315:debug:main OS darwin/17.3.0 (Mac OS X 10.13) arch i386
316:debug:main adding the default universal variant
317:debug:main Reading variant descriptions from /opt/local/var/macports/sources/rsync.macports.org/macports/release/tarballs/ports/_resources/port1.0/variant_descriptions.conf
318:debug:main Running callback portconfigure::add_automatic_compiler_dependencies
319:debug:main Finished running callback portconfigure::add_automatic_compiler_dependencies
320:debug:main Running callback portbuild::add_automatic_buildsystem_dependencies
321:debug:main Finished running callback portbuild::add_automatic_buildsystem_dependencies
322:debug:main No need to upgrade! xorg-libXau 1.0.8_0 >= xorg-libXau 1.0.8_0
323:debug:main epoch: in tree: 0 installed: 0
324:debug:main xorg-xproto 7.0.31_0 exists in the ports tree
325:debug:main xorg-xproto 7.0.31_0  is the latest installed
326:debug:main xorg-xproto 7.0.31_0  is active
327:debug:main Merging existing variants '' into variants
328:debug:main new fully merged portvariants:
329:debug:main Changing to port directory: /opt/local/var/macports/sources/rsync.macports.org/macports/release/tarballs/ports/x11/xorg-xproto
330:debug:main OS darwin/17.3.0 (Mac OS X 10.13) arch i386
331:debug:main only one arch supported, so not adding the default universal variant
332:debug:main Running callback portconfigure::add_automatic_compiler_dependencies
333:debug:main Finished running callback portconfigure::add_automatic_compiler_dependencies
334:debug:main Running callback portbuild::add_automatic_buildsystem_dependencies
335:debug:main Finished running callback portbuild::add_automatic_buildsystem_dependencies
336:debug:main No need to upgrade! xorg-xproto 7.0.31_0 >= xorg-xproto 7.0.31_0
337:debug:main epoch: in tree: 0 installed: 0
338:debug:main xorg-libxcb 1.12_2 exists in the ports tree
339:debug:main xorg-libxcb 1.12_2 +python27 is the latest installed
340:debug:main xorg-libxcb 1.12_2 +python27 is active
341:debug:main Merging existing variants '+python27' into variants
342:debug:main new fully merged portvariants: python27 +
343:debug:main Changing to port directory: /opt/local/var/macports/sources/rsync.macports.org/macports/release/tarballs/ports/x11/xorg-libxcb
344:debug:main OS darwin/17.3.0 (Mac OS X 10.13) arch i386
345:debug:main adding the default universal variant
346:debug:main Reading variant descriptions from /opt/local/var/macports/sources/rsync.macports.org/macports/release/tarballs/ports/_resources/port1.0/variant_descriptions.conf
347:debug:main Executing variant python27 provides python27
348:debug:main Running callback portconfigure::add_automatic_compiler_dependencies
349:debug:main Finished running callback portconfigure::add_automatic_compiler_dependencies
350:debug:main Running callback portbuild::add_automatic_buildsystem_dependencies
351:debug:main Finished running callback portbuild::add_automatic_buildsystem_dependencies
352:debug:main No need to upgrade! xorg-libxcb 1.12_2 >= xorg-libxcb 1.12_2
353:debug:main epoch: in tree: 0 installed: 0
354:debug:main xorg-xcb-proto 1.12_1 exists in the ports tree
355:debug:main xorg-xcb-proto 1.12_1 +python27 is the latest installed
356:debug:main xorg-xcb-proto 1.12_1 +python27 is active
357:debug:main Merging existing variants '+python27' into variants
358:debug:main new fully merged portvariants: python27 +
359:debug:main Changing to port directory: /opt/local/var/macports/sources/rsync.macports.org/macports/release/tarballs/ports/x11/xorg-xcb-proto
360:debug:main OS darwin/17.3.0 (Mac OS X 10.13) arch i386
361:debug:main only one arch supported, so not adding the default universal variant
362:debug:main Executing variant python27 provides python27
363:debug:main Running callback portconfigure::add_automatic_compiler_dependencies
364:debug:main Finished running callback portconfigure::add_automatic_compiler_dependencies
365:debug:main Running callback portbuild::add_automatic_buildsystem_dependencies
366:debug:main Finished running callback portbuild::add_automatic_buildsystem_dependencies
367:debug:main No need to upgrade! xorg-xcb-proto 1.12_1 >= xorg-xcb-proto 1.12_1
368:debug:main epoch: in tree: 2 installed: 2
369:debug:main python27 2.7.14_0 exists in the ports tree
370:debug:main python27 2.7.14_0  is the latest installed
371:debug:main python27 2.7.14_0  is active
372:debug:main Merging existing variants '' into variants
373:debug:main new fully merged portvariants:
374:debug:main Changing to port directory: /opt/local/var/macports/sources/rsync.macports.org/macports/release/tarballs/ports/lang/python27
375:debug:main OS darwin/17.3.0 (Mac OS X 10.13) arch i386
376:debug:main Sourcing PortGroup select 1.0 from /opt/local/var/macports/sources/rsync.macports.org/macports/release/tarballs/ports/_resources/port1.0/group/select-1.0.tcl
377:debug:main Reading variant descriptions from /opt/local/var/macports/sources/rsync.macports.org/macports/release/tarballs/ports/_resources/port1.0/variant_descriptions.conf
378:debug:main universal variant already exists, so not adding the default one
379:debug:main Running callback portconfigure::add_automatic_compiler_dependencies
380:debug:main Finished running callback portconfigure::add_automatic_compiler_dependencies
381:debug:main Running callback portbuild::add_automatic_buildsystem_dependencies
382:debug:main Finished running callback portbuild::add_automatic_buildsystem_dependencies
383:debug:main No need to upgrade! python27 2.7.14_0 >= python27 2.7.14_0
384:debug:main epoch: in tree: 0 installed: 0
385:debug:main db48 4.8.30_4 exists in the ports tree
386:debug:main db48 4.8.30_4  is the latest installed
387:debug:main db48 4.8.30_4  is active
388:debug:main Merging existing variants '' into variants
389:debug:main new fully merged portvariants:
390:debug:main Changing to port directory: /opt/local/var/macports/sources/rsync.macports.org/macports/release/tarballs/ports/databases/db48
391:debug:main OS darwin/17.3.0 (Mac OS X 10.13) arch i386
392:debug:main Reading variant descriptions from /opt/local/var/macports/sources/rsync.macports.org/macports/release/tarballs/ports/_resources/port1.0/variant_descriptions.conf
393:debug:main Sourcing PortGroup muniversal 1.0 from /opt/local/var/macports/sources/rsync.macports.org/macports/release/tarballs/ports/_resources/port1.0/group/muniversal-1.0.tcl
394:debug:main universal variant already exists, so not adding the default one
395:debug:main Running callback portconfigure::add_automatic_compiler_dependencies
396:debug:main Finished running callback portconfigure::add_automatic_compiler_dependencies
397:debug:main Running callback portbuild::add_automatic_buildsystem_dependencies
398:debug:main Finished running callback portbuild::add_automatic_buildsystem_dependencies
399:debug:main No need to upgrade! db48 4.8.30_4 >= db48 4.8.30_4
400:debug:main epoch: in tree: 1 installed: 1
401:debug:main openssl 1.0.2n_0 exists in the ports tree
402:debug:main openssl 1.0.2n_0  is the latest installed
403:debug:main openssl 1.0.2n_0  is active
404:debug:main Merging existing variants '' into variants
405:debug:main new fully merged portvariants:
406:debug:main Changing to port directory: /opt/local/var/macports/sources/rsync.macports.org/macports/release/tarballs/ports/devel/openssl
407:debug:main OS darwin/17.3.0 (Mac OS X 10.13) arch i386
408:debug:main Reading variant descriptions from /opt/local/var/macports/sources/rsync.macports.org/macports/release/tarballs/ports/_resources/port1.0/variant_descriptions.conf
409:debug:main Sourcing PortGroup muniversal 1.0 from /opt/local/var/macports/sources/rsync.macports.org/macports/release/tarballs/ports/_resources/port1.0/group/muniversal-1.0.tcl
410:debug:main universal variant already exists, so not adding the default one
411:debug:main Running callback portconfigure::add_automatic_compiler_dependencies
412:debug:main Finished running callback portconfigure::add_automatic_compiler_dependencies
413:debug:main Running callback portbuild::add_automatic_buildsystem_dependencies
414:debug:main Finished running callback portbuild::add_automatic_buildsystem_dependencies
415:debug:main No need to upgrade! openssl 1.0.2n_0 >= openssl 1.0.2n_0
416:debug:main epoch: in tree: 0 installed: 0
417:debug:main sqlite3 3.21.0_0 exists in the ports tree
418:debug:main sqlite3 3.21.0_0  is the latest installed
419:debug:main sqlite3 3.21.0_0  is active
420:debug:main Merging existing variants '' into variants
421:debug:main new fully merged portvariants:
422:debug:main Changing to port directory: /opt/local/var/macports/sources/rsync.macports.org/macports/release/tarballs/ports/databases/sqlite3
423:debug:main OS darwin/17.3.0 (Mac OS X 10.13) arch i386
424:debug:main adding the default universal variant
425:debug:main Reading variant descriptions from /opt/local/var/macports/sources/rsync.macports.org/macports/release/tarballs/ports/_resources/port1.0/variant_descriptions.conf
426:debug:main Running callback portconfigure::add_automatic_compiler_dependencies
427:debug:main Finished running callback portconfigure::add_automatic_compiler_dependencies
428:debug:main Running callback portbuild::add_automatic_buildsystem_dependencies
429:debug:main Finished running callback portbuild::add_automatic_buildsystem_dependencies
430:debug:main No need to upgrade! sqlite3 3.21.0_0 >= sqlite3 3.21.0_0
431:debug:main epoch: in tree: 0 installed: 0
432:debug:main python_select 0.3_7 exists in the ports tree
433:debug:main python_select 0.3_7  is the latest installed
434:debug:main python_select 0.3_7  is active
435:debug:main Merging existing variants '' into variants
436:debug:main new fully merged portvariants:
437:debug:main Changing to port directory: /opt/local/var/macports/sources/rsync.macports.org/macports/release/tarballs/ports/sysutils/python_select
438:debug:main OS darwin/17.3.0 (Mac OS X 10.13) arch i386
439:debug:main Sourcing PortGroup select 1.0 from /opt/local/var/macports/sources/rsync.macports.org/macports/release/tarballs/ports/_resources/port1.0/group/select-1.0.tcl
440:debug:main universal_variant is false, so not adding the default universal variant
441:debug:main Running callback portconfigure::add_automatic_compiler_dependencies
442:debug:main Finished running callback portconfigure::add_automatic_compiler_dependencies
443:debug:main Running callback portbuild::add_automatic_buildsystem_dependencies
444:debug:main Finished running callback portbuild::add_automatic_buildsystem_dependencies
445:debug:main No need to upgrade! python_select 0.3_7 >= python_select 0.3_7
446:debug:main epoch: in tree: 0 installed: 0
447:debug:main python2_select 0.0_2 exists in the ports tree
448:debug:main python2_select 0.0_2  is the latest installed
449:debug:main python2_select 0.0_2  is active
450:debug:main Merging existing variants '' into variants
451:debug:main new fully merged portvariants:
452:debug:main Changing to port directory: /opt/local/var/macports/sources/rsync.macports.org/macports/release/tarballs/ports/sysutils/python2_select
453:debug:main OS darwin/17.3.0 (Mac OS X 10.13) arch i386
454:debug:main Sourcing PortGroup select 1.0 from /opt/local/var/macports/sources/rsync.macports.org/macports/release/tarballs/ports/_resources/port1.0/group/select-1.0.tcl
455:debug:main universal_variant is false, so not adding the default universal variant
456:debug:main Running callback portconfigure::add_automatic_compiler_dependencies
457:debug:main Finished running callback portconfigure::add_automatic_compiler_dependencies
458:debug:main Running callback portbuild::add_automatic_buildsystem_dependencies
459:debug:main Finished running callback portbuild::add_automatic_buildsystem_dependencies
460:debug:main No need to upgrade! python2_select 0.0_2 >= python2_select 0.0_2
461:debug:main epoch: in tree: 0 installed: 0
462:debug:main libxml2 2.9.7_0 exists in the ports tree
463:debug:main libxml2 2.9.7_0  is the latest installed
464:debug:main libxml2 2.9.7_0  is active
465:debug:main Merging existing variants '' into variants
466:debug:main new fully merged portvariants:
467:debug:main Changing to port directory: /opt/local/var/macports/sources/rsync.macports.org/macports/release/tarballs/ports/textproc/libxml2
468:debug:main OS darwin/17.3.0 (Mac OS X 10.13) arch i386
469:debug:main adding the default universal variant
470:debug:main Reading variant descriptions from /opt/local/var/macports/sources/rsync.macports.org/macports/release/tarballs/ports/_resources/port1.0/variant_descriptions.conf
471:debug:main Running callback portconfigure::add_automatic_compiler_dependencies
472:debug:main Finished running callback portconfigure::add_automatic_compiler_dependencies
473:debug:main Running callback portbuild::add_automatic_buildsystem_dependencies
474:debug:main Finished running callback portbuild::add_automatic_buildsystem_dependencies
475:debug:main No need to upgrade! libxml2 2.9.7_0 >= libxml2 2.9.7_0
476:debug:main epoch: in tree: 0 installed: 0
477:debug:main xz 5.2.3_0 exists in the ports tree
478:debug:main xz 5.2.3_0  is the latest installed
479:debug:main xz 5.2.3_0  is active
480:debug:main Merging existing variants '' into variants
481:debug:main new fully merged portvariants:
482:debug:main Changing to port directory: /opt/local/var/macports/sources/rsync.macports.org/macports/release/tarballs/ports/archivers/xz
483:debug:main OS darwin/17.3.0 (Mac OS X 10.13) arch i386
484:debug:main adding the default universal variant
485:debug:main Reading variant descriptions from /opt/local/var/macports/sources/rsync.macports.org/macports/release/tarballs/ports/_resources/port1.0/variant_descriptions.conf
486:debug:main Running callback portconfigure::add_automatic_compiler_dependencies
487:debug:main Finished running callback portconfigure::add_automatic_compiler_dependencies
488:debug:main Running callback portbuild::add_automatic_buildsystem_dependencies
489:debug:main Finished running callback portbuild::add_automatic_buildsystem_dependencies
490:debug:main No need to upgrade! xz 5.2.3_0 >= xz 5.2.3_0
491:debug:main epoch: in tree: 0 installed: 0
492:debug:main xorg-libpthread-stubs 0.4_0 exists in the ports tree
493:debug:main xorg-libpthread-stubs 0.4_0  is the latest installed
494:debug:main xorg-libpthread-stubs 0.4_0  is active
495:debug:main Merging existing variants '' into variants
496:debug:main new fully merged portvariants:
497:debug:main Changing to port directory: /opt/local/var/macports/sources/rsync.macports.org/macports/release/tarballs/ports/x11/xorg-libpthread-stubs
498:debug:main OS darwin/17.3.0 (Mac OS X 10.13) arch i386
499:debug:main only one arch supported, so not adding the default universal variant
500:debug:main Running callback portconfigure::add_automatic_compiler_dependencies
501:debug:main Finished running callback portconfigure::add_automatic_compiler_dependencies
502:debug:main Running callback portbuild::add_automatic_buildsystem_dependencies
503:debug:main Finished running callback portbuild::add_automatic_buildsystem_dependencies
504:debug:main No need to upgrade! xorg-libpthread-stubs 0.4_0 >= xorg-libpthread-stubs 0.4_0
505:debug:main epoch: in tree: 0 installed: 0
506:debug:main xorg-kbproto 1.0.7_0 exists in the ports tree
507:debug:main xorg-kbproto 1.0.7_0  is the latest installed
508:debug:main xorg-kbproto 1.0.7_0  is active
509:debug:main Merging existing variants '' into variants
510:debug:main new fully merged portvariants:
511:debug:main Changing to port directory: /opt/local/var/macports/sources/rsync.macports.org/macports/release/tarballs/ports/x11/xorg-kbproto
512:debug:main OS darwin/17.3.0 (Mac OS X 10.13) arch i386
513:debug:main only one arch supported, so not adding the default universal variant
514:debug:main Running callback portconfigure::add_automatic_compiler_dependencies
515:debug:main Finished running callback portconfigure::add_automatic_compiler_dependencies
516:debug:main Running callback portbuild::add_automatic_buildsystem_dependencies
517:debug:main Finished running callback portbuild::add_automatic_buildsystem_dependencies
518:debug:main No need to upgrade! xorg-kbproto 1.0.7_0 >= xorg-kbproto 1.0.7_0
519:debug:main epoch: in tree: 0 installed: 0
520:debug:main xorg-renderproto 0.11.1_0 exists in the ports tree
521:debug:main xorg-renderproto 0.11.1_0  is the latest installed
522:debug:main xorg-renderproto 0.11.1_0  is active
523:debug:main Merging existing variants '' into variants
524:debug:main new fully merged portvariants:
525:debug:main Changing to port directory: /opt/local/var/macports/sources/rsync.macports.org/macports/release/tarballs/ports/x11/xorg-renderproto
526:debug:main OS darwin/17.3.0 (Mac OS X 10.13) arch i386
527:debug:main only one arch supported, so not adding the default universal variant
528:debug:main Running callback portconfigure::add_automatic_compiler_dependencies
529:debug:main Finished running callback portconfigure::add_automatic_compiler_dependencies
530:debug:main Running callback portbuild::add_automatic_buildsystem_dependencies
531:debug:main Finished running callback portbuild::add_automatic_buildsystem_dependencies
532:debug:main No need to upgrade! xorg-renderproto 0.11.1_0 >= xorg-renderproto 0.11.1_0
533:debug:main epoch: in tree: 0 installed: 0
534:debug:main xorg-libXext 1.3.3_0 exists in the ports tree
535:debug:main xorg-libXext 1.3.3_0  is the latest installed
536:debug:main xorg-libXext 1.3.3_0  is active
537:debug:main Merging existing variants '' into variants
538:debug:main new fully merged portvariants:
539:debug:main Changing to port directory: /opt/local/var/macports/sources/rsync.macports.org/macports/release/tarballs/ports/x11/xorg-libXext
540:debug:main OS darwin/17.3.0 (Mac OS X 10.13) arch i386
541:debug:main adding the default universal variant
542:debug:main Reading variant descriptions from /opt/local/var/macports/sources/rsync.macports.org/macports/release/tarballs/ports/_resources/port1.0/variant_descriptions.conf
543:debug:main Running callback portconfigure::add_automatic_compiler_dependencies
544:debug:main Finished running callback portconfigure::add_automatic_compiler_dependencies
545:debug:main Running callback portbuild::add_automatic_buildsystem_dependencies
546:debug:main Finished running callback portbuild::add_automatic_buildsystem_dependencies
547:debug:main No need to upgrade! xorg-libXext 1.3.3_0 >= xorg-libXext 1.3.3_0
548:debug:main epoch: in tree: 0 installed: 0
549:debug:main xorg-xextproto 7.3.0_0 exists in the ports tree
550:debug:main xorg-xextproto 7.3.0_0  is the latest installed
551:debug:main xorg-xextproto 7.3.0_0  is active
552:debug:main Merging existing variants '' into variants
553:debug:main new fully merged portvariants:
554:debug:main Changing to port directory: /opt/local/var/macports/sources/rsync.macports.org/macports/release/tarballs/ports/x11/xorg-xextproto
555:debug:main OS darwin/17.3.0 (Mac OS X 10.13) arch i386
556:debug:main only one arch supported, so not adding the default universal variant
557:debug:main Running callback portconfigure::add_automatic_compiler_dependencies
558:debug:main Finished running callback portconfigure::add_automatic_compiler_dependencies
559:debug:main Running callback portbuild::add_automatic_buildsystem_dependencies
560:debug:main Finished running callback portbuild::add_automatic_buildsystem_dependencies
561:debug:main No need to upgrade! xorg-xextproto 7.3.0_0 >= xorg-xextproto 7.3.0_0
562:debug:main epoch: in tree: 0 installed: 0
563:debug:main xorg-xcb-util 0.4.0_0 exists in the ports tree
564:debug:main xorg-xcb-util 0.4.0_0  is the latest installed
565:debug:main xorg-xcb-util 0.4.0_0  is active
566:debug:main Merging existing variants '' into variants
567:debug:main new fully merged portvariants:
568:debug:main Changing to port directory: /opt/local/var/macports/sources/rsync.macports.org/macports/release/tarballs/ports/x11/xorg-xcb-util
569:debug:main OS darwin/17.3.0 (Mac OS X 10.13) arch i386
570:debug:main adding the default universal variant
571:debug:main Reading variant descriptions from /opt/local/var/macports/sources/rsync.macports.org/macports/release/tarballs/ports/_resources/port1.0/variant_descriptions.conf
572:debug:main Running callback portconfigure::add_automatic_compiler_dependencies
573:debug:main Finished running callback portconfigure::add_automatic_compiler_dependencies
574:debug:main Running callback portbuild::add_automatic_buildsystem_dependencies
575:debug:main Finished running callback portbuild::add_automatic_buildsystem_dependencies
576:debug:main No need to upgrade! xorg-xcb-util 0.4.0_0 >= xorg-xcb-util 0.4.0_0
577:debug:main epoch: in tree: 0 installed: 0
578:debug:main jpeg 9b_0 exists in the ports tree
579:debug:main jpeg 9b_0  is the latest installed
580:debug:main jpeg 9b_0  is active
581:debug:main Merging existing variants '' into variants
582:debug:main new fully merged portvariants:
583:debug:main Changing to port directory: /opt/local/var/macports/sources/rsync.macports.org/macports/release/tarballs/ports/graphics/jpeg
584:debug:main OS darwin/17.3.0 (Mac OS X 10.13) arch i386
585:debug:main adding the default universal variant
586:debug:main Reading variant descriptions from /opt/local/var/macports/sources/rsync.macports.org/macports/release/tarballs/ports/_resources/port1.0/variant_descriptions.conf
587:debug:main Running callback portconfigure::add_automatic_compiler_dependencies
588:debug:main Finished running callback portconfigure::add_automatic_compiler_dependencies
589:debug:main Running callback portbuild::add_automatic_buildsystem_dependencies
590:debug:main Finished running callback portbuild::add_automatic_buildsystem_dependencies
591:debug:main No need to upgrade! jpeg 9b_0 >= jpeg 9b_0
592:debug:main epoch: in tree: 0 installed: 0
593:debug:main poppler 0.57.0_0 exists in the ports tree
594:debug:main poppler 0.57.0_0  is the latest installed
595:debug:main poppler 0.57.0_0  is active
596:debug:main Merging existing variants '' into variants
597:debug:main new fully merged portvariants:
598:debug:main Changing to port directory: /opt/local/var/macports/sources/rsync.macports.org/macports/release/tarballs/ports/graphics/poppler
599:debug:main OS darwin/17.3.0 (Mac OS X 10.13) arch i386
600:debug:main Sourcing PortGroup compiler_blacklist_versions 1.0 from /opt/local/var/macports/sources/rsync.macports.org/macports/release/tarballs/ports/_resources/port1.0/group/compiler_blacklist_versions-1.0.tcl
601:debug:main Sourcing PortGroup compiler_blacklist_versions 1.0 from /opt/local/var/macports/sources/rsync.macports.org/macports/release/tarballs/ports/_resources/port1.0/group/compiler_blacklist_versions-1.0.tcl
602:debug:main compiler clang 900.0.39.2 not blacklisted because it doesn't match {clang < 500}
603:debug:main Sourcing PortGroup cxx11 1.1 from /opt/local/var/macports/sources/rsync.macports.org/macports/release/tarballs/ports/_resources/port1.0/group/cxx11-1.1.tcl
604:debug:main Sourcing PortGroup gobject_introspection 1.0 from /opt/local/var/macports/sources/rsync.macports.org/macports/release/tarballs/ports/_resources/port1.0/group/gobject_introspection-1.0.tcl
605:debug:main Reading variant descriptions from /opt/local/var/macports/sources/rsync.macports.org/macports/release/tarballs/ports/_resources/port1.0/variant_descriptions.conf
606:debug:main Sourcing PortGroup muniversal 1.0 from /opt/local/var/macports/sources/rsync.macports.org/macports/release/tarballs/ports/_resources/port1.0/group/muniversal-1.0.tcl
607:debug:main compiler gcc-4.0 blacklisted because it's not installed or it doesn't work
608:debug:main universal variant already exists, so not adding the default one
609:debug:main Running callback portconfigure::add_automatic_compiler_dependencies
610:debug:main Finished running callback portconfigure::add_automatic_compiler_dependencies
611:debug:main Running callback portbuild::add_automatic_buildsystem_dependencies
612:debug:main Finished running callback portbuild::add_automatic_buildsystem_dependencies
613:debug:main No need to upgrade! poppler 0.57.0_0 >= poppler 0.57.0_0
614:debug:main epoch: in tree: 0 installed: 0
615:debug:main curl 7.57.0_2 exists in the ports tree
616:debug:main curl 7.57.0_2 +ssl is the latest installed
617:debug:main curl 7.57.0_2 +ssl is active
618:debug:main Merging existing variants '+ssl' into variants
619:debug:main new fully merged portvariants: ssl +
620:debug:main Changing to port directory: /opt/local/var/macports/sources/rsync.macports.org/macports/release/tarballs/ports/net/curl
621:debug:main OS darwin/17.3.0 (Mac OS X 10.13) arch i386
622:debug:main Reading variant descriptions from /opt/local/var/macports/sources/rsync.macports.org/macports/release/tarballs/ports/_resources/port1.0/variant_descriptions.conf
623:debug:main Sourcing PortGroup muniversal 1.0 from /opt/local/var/macports/sources/rsync.macports.org/macports/release/tarballs/ports/_resources/port1.0/group/muniversal-1.0.tcl
624:debug:main universal variant already exists, so not adding the default one
625:debug:main Executing variant ssl provides ssl
626:debug:main Running callback portconfigure::add_automatic_compiler_dependencies
627:debug:main Finished running callback portconfigure::add_automatic_compiler_dependencies
628:debug:main Running callback portbuild::add_automatic_buildsystem_dependencies
629:debug:main Finished running callback portbuild::add_automatic_buildsystem_dependencies
630:debug:main No need to upgrade! curl 7.57.0_2 >= curl 7.57.0_2
631:debug:main epoch: in tree: 0 installed: 0
632:debug:main libidn2 2.0.4_0 exists in the ports tree
633:debug:main libidn2 2.0.4_0  is the latest installed
634:debug:main libidn2 2.0.4_0  is active
635:debug:main Merging existing variants '' into variants
636:debug:main new fully merged portvariants:
637:debug:main Changing to port directory: /opt/local/var/macports/sources/rsync.macports.org/macports/release/tarballs/ports/mail/libidn2
638:debug:main OS darwin/17.3.0 (Mac OS X 10.13) arch i386
639:debug:main adding the default universal variant
640:debug:main Reading variant descriptions from /opt/local/var/macports/sources/rsync.macports.org/macports/release/tarballs/ports/_resources/port1.0/variant_descriptions.conf
641:debug:main Running callback portconfigure::add_automatic_compiler_dependencies
642:debug:main Finished running callback portconfigure::add_automatic_compiler_dependencies
643:debug:main Running callback portbuild::add_automatic_buildsystem_dependencies
644:debug:main Finished running callback portbuild::add_automatic_buildsystem_dependencies
645:debug:main No need to upgrade! libidn2 2.0.4_0 >= libidn2 2.0.4_0
646:debug:main epoch: in tree: 0 installed: 0
647:debug:main libunistring 0.9.8_0 exists in the ports tree
648:debug:main libunistring 0.9.8_0  is the latest installed
649:debug:main libunistring 0.9.8_0  is active
650:debug:main Merging existing variants '' into variants
651:debug:main new fully merged portvariants:
652:debug:main Changing to port directory: /opt/local/var/macports/sources/rsync.macports.org/macports/release/tarballs/ports/textproc/libunistring
653:debug:main OS darwin/17.3.0 (Mac OS X 10.13) arch i386
654:debug:main adding the default universal variant
655:debug:main Reading variant descriptions from /opt/local/var/macports/sources/rsync.macports.org/macports/release/tarballs/ports/_resources/port1.0/variant_descriptions.conf
656:debug:main Running callback portconfigure::add_automatic_compiler_dependencies
657:debug:main Finished running callback portconfigure::add_automatic_compiler_dependencies
658:debug:main Running callback portbuild::add_automatic_buildsystem_dependencies
659:debug:main Finished running callback portbuild::add_automatic_buildsystem_dependencies
660:debug:main No need to upgrade! libunistring 0.9.8_0 >= libunistring 0.9.8_0
661:debug:main epoch: in tree: 0 installed: 0
662:debug:main libpsl 0.19.1_2 exists in the ports tree
663:debug:main libpsl 0.19.1_2  is the latest installed
664:debug:main libpsl 0.19.1_2  is active
665:debug:main Merging existing variants '' into variants
666:debug:main new fully merged portvariants:
667:debug:main Changing to port directory: /opt/local/var/macports/sources/rsync.macports.org/macports/release/tarballs/ports/net/libpsl
668:debug:main OS darwin/17.3.0 (Mac OS X 10.13) arch i386
669:debug:main Sourcing PortGroup github 1.0 from /opt/local/var/macports/sources/rsync.macports.org/macports/release/tarballs/ports/_resources/port1.0/group/github-1.0.tcl
670:debug:main adding the default universal variant
671:debug:main Reading variant descriptions from /opt/local/var/macports/sources/rsync.macports.org/macports/release/tarballs/ports/_resources/port1.0/variant_descriptions.conf
672:debug:main Running callback portconfigure::add_automatic_compiler_dependencies
673:debug:main Finished running callback portconfigure::add_automatic_compiler_dependencies
674:debug:main Running callback portbuild::add_automatic_buildsystem_dependencies
675:debug:main Finished running callback portbuild::add_automatic_buildsystem_dependencies
676:debug:main No need to upgrade! libpsl 0.19.1_2 >= libpsl 0.19.1_2
677:debug:main epoch: in tree: 0 installed: 0
678:debug:main curl-ca-bundle 7.57.0_0 exists in the ports tree
679:debug:main curl-ca-bundle 7.57.0_0  is the latest installed
680:debug:main curl-ca-bundle 7.57.0_0  is active
681:debug:main Merging existing variants '' into variants
682:debug:main new fully merged portvariants:
683:debug:main Changing to port directory: /opt/local/var/macports/sources/rsync.macports.org/macports/release/tarballs/ports/net/curl
684:debug:main OS darwin/17.3.0 (Mac OS X 10.13) arch i386
685:debug:main universal_variant is false, so not adding the default universal variant
686:debug:main Running callback portconfigure::add_automatic_compiler_dependencies
687:debug:main Finished running callback portconfigure::add_automatic_compiler_dependencies
688:debug:main Running callback portbuild::add_automatic_buildsystem_dependencies
689:debug:main Finished running callback portbuild::add_automatic_buildsystem_dependencies
690:debug:main No need to upgrade! curl-ca-bundle 7.57.0_0 >= curl-ca-bundle 7.57.0_0
691:debug:main epoch: in tree: 0 installed: 0
692:debug:main lcms2 2.9_0 exists in the ports tree
693:debug:main lcms2 2.9_0  is the latest installed
694:debug:main lcms2 2.9_0  is active
695:debug:main Merging existing variants '' into variants
696:debug:main new fully merged portvariants:
697:debug:main Changing to port directory: /opt/local/var/macports/sources/rsync.macports.org/macports/release/tarballs/ports/graphics/lcms2
698:debug:main OS darwin/17.3.0 (Mac OS X 10.13) arch i386
699:debug:main Reading variant descriptions from /opt/local/var/macports/sources/rsync.macports.org/macports/release/tarballs/ports/_resources/port1.0/variant_descriptions.conf
700:debug:main Sourcing PortGroup muniversal 1.0 from /opt/local/var/macports/sources/rsync.macports.org/macports/release/tarballs/ports/_resources/port1.0/group/muniversal-1.0.tcl
701:debug:main universal variant already exists, so not adding the default one
702:debug:main Running callback portconfigure::add_automatic_compiler_dependencies
703:debug:main Finished running callback portconfigure::add_automatic_compiler_dependencies
704:debug:main Running callback portbuild::add_automatic_buildsystem_dependencies
705:debug:main Finished running callback portbuild::add_automatic_buildsystem_dependencies
706:debug:main No need to upgrade! lcms2 2.9_0 >= lcms2 2.9_0
707:debug:main epoch: in tree: 0 installed: 0
708:debug:main tiff 4.0.9_0 exists in the ports tree
709:debug:main tiff 4.0.9_0  is the latest installed
710:debug:main tiff 4.0.9_0  is active
711:debug:main Merging existing variants '' into variants
712:debug:main new fully merged portvariants:
713:debug:main Changing to port directory: /opt/local/var/macports/sources/rsync.macports.org/macports/release/tarballs/ports/graphics/tiff
714:debug:main OS darwin/17.3.0 (Mac OS X 10.13) arch i386
715:debug:main Sourcing PortGroup xcodeversion 1.0 from /opt/local/var/macports/sources/rsync.macports.org/macports/release/tarballs/ports/_resources/port1.0/group/xcodeversion-1.0.tcl
716:debug:main Reading variant descriptions from /opt/local/var/macports/sources/rsync.macports.org/macports/release/tarballs/ports/_resources/port1.0/variant_descriptions.conf
717:debug:main Sourcing PortGroup muniversal 1.0 from /opt/local/var/macports/sources/rsync.macports.org/macports/release/tarballs/ports/_resources/port1.0/group/muniversal-1.0.tcl
718:debug:main universal variant already exists, so not adding the default one
719:debug:main Running callback portconfigure::add_automatic_compiler_dependencies
720:debug:main Finished running callback portconfigure::add_automatic_compiler_dependencies
721:debug:main Running callback portbuild::add_automatic_buildsystem_dependencies
722:debug:main Finished running callback portbuild::add_automatic_buildsystem_dependencies
723:debug:main No need to upgrade! tiff 4.0.9_0 >= tiff 4.0.9_0
724:debug:main epoch: in tree: 0 installed: 0
725:debug:main openjpeg 2.3.0_0 exists in the ports tree
726:debug:main openjpeg 2.3.0_0  is the latest installed
727:debug:main openjpeg 2.3.0_0  is active
728:debug:main Merging existing variants '' into variants
729:debug:main new fully merged portvariants:
730:debug:main Changing to port directory: /opt/local/var/macports/sources/rsync.macports.org/macports/release/tarballs/ports/graphics/openjpeg
731:debug:main OS darwin/17.3.0 (Mac OS X 10.13) arch i386
732:debug:main Re-registering default for configure.dir
733:debug:main Re-registering default for configure.pre_args
734:debug:main Re-registering default for build.dir
735:debug:main Re-registering default for destroot.target
736:debug:main Sourcing PortGroup cmake 1.0 from /opt/local/var/macports/sources/rsync.macports.org/macports/release/tarballs/ports/_resources/port1.0/group/cmake-1.0.tcl
737:debug:main Sourcing PortGroup github 1.0 from /opt/local/var/macports/sources/rsync.macports.org/macports/release/tarballs/ports/_resources/port1.0/group/github-1.0.tcl
738:debug:main adding the default universal variant
739:debug:main Reading variant descriptions from /opt/local/var/macports/sources/rsync.macports.org/macports/release/tarballs/ports/_resources/port1.0/variant_descriptions.conf
740:debug:main Running callback portconfigure::add_automatic_compiler_dependencies
741:debug:main Finished running callback portconfigure::add_automatic_compiler_dependencies
742:debug:main Running callback portbuild::add_automatic_buildsystem_dependencies
743:debug:main Finished running callback portbuild::add_automatic_buildsystem_dependencies
744:debug:main No need to upgrade! openjpeg 2.3.0_0 >= openjpeg 2.3.0_0
745:debug:main epoch: in tree: 0 installed: 0
746:debug:main jbigkit 2.1_0 exists in the ports tree
747:debug:main jbigkit 2.1_0  is the latest installed
748:debug:main jbigkit 2.1_0  is active
749:debug:main Merging existing variants '' into variants
750:debug:main new fully merged portvariants:
751:debug:main Changing to port directory: /opt/local/var/macports/sources/rsync.macports.org/macports/release/tarballs/ports/graphics/jbigkit
752:debug:main OS darwin/17.3.0 (Mac OS X 10.13) arch i386
753:debug:main Reading variant descriptions from /opt/local/var/macports/sources/rsync.macports.org/macports/release/tarballs/ports/_resources/port1.0/variant_descriptions.conf
754:debug:main universal variant already exists, so not adding the default one
755:debug:main Running callback portconfigure::add_automatic_compiler_dependencies
756:debug:main Finished running callback portconfigure::add_automatic_compiler_dependencies
757:debug:main Running callback portbuild::add_automatic_buildsystem_dependencies
758:debug:main Finished running callback portbuild::add_automatic_buildsystem_dependencies
759:debug:main No need to upgrade! jbigkit 2.1_0 >= jbigkit 2.1_0
760:debug:main epoch: in tree: 0 installed: 0
761:debug:main poppler-data 0.4.8_0 exists in the ports tree
762:debug:main poppler-data 0.4.8_0  is the latest installed
763:debug:main poppler-data 0.4.8_0  is active
764:debug:main Merging existing variants '' into variants
765:debug:main new fully merged portvariants:
766:debug:main Changing to port directory: /opt/local/var/macports/sources/rsync.macports.org/macports/release/tarballs/ports/graphics/poppler-data
767:debug:main OS darwin/17.3.0 (Mac OS X 10.13) arch i386
768:debug:main universal_variant is false, so not adding the default universal variant
769:debug:main Running callback portconfigure::add_automatic_compiler_dependencies
770:debug:main Finished running callback portconfigure::add_automatic_compiler_dependencies
771:debug:main Running callback portbuild::add_automatic_buildsystem_dependencies
772:debug:main Finished running callback portbuild::add_automatic_buildsystem_dependencies
773:debug:main No need to upgrade! poppler-data 0.4.8_0 >= poppler-data 0.4.8_0
774:debug:main epoch: in tree: 0 installed: 0
775:debug:main gobject-introspection 1.54.1_0 exists in the ports tree
776:debug:main gobject-introspection 1.54.1_0  is the latest installed
777:debug:main gobject-introspection 1.54.1_0  is active
778:debug:main Merging existing variants '' into variants
779:debug:main new fully merged portvariants:
780:debug:main Changing to port directory: /opt/local/var/macports/sources/rsync.macports.org/macports/release/tarballs/ports/gnome/gobject-introspection
781:debug:main OS darwin/17.3.0 (Mac OS X 10.13) arch i386
782:debug:main Sourcing PortGroup active_variants 1.1 from /opt/local/var/macports/sources/rsync.macports.org/macports/release/tarballs/ports/_resources/port1.0/group/active_variants-1.1.tcl
783:debug:main python27 is installed with the following variants:
784:debug:main   required: ucs4, forbidden:
785:debug:main   rejected, because required variant ucs4 is missing
786:debug:main adding the default universal variant
787:debug:main Reading variant descriptions from /opt/local/var/macports/sources/rsync.macports.org/macports/release/tarballs/ports/_resources/port1.0/variant_descriptions.conf
788:debug:main Running callback portconfigure::add_automatic_compiler_dependencies
789:debug:main Finished running callback portconfigure::add_automatic_compiler_dependencies
790:debug:main Running callback portbuild::add_automatic_buildsystem_dependencies
791:debug:main Finished running callback portbuild::add_automatic_buildsystem_dependencies
792:debug:main No need to upgrade! gobject-introspection 1.54.1_0 >= gobject-introspection 1.54.1_0
793:debug:main epoch: in tree: 0 installed: 0
794:debug:main py27-mako 1.0.7_0 exists in the ports tree
795:debug:main py27-mako 1.0.7_0  is the latest installed
796:debug:main py27-mako 1.0.7_0  is active
797:debug:main Merging existing variants '' into variants
798:debug:main new fully merged portvariants:
799:debug:main Changing to port directory: /opt/local/var/macports/sources/rsync.macports.org/macports/release/tarballs/ports/python/py-mako
800:debug:main OS darwin/17.3.0 (Mac OS X 10.13) arch i386
801:debug:main Re-registering default for build.cmd
802:debug:main Re-registering default for destroot.cmd
803:debug:main Re-registering default for destroot.destdir
804:debug:main Sourcing PortGroup python 1.0 from /opt/local/var/macports/sources/rsync.macports.org/macports/release/tarballs/ports/_resources/port1.0/group/python-1.0.tcl
805:debug:main only one arch supported, so not adding the default universal variant
806:debug:main Running callback portconfigure::add_automatic_compiler_dependencies
807:debug:main Finished running callback portconfigure::add_automatic_compiler_dependencies
808:debug:main Running callback portbuild::add_automatic_buildsystem_dependencies
809:debug:main Finished running callback portbuild::add_automatic_buildsystem_dependencies
810:debug:main No need to upgrade! py27-mako 1.0.7_0 >= py27-mako 1.0.7_0
811:debug:main epoch: in tree: 0 installed: 0
812:debug:main py27-setuptools 36.8.0_0 exists in the ports tree
813:debug:main py27-setuptools 36.8.0_0  is the latest installed
814:debug:main py27-setuptools 36.8.0_0  is active
815:debug:main Merging existing variants '' into variants
816:debug:main new fully merged portvariants:
817:debug:main Changing to port directory: /opt/local/var/macports/sources/rsync.macports.org/macports/release/tarballs/ports/python/py-setuptools
818:debug:main OS darwin/17.3.0 (Mac OS X 10.13) arch i386
819:debug:main Re-registering default for build.cmd
820:debug:main Re-registering default for destroot.cmd
821:debug:main Re-registering default for destroot.destdir
822:debug:main Sourcing PortGroup python 1.0 from /opt/local/var/macports/sources/rsync.macports.org/macports/release/tarballs/ports/_resources/port1.0/group/python-1.0.tcl
823:debug:main only one arch supported, so not adding the default universal variant
824:debug:main Running callback portconfigure::add_automatic_compiler_dependencies
825:debug:main Finished running callback portconfigure::add_automatic_compiler_dependencies
826:debug:main Running callback portbuild::add_automatic_buildsystem_dependencies
827:debug:main Finished running callback portbuild::add_automatic_buildsystem_dependencies
828:debug:main No need to upgrade! py27-setuptools 36.8.0_0 >= py27-setuptools 36.8.0_0
829:debug:main epoch: in tree: 0 installed: 0
830:debug:main py27-beaker 1.8.1_0 exists in the ports tree
831:debug:main py27-beaker 1.8.1_0  is the latest installed
832:debug:main py27-beaker 1.8.1_0  is active
833:debug:main Merging existing variants '' into variants
834:debug:main new fully merged portvariants:
835:debug:main Changing to port directory: /opt/local/var/macports/sources/rsync.macports.org/macports/release/tarballs/ports/python/py-beaker
836:debug:main OS darwin/17.3.0 (Mac OS X 10.13) arch i386
837:debug:main Re-registering default for build.cmd
838:debug:main Re-registering default for destroot.cmd
839:debug:main Re-registering default for destroot.destdir
840:debug:main Sourcing PortGroup python 1.0 from /opt/local/var/macports/sources/rsync.macports.org/macports/release/tarballs/ports/_resources/port1.0/group/python-1.0.tcl
841:debug:main only one arch supported, so not adding the default universal variant
842:debug:main Running callback portconfigure::add_automatic_compiler_dependencies
843:debug:main Finished running callback portconfigure::add_automatic_compiler_dependencies
844:debug:main Running callback portbuild::add_automatic_buildsystem_dependencies
845:debug:main Finished running callback portbuild::add_automatic_buildsystem_dependencies
846:debug:main No need to upgrade! py27-beaker 1.8.1_0 >= py27-beaker 1.8.1_0
847:debug:main epoch: in tree: 0 installed: 0
848:debug:main py27-markupsafe 0.23_0 exists in the ports tree
849:debug:main py27-markupsafe 0.23_0  is the latest installed
850:debug:main py27-markupsafe 0.23_0  is active
851:debug:main Merging existing variants '' into variants
852:debug:main new fully merged portvariants:
853:debug:main Changing to port directory: /opt/local/var/macports/sources/rsync.macports.org/macports/release/tarballs/ports/python/py-markupsafe
854:debug:main OS darwin/17.3.0 (Mac OS X 10.13) arch i386
855:debug:main Re-registering default for build.cmd
856:debug:main Re-registering default for destroot.cmd
857:debug:main Re-registering default for destroot.destdir
858:debug:main Sourcing PortGroup python 1.0 from /opt/local/var/macports/sources/rsync.macports.org/macports/release/tarballs/ports/_resources/port1.0/group/python-1.0.tcl
859:debug:main adding the default universal variant
860:debug:main Reading variant descriptions from /opt/local/var/macports/sources/rsync.macports.org/macports/release/tarballs/ports/_resources/port1.0/variant_descriptions.conf
861:debug:main Running callback portconfigure::add_automatic_compiler_dependencies
862:debug:main Finished running callback portconfigure::add_automatic_compiler_dependencies
863:debug:main Running callback portbuild::add_automatic_buildsystem_dependencies
864:debug:main Finished running callback portbuild::add_automatic_buildsystem_dependencies
865:debug:main No need to upgrade! py27-markupsafe 0.23_0 >= py27-markupsafe 0.23_0
866:debug:main epoch: in tree: 0 installed: 0
867:debug:main libtool 2.4.6_4 exists in the ports tree
868:debug:main libtool 2.4.6_4  is the latest installed
869:debug:main libtool 2.4.6_4  is active
870:debug:main Merging existing variants '' into variants
871:debug:main new fully merged portvariants:
872:debug:main Changing to port directory: /opt/local/var/macports/sources/rsync.macports.org/macports/release/tarballs/ports/devel/libtool
873:debug:main OS darwin/17.3.0 (Mac OS X 10.13) arch i386
874:debug:main adding the default universal variant
875:debug:main Reading variant descriptions from /opt/local/var/macports/sources/rsync.macports.org/macports/release/tarballs/ports/_resources/port1.0/variant_descriptions.conf
876:debug:main Running callback portconfigure::add_automatic_compiler_dependencies
877:debug:main Finished running callback portconfigure::add_automatic_compiler_dependencies
878:debug:main Running callback portbuild::add_automatic_buildsystem_dependencies
879:debug:main Finished running callback portbuild::add_automatic_buildsystem_dependencies
880:debug:main No need to upgrade! libtool 2.4.6_4 >= libtool 2.4.6_4
881:msg:main --->  Computing dependencies for gle-graphics:info:main .:debug:main gle-graphics has no conflicts
882:debug:main Searching for dependency: pkgconfig
883:debug:main Found Dependency: receipt exists for pkgconfig
884:debug:main Searching for dependency: cairo
885:debug:main Found Dependency: receipt exists for cairo
886:debug:main Searching for dependency: jpeg
887:debug:main Found Dependency: receipt exists for jpeg
888:debug:main Searching for dependency: libpng
889:debug:main Found Dependency: receipt exists for libpng
890:debug:main Searching for dependency: poppler
891:debug:main Found Dependency: receipt exists for poppler
892:debug:main Searching for dependency: tiff
893:debug:main Found Dependency: receipt exists for tiff
894:debug:main Searching for dependency: zlib
895:debug:main Found Dependency: receipt exists for zlib
896:debug:main Searching for dependency: ncurses
897:debug:main Found Dependency: receipt exists for ncurses
898:debug:main Executing org.macports.main (gle-graphics)
899:debug:main dropping privileges: euid changed to 502, egid changed to 501.
900:debug:archivefetch archivefetch phase started at Mon Jan 15 10:46:09 GMT 2018
901:msg:archivefetch --->  Fetching archive for gle-graphics
902:debug:archivefetch Executing org.macports.archivefetch (gle-graphics)
903:debug:archivefetch euid/egid changed to: 0/0
904:debug:archivefetch chowned /opt/local/var/macports/incoming to macports
905:debug:archivefetch euid/egid changed to: 502/501
906:info:archivefetch --->  gle-graphics-4.2.5_0.darwin_17.x86_64.tbz2 doesn't seem to exist in /opt/local/var/macports/incoming/verified
907:msg:archivefetch --->  Attempting to fetch gle-graphics-4.2.5_0.darwin_17.x86_64.tbz2 from https://packages.macports.org/gle-graphics
908:debug:archivefetch Fetching archive failed: The requested URL returned error: 404 Not Found
909:msg:archivefetch --->  Attempting to fetch gle-graphics-4.2.5_0.darwin_17.x86_64.tbz2 from http://mse.uk.packages.macports.org/sites/packages.macports.org/gle-graphics
910:debug:archivefetch Fetching archive failed: The requested URL returned error: 404 Not Found
911:msg:archivefetch --->  Attempting to fetch gle-graphics-4.2.5_0.darwin_17.x86_64.tbz2 from http://lil.fr.packages.macports.org/gle-graphics
912:debug:archivefetch Fetching archive failed: The requested URL returned error: 404 Not Found
913:debug:archivefetch Privilege de-escalation not attempted as not running as root.
914:debug:fetch fetch phase started at Mon Jan 15 10:46:09 GMT 2018
915:notice:fetch --->  Fetching distfiles for gle-graphics
916:debug:fetch elevating privileges for fetch: euid changed to 0, egid changed to 0.
917:debug:fetch dropping privileges: euid changed to 502, egid changed to 501.
918:debug:fetch Executing org.macports.fetch (gle-graphics)
919:info:fetch --->  gle-graphics-4.2.5f-src.tar.gz does not exist in /opt/local/var/macports/distfiles/gle-graphics
920:notice:fetch --->  Attempting to fetch gle-graphics-4.2.5f-src.tar.gz from https://distfiles.macports.org/gle-graphics
921:debug:fetch Privilege de-escalation not attempted as not running as root.
922:debug:checksum checksum phase started at Mon Jan 15 10:46:09 GMT 2018
923:notice:checksum --->  Verifying checksums for gle-graphics
924:debug:checksum Executing org.macports.checksum (gle-graphics)
925:info:checksum --->  Checksumming gle-graphics-4.2.5f-src.tar.gz
926:debug:checksum Calculated (rmd160) is 4101bd5ae35e64122a93b04ececefeb8bbae4041
927:debug:checksum Correct (rmd160) checksum for gle-graphics-4.2.5f-src.tar.gz
928:debug:checksum Calculated (sha256) is 6cd6b1d82cbf2c7a0b0affbd67c0ec32460ef6a13f6b41dfdd6f308fd651f102
929:debug:checksum Correct (sha256) checksum for gle-graphics-4.2.5f-src.tar.gz
930:debug:checksum Privilege de-escalation not attempted as not running as root.
931:debug:extract extract phase started at Mon Jan 15 10:46:09 GMT 2018
932:notice:extract --->  Extracting gle-graphics
933:debug:extract Executing org.macports.extract (gle-graphics)
934:info:extract --->  Extracting gle-graphics-4.2.5f-src.tar.gz
935:debug:extract setting option extract.args to '/opt/local/var/macports/distfiles/gle-graphics/gle-graphics-4.2.5f-src.tar.gz'
936:debug:extract Environment:
937:debug:extract CC_PRINT_OPTIONS='YES'
938:debug:extract CC_PRINT_OPTIONS_FILE='/opt/local/var/macports/build/_opt_local_var_macports_sources_rsync.macports.org_macports_release_tarballs_ports_graphics_gle-graphics/gle-graphics/work/.CC_PRINT_OPTIONS'
939:debug:extract CPATH='/opt/local/include'
940:debug:extract LIBRARY_PATH='/opt/local/lib'
941:debug:extract MACOSX_DEPLOYMENT_TARGET='10.13'
942:info:extract Executing:  cd "/opt/local/var/macports/build/_opt_local_var_macports_sources_rsync.macports.org_macports_release_tarballs_ports_graphics_gle-graphics/gle-graphics/work" && /usr/bin/gzip -dc '/opt/local/var/macports/distfiles/gle-graphics/gle-graphics-4.2.5f-src.tar.gz' | /usr/bin/tar -xf -
943:debug:extract system:  cd "/opt/local/var/macports/build/_opt_local_var_macports_sources_rsync.macports.org_macports_release_tarballs_ports_graphics_gle-graphics/gle-graphics/work" && /usr/bin/gzip -dc '/opt/local/var/macports/distfiles/gle-graphics/gle-graphics-4.2.5f-src.tar.gz' | /usr/bin/tar -xf -
944:debug:extract euid/egid changed to: 0/0
945:debug:extract chowned /opt/local/var/macports/build/_opt_local_var_macports_sources_rsync.macports.org_macports_release_tarballs_ports_graphics_gle-graphics/gle-graphics/work to macports
946:debug:extract euid/egid changed to: 502/501
947:debug:extract Privilege de-escalation not attempted as not running as root.
948:debug:patch patch phase started at Mon Jan 15 10:46:10 GMT 2018
949:debug:patch Executing org.macports.patch (gle-graphics)
950:notice:patch --->  Applying patches to gle-graphics
951:info:patch --->  Applying patch-install_name.diff
952:debug:patch Environment:
953:debug:patch CC_PRINT_OPTIONS='YES'
954:debug:patch CC_PRINT_OPTIONS_FILE='/opt/local/var/macports/build/_opt_local_var_macports_sources_rsync.macports.org_macports_release_tarballs_ports_graphics_gle-graphics/gle-graphics/work/.CC_PRINT_OPTIONS'
955:debug:patch CPATH='/opt/local/include'
956:debug:patch LIBRARY_PATH='/opt/local/lib'
957:debug:patch MACOSX_DEPLOYMENT_TARGET='10.13'
958:info:patch Executing:  cd "/opt/local/var/macports/build/_opt_local_var_macports_sources_rsync.macports.org_macports_release_tarballs_ports_graphics_gle-graphics/gle-graphics/work/gle-graphics-4.2.5" && /usr/bin/patch -p0 < '/opt/local/var/macports/sources/rsync.macports.org/macports/release/tarballs/ports/graphics/gle-graphics/files/patch-install_name.diff'
959:debug:patch system:  cd "/opt/local/var/macports/build/_opt_local_var_macports_sources_rsync.macports.org_macports_release_tarballs_ports_graphics_gle-graphics/gle-graphics/work/gle-graphics-4.2.5" && /usr/bin/patch -p0 < '/opt/local/var/macports/sources/rsync.macports.org/macports/release/tarballs/ports/graphics/gle-graphics/files/patch-install_name.diff'
960:info:patch patching file src/gle/Makefile.in
961:info:patch --->  Applying patch-qgle-carbon.diff
962:debug:patch Environment:
963:debug:patch CC_PRINT_OPTIONS='YES'
964:debug:patch CC_PRINT_OPTIONS_FILE='/opt/local/var/macports/build/_opt_local_var_macports_sources_rsync.macports.org_macports_release_tarballs_ports_graphics_gle-graphics/gle-graphics/work/.CC_PRINT_OPTIONS'
965:debug:patch CPATH='/opt/local/include'
966:debug:patch LIBRARY_PATH='/opt/local/lib'
967:debug:patch MACOSX_DEPLOYMENT_TARGET='10.13'
968:info:patch Executing:  cd "/opt/local/var/macports/build/_opt_local_var_macports_sources_rsync.macports.org_macports_release_tarballs_ports_graphics_gle-graphics/gle-graphics/work/gle-graphics-4.2.5" && /usr/bin/patch -p0 < '/opt/local/var/macports/sources/rsync.macports.org/macports/release/tarballs/ports/graphics/gle-graphics/files/patch-qgle-carbon.diff'
969:debug:patch system:  cd "/opt/local/var/macports/build/_opt_local_var_macports_sources_rsync.macports.org_macports_release_tarballs_ports_graphics_gle-graphics/gle-graphics/work/gle-graphics-4.2.5" && /usr/bin/patch -p0 < '/opt/local/var/macports/sources/rsync.macports.org/macports/release/tarballs/ports/graphics/gle-graphics/files/patch-qgle-carbon.diff'
970:info:patch patching file src/gui/qgle.pro.in
971:info:patch --->  Applying patch-qgle-libgs.diff
972:debug:patch Environment:
973:debug:patch CC_PRINT_OPTIONS='YES'
974:debug:patch CC_PRINT_OPTIONS_FILE='/opt/local/var/macports/build/_opt_local_var_macports_sources_rsync.macports.org_macports_release_tarballs_ports_graphics_gle-graphics/gle-graphics/work/.CC_PRINT_OPTIONS'
975:debug:patch CPATH='/opt/local/include'
976:debug:patch LIBRARY_PATH='/opt/local/lib'
977:debug:patch MACOSX_DEPLOYMENT_TARGET='10.13'
978:info:patch Executing:  cd "/opt/local/var/macports/build/_opt_local_var_macports_sources_rsync.macports.org_macports_release_tarballs_ports_graphics_gle-graphics/gle-graphics/work/gle-graphics-4.2.5" && /usr/bin/patch -p0 < '/opt/local/var/macports/sources/rsync.macports.org/macports/release/tarballs/ports/graphics/gle-graphics/files/patch-qgle-libgs.diff'
979:debug:patch system:  cd "/opt/local/var/macports/build/_opt_local_var_macports_sources_rsync.macports.org_macports_release_tarballs_ports_graphics_gle-graphics/gle-graphics/work/gle-graphics-4.2.5" && /usr/bin/patch -p0 < '/opt/local/var/macports/sources/rsync.macports.org/macports/release/tarballs/ports/graphics/gle-graphics/files/patch-qgle-libgs.diff'
980:info:patch patching file src/gui/qgslibloader.cpp
981:info:patch --->  Applying patch-qgle-glu.diff
982:debug:patch Environment:
983:debug:patch CC_PRINT_OPTIONS='YES'
984:debug:patch CC_PRINT_OPTIONS_FILE='/opt/local/var/macports/build/_opt_local_var_macports_sources_rsync.macports.org_macports_release_tarballs_ports_graphics_gle-graphics/gle-graphics/work/.CC_PRINT_OPTIONS'
985:debug:patch CPATH='/opt/local/include'
986:debug:patch LIBRARY_PATH='/opt/local/lib'
987:debug:patch MACOSX_DEPLOYMENT_TARGET='10.13'
988:info:patch Executing:  cd "/opt/local/var/macports/build/_opt_local_var_macports_sources_rsync.macports.org_macports_release_tarballs_ports_graphics_gle-graphics/gle-graphics/work/gle-graphics-4.2.5" && /usr/bin/patch -p0 < '/opt/local/var/macports/sources/rsync.macports.org/macports/release/tarballs/ports/graphics/gle-graphics/files/patch-qgle-glu.diff'
989:debug:patch system:  cd "/opt/local/var/macports/build/_opt_local_var_macports_sources_rsync.macports.org_macports_release_tarballs_ports_graphics_gle-graphics/gle-graphics/work/gle-graphics-4.2.5" && /usr/bin/patch -p0 < '/opt/local/var/macports/sources/rsync.macports.org/macports/release/tarballs/ports/graphics/gle-graphics/files/patch-qgle-glu.diff'
990:info:patch patching file src/gui/3dviewer.cpp
991:info:patch patching file src/gui/qgle.pro.in
992:info:patch --->  Applying patch-hash-map.diff
993:debug:patch Environment:
994:debug:patch CC_PRINT_OPTIONS='YES'
995:debug:patch CC_PRINT_OPTIONS_FILE='/opt/local/var/macports/build/_opt_local_var_macports_sources_rsync.macports.org_macports_release_tarballs_ports_graphics_gle-graphics/gle-graphics/work/.CC_PRINT_OPTIONS'
996:debug:patch CPATH='/opt/local/include'
997:debug:patch LIBRARY_PATH='/opt/local/lib'
998:debug:patch MACOSX_DEPLOYMENT_TARGET='10.13'
999:info:patch Executing:  cd "/opt/local/var/macports/build/_opt_local_var_macports_sources_rsync.macports.org_macports_release_tarballs_ports_graphics_gle-graphics/gle-graphics/work/gle-graphics-4.2.5" && /usr/bin/patch -p0 < '/opt/local/var/macports/sources/rsync.macports.org/macports/release/tarballs/ports/graphics/gle-graphics/files/patch-hash-map.diff'
1000:debug:patch system:  cd "/opt/local/var/macports/build/_opt_local_var_macports_sources_rsync.macports.org_macports_release_tarballs_ports_graphics_gle-graphics/gle-graphics/work/gle-graphics-4.2.5" && /usr/bin/patch -p0 < '/opt/local/var/macports/sources/rsync.macports.org/macports/release/tarballs/ports/graphics/gle-graphics/files/patch-hash-map.diff'
1001:info:patch patching file src/gle/tokens/StringKeyHash.h
1002:info:patch --->  Applying patch-src-gle-gle-poppler.cpp.diff
1003:debug:patch Environment:
1004:debug:patch CC_PRINT_OPTIONS='YES'
1005:debug:patch CC_PRINT_OPTIONS_FILE='/opt/local/var/macports/build/_opt_local_var_macports_sources_rsync.macports.org_macports_release_tarballs_ports_graphics_gle-graphics/gle-graphics/work/.CC_PRINT_OPTIONS'
1006:debug:patch CPATH='/opt/local/include'
1007:debug:patch LIBRARY_PATH='/opt/local/lib'
1008:debug:patch MACOSX_DEPLOYMENT_TARGET='10.13'
1009:info:patch Executing:  cd "/opt/local/var/macports/build/_opt_local_var_macports_sources_rsync.macports.org_macports_release_tarballs_ports_graphics_gle-graphics/gle-graphics/work/gle-graphics-4.2.5" && /usr/bin/patch -p0 < '/opt/local/var/macports/sources/rsync.macports.org/macports/release/tarballs/ports/graphics/gle-graphics/files/patch-src-gle-gle-poppler.cpp.diff'
1010:debug:patch system:  cd "/opt/local/var/macports/build/_opt_local_var_macports_sources_rsync.macports.org_macports_release_tarballs_ports_graphics_gle-graphics/gle-graphics/work/gle-graphics-4.2.5" && /usr/bin/patch -p0 < '/opt/local/var/macports/sources/rsync.macports.org/macports/release/tarballs/ports/graphics/gle-graphics/files/patch-src-gle-gle-poppler.cpp.diff'
1011:info:patch patching file src/gle/gle-poppler.cpp
1012:debug:patch Executing proc-post-org.macports.patch-patch-0
1013:info:patch --->  Patching qgslibloader.cpp: s|@@PREFIX@@|/opt/local|g
1014:debug:patch Executing reinplace: /usr/bin/sed s|@@PREFIX@@|/opt/local|g </opt/local/var/macports/build/_opt_local_var_macports_sources_rsync.macports.org_macports_release_tarballs_ports_graphics_gle-graphics/gle-graphics/work/gle-graphics-4.2.5/src/gui/qgslibloader.cpp >@file11
1015:debug:patch euid/egid changed to: 0/0
1016:debug:patch chowned /opt/local/var/macports/build/_opt_local_var_macports_sources_rsync.macports.org_macports_release_tarballs_ports_graphics_gle-graphics/gle-graphics/work/gle-graphics-4.2.5/src/gui/qgslibloader.cpp to macports
1017:debug:patch euid/egid changed to: 502/501
1018:debug:patch euid/egid changed to: 0/0
1019:debug:patch setting attributes on /opt/local/var/macports/build/_opt_local_var_macports_sources_rsync.macports.org_macports_release_tarballs_ports_graphics_gle-graphics/gle-graphics/work/gle-graphics-4.2.5/src/gui/qgslibloader.cpp
1020:debug:patch euid/egid changed to: 502/501
1021:debug:patch Privilege de-escalation not attempted as not running as root.
1022:debug:configure configure phase started at Mon Jan 15 10:46:10 GMT 2018
1023:notice:configure --->  Configuring gle-graphics
1024:debug:configure Preferred compilers: clang macports-clang-4.0
1025:debug:configure Using compiler 'Xcode Clang'
1026:debug:configure Executing org.macports.configure (gle-graphics)
1027:debug:configure Environment:
1028:debug:configure CC='/usr/bin/clang'
1029:debug:configure CC_PRINT_OPTIONS='YES'
1030:debug:configure CC_PRINT_OPTIONS_FILE='/opt/local/var/macports/build/_opt_local_var_macports_sources_rsync.macports.org_macports_release_tarballs_ports_graphics_gle-graphics/gle-graphics/work/.CC_PRINT_OPTIONS'
1031:debug:configure CFLAGS='-pipe -Os -arch x86_64'
1032:debug:configure CPATH='/opt/local/include'
1033:debug:configure CPPFLAGS='-I/opt/local/include'
1034:debug:configure CXX='/usr/bin/clang++'
1035:debug:configure CXXFLAGS='-pipe -Os -stdlib=libc++ -arch x86_64'
1036:debug:configure F77FLAGS='-m64'
1037:debug:configure F90FLAGS='-pipe -Os -m64'
1038:debug:configure FCFLAGS='-pipe -Os -m64'
1039:debug:configure FFLAGS='-pipe -Os'
1040:debug:configure INSTALL='/usr/bin/install -c'
1041:debug:configure LDFLAGS='-L/opt/local/lib -Wl,-headerpad_max_install_names -arch x86_64'
1042:debug:configure LIBRARY_PATH='/opt/local/lib'
1043:debug:configure MACOSX_DEPLOYMENT_TARGET='10.13'
1044:debug:configure OBJC='/usr/bin/clang'
1045:debug:configure OBJCFLAGS='-pipe -Os -arch x86_64'
1046:debug:configure OBJCXX='/usr/bin/clang++'
1047:debug:configure OBJCXXFLAGS='-pipe -Os -stdlib=libc++ -arch x86_64'
1048:info:configure Executing:  cd "/opt/local/var/macports/build/_opt_local_var_macports_sources_rsync.macports.org_macports_release_tarballs_ports_graphics_gle-graphics/gle-graphics/work/gle-graphics-4.2.5" && ./configure --prefix=/opt/local --with-jpeg=/opt/local --with-png=/opt/local --with-poppler --with-tiff=/opt/local --with-z=/opt/local --with-qt=no --with-libgle=yes --with-manip=yes --with-debug=no --with-extrafonts=yes --with-arch=no --with-staticlink=no
1049:debug:configure system:  cd "/opt/local/var/macports/build/_opt_local_var_macports_sources_rsync.macports.org_macports_release_tarballs_ports_graphics_gle-graphics/gle-graphics/work/gle-graphics-4.2.5" && ./configure --prefix=/opt/local --with-jpeg=/opt/local --with-png=/opt/local --with-poppler --with-tiff=/opt/local --with-z=/opt/local --with-qt=no --with-libgle=yes --with-manip=yes --with-debug=no --with-extrafonts=yes --with-arch=no --with-staticlink=no
1050:info:configure checking whether the C++ compiler works... yes
1051:info:configure checking for C++ compiler default output file name... a.out
1052:info:configure checking for suffix of executables...
1053:info:configure checking whether we are cross compiling... no
1054:info:configure checking for suffix of object files... o
1055:info:configure checking whether we are using the GNU C++ compiler... yes
1056:info:configure checking whether /usr/bin/clang++ accepts -g... yes
1057:info:configure checking for a BSD-compatible install... /usr/bin/install -c
1058:info:configure checking for a thread-safe mkdir -p... /opt/local/bin/gmkdir -p
1059:info:configure checking build system type... x86_64-apple-darwin17.3.0
1060:info:configure checking host system type... x86_64-apple-darwin17.3.0
1061:info:configure checking how to run the C++ preprocessor... /usr/bin/clang++ -E
1062:info:configure checking for grep that handles long lines and -e... /opt/local/bin/grep
1063:info:configure checking for egrep... /opt/local/bin/grep -E
1064:info:configure checking for ANSI C header files... yes
1065:info:configure checking for sys/types.h... yes
1066:info:configure checking for sys/stat.h... yes
1067:info:configure checking for stdlib.h... yes
1068:info:configure checking for string.h... yes
1069:info:configure checking for memory.h... yes
1070:info:configure checking for strings.h... yes
1071:info:configure checking for inttypes.h... yes
1072:info:configure checking for stdint.h... yes
1073:info:configure checking for unistd.h... yes
1074:info:configure checking sys/param.h usability... yes
1075:info:configure checking sys/param.h presence... yes
1076:info:configure checking for sys/param.h... yes
1077:info:configure checking whether byte ordering is bigendian... no
1078:info:configure checking for uint16_t... yes
1079:info:configure checking for pkg-config... /opt/local/bin/pkg-config
1080:info:configure checking pkg-config is at least version 0.9.0... yes
1081:info:configure checking for X... libraries /opt/local/lib, headers /opt/local/include
1082:info:configure checking for XOpenDisplay in -lX11... yes
1083:info:configure checking for deflate in -lz... yes
1084:info:configure checking for library containing socket... none required
1085:info:configure checking for library containing gethostbyname... none required
1086:info:configure checking for jpeg_destroy_decompress in -ljpeg... yes
1087:info:configure checking jpeglib.h usability... yes
1088:info:configure checking jpeglib.h presence... yes
1089:info:configure checking for jpeglib.h... yes
1090:info:configure checking for TIFFReadScanline in -ltiff... yes
1091:info:configure checking tiffio.h usability... yes
1092:info:configure checking tiffio.h presence... yes
1093:info:configure checking for tiffio.h... yes
1094:info:configure checking for cairo... yes
1095:info:configure    cairo CFLAGS: -I/opt/local/include/cairo -I/opt/local/include/glib-2.0 -I/opt/local/lib/glib-2.0/include -I/opt/local/include/pixman-1 -I/opt/local/include/freetype2 -I/opt/local/include/libpng16
1096:info:configure    cairo LIBS: -L/opt/local/lib -lcairo
1097:info:configure checking for POPPLER... yes
1098:info:configure    poppler CFLAGS: -D_REENTRANT -I/opt/local/include/poppler/glib -I/opt/local/include/poppler -I/opt/local/include/cairo -I/opt/local/include/glib-2.0 -I/opt/local/lib/glib-2.0/include -I/opt/local/include/pixman-1 -I/opt/local/include/freetype2 -I/opt/local/include/libpng16
1099:info:configure    poppler LIBS: -L/opt/local/lib -lpoppler-glib -lgio-2.0 -lgobject-2.0 -lglib-2.0 -lintl -Wl,-framework -Wl,CoreFoundation -lcairo
1100:info:configure checking for library containing dlopen... none required
1101:info:configure checking for tgetent in -ltinfo... no
1102:info:configure checking for library containing wbkgdset... -lncurses
1103:info:configure checking ncurses.h usability... yes
1104:info:configure checking ncurses.h presence... yes
1105:info:configure checking for ncurses.h... yes
1106:info:configure checking for strip,gstrip... no
1107:info:configure Checking if strip is GNU strip
1108:info:configure error: strip: unrecognized option: -V
1109:info:configure Usage: strip [-AnuSXx] [-] [-d filename] [-s filename] [-R filename] [-o output] file [...]
1110:info:configure strip is not GNU Strip (strip)
1111:info:configure configure: creating ./config.status
1112:info:configure config.status: creating Makefile
1113:info:configure config.status: creating src/gle/Makefile
1114:info:configure config.status: creating src/gle/bitmap/Makefile
1115:info:configure config.status: creating src/gle/letzfitz/Makefile
1116:info:configure config.status: creating src/gle/surface/Makefile
1117:info:configure config.status: creating src/gle/tokens/Makefile
1118:info:configure config.status: creating src/fbuild/Makefile
1119:info:configure config.status: creating src/makefmt/Makefile
1120:info:configure config.status: creating src/manip/Makefile
1121:info:configure config.status: creating src/TeX/Makefile
1122:info:configure config.status: creating src/gui/MakefileAC
1123:info:configure config.status: creating src/gui/qgle.pro
1124:info:configure config.status: creating src/doc/gle.1
1125:info:configure config.status: creating platform/autoconf/gle-graphics.pc
1126:info:configure config.status: creating platform/autopackage/gle4.apspec
1127:info:configure config.status: creating src/config.h
1128:info:configure CPPFLAGS: -DHAVE_CONFIG_H $(VERSION_INFO) -Wno-write-strings -D_REENTRANT -I/opt/local/include/poppler/glib -I/opt/local/include/poppler -I/opt/local/include/cairo -I/opt/local/include/glib-2.0 -I/opt/local/lib/glib-2.0/include -I/opt/local/include/pixman-1 -I/opt/local/include/freetype2 -I/opt/local/include/libpng16 -I/opt/local/include/cairo -I/opt/local/include/glib-2.0 -I/opt/local/lib/glib-2.0/include -I/opt/local/include/pixman-1 -I/opt/local/include/freetype2 -I/opt/local/include/libpng16 -I/opt/local/include -I/opt/local/include -I/opt/local/include -I/opt/local/include -I/opt/local/include
1129:info:configure LDFLAGS:   -L/opt/local/lib -Wl,-headerpad_max_install_names -arch x86_64 -L/opt/local/lib -L/opt/local/lib -L/opt/local/lib -L/opt/local/lib
1130:info:configure LIBS: -L/opt/local/lib -lpoppler-glib -lgio-2.0 -lgobject-2.0 -lglib-2.0 -lintl -Wl,-framework -Wl,CoreFoundation -lcairo -L/opt/local/lib -lcairo -lpng -ltiff -ljpeg -lz -lX11 
1131:info:configure SIMPLE_LIBS:
1132:info:configure SIMPLE_LIBS_DL:
1133:info:configure SIMPLE_LDFLAGS: -L/opt/local/lib -Wl,-headerpad_max_install_names -arch x86_64
1134:info:configure ** Configuration summary for GLE 4.2.5 (x86_64-apple-darwin17.3.0):
1135:info:configure    ** Bitmap support:
1136:info:configure       PNG support: yes
1137:info:configure       TIFF support: yes
1138:info:configure       JPEG support: yes
1139:info:configure       Statically link: no
1140:info:configure    ** X11 preview support: yes
1141:info:configure    ** Cairo graphics support: yes
1142:info:configure    ** Poppler PDF support: yes
1143:info:configure    ** Socket support: yes
1144:info:configure    ** Include 'manip' utility: yes
1145:info:configure    ** Debug mode: off
1146:info:configure    ** GLE GUI support: no
1147:info:configure       (make sure you have Qt >= 4.1.1 devel and use ./configure --with-qt=/path/to/qt.)
1148:info:configure ** Install data into: /opt/local/share/gle-graphics/4.2.5
1149:info:configure ** Install binary into: /opt/local/bin
1150:info:configure    (use ./configure --prefix=dir to change the installation directory.)
1151:info:configure GLE 4.2.5 has been configured. The next step is to run "make". After "make" completes, run "make install" to install GLE.
1152:debug:configure Privilege de-escalation not attempted as not running as root.
1153:debug:build build phase started at Mon Jan 15 10:46:15 GMT 2018
1154:notice:build --->  Building gle-graphics
1155:debug:build Executing org.macports.build (gle-graphics)
1156:debug:build Environment:
1157:debug:build CC_PRINT_OPTIONS='YES'
1158:debug:build CC_PRINT_OPTIONS_FILE='/opt/local/var/macports/build/_opt_local_var_macports_sources_rsync.macports.org_macports_release_tarballs_ports_graphics_gle-graphics/gle-graphics/work/.CC_PRINT_OPTIONS'
1159:debug:build CPATH='/opt/local/include'
1160:debug:build LIBRARY_PATH='/opt/local/lib'
1161:debug:build MACOSX_DEPLOYMENT_TARGET='10.13'
1162:info:build Executing:  cd "/opt/local/var/macports/build/_opt_local_var_macports_sources_rsync.macports.org_macports_release_tarballs_ports_graphics_gle-graphics/gle-graphics/work/gle-graphics-4.2.5" && /usr/bin/make -j4 -w all
1163:debug:build system:  cd "/opt/local/var/macports/build/_opt_local_var_macports_sources_rsync.macports.org_macports_release_tarballs_ports_graphics_gle-graphics/gle-graphics/work/gle-graphics-4.2.5" && /usr/bin/make -j4 -w all
1164:info:build make: Entering directory `/opt/local/var/macports/build/_opt_local_var_macports_sources_rsync.macports.org_macports_release_tarballs_ports_graphics_gle-graphics/gle-graphics/work/gle-graphics-4.2.5'
1165:info:build /opt/local/bin/gmkdir -p build
1166:info:build /opt/local/bin/gmkdir -p build/bin
1167:info:build /opt/local/bin/gmkdir -p build/lib
1168:info:build /opt/local/bin/gmkdir -p build/doc
1169:info:build /opt/local/bin/gmkdir -p build/gleinc
1170:info:build /Applications/Xcode.app/Contents/Developer/usr/bin/make -C src/gle make_glebtool
1171:info:build make[1]: Entering directory `/opt/local/var/macports/build/_opt_local_var_macports_sources_rsync.macports.org_macports_release_tarballs_ports_graphics_gle-graphics/gle-graphics/work/gle-graphics-4.2.5/src/gle'
1172:info:build /usr/bin/clang++ -DHAVE_CONFIG_H -DGLEVN="\"4.2.5\"" -Wno-write-strings -D_REENTRANT -I/opt/local/include/poppler/glib -I/opt/local/include/poppler -I/opt/local/include/cairo -I/opt/local/include/glib-2.0 -I/opt/local/lib/glib-2.0/include -I/opt/local/include/pixman-1 -I/opt/local/include/freetype2 -I/opt/local/include/libpng16 -I/opt/local/include/cairo -I/opt/local/include/glib-2.0 -I/opt/local/lib/glib-2.0/include -I/opt/local/include/pixman-1 -I/opt/local/include/freetype2 -I/opt/local/include/libpng16 -I/opt/local/include -I/opt/local/include -I/opt/local/include -I/opt/local/include -I/opt/local/include -c cutils.cpp -o cutils.o
1173:info:build /usr/bin/clang++ -DHAVE_CONFIG_H -DGLEVN="\"4.2.5\"" -Wno-write-strings -D_REENTRANT -I/opt/local/include/poppler/glib -I/opt/local/include/poppler -I/opt/local/include/cairo -I/opt/local/include/glib-2.0 -I/opt/local/lib/glib-2.0/include -I/opt/local/include/pixman-1 -I/opt/local/include/freetype2 -I/opt/local/include/libpng16 -I/opt/local/include/cairo -I/opt/local/include/glib-2.0 -I/opt/local/lib/glib-2.0/include -I/opt/local/include/pixman-1 -I/opt/local/include/freetype2 -I/opt/local/include/libpng16 -I/opt/local/include -I/opt/local/include -I/opt/local/include -I/opt/local/include -I/opt/local/include -c file_io.cpp -o file_io.o
1174:info:build echo "begin config gle" > ../../build/glerc
1175:info:build echo "   current = 4.2.5" >> ../../build/glerc
1176:info:build echo "end config" >> ../../build/glerc
1177:info:build /usr/bin/clang++ -DHAVE_CONFIG_H -DGLEVN="\"4.2.5\"" -Wno-write-strings -D_REENTRANT -I/opt/local/include/poppler/glib -I/opt/local/include/poppler -I/opt/local/include/cairo -I/opt/local/include/glib-2.0 -I/opt/local/lib/glib-2.0/include -I/opt/local/include/pixman-1 -I/opt/local/include/freetype2 -I/opt/local/include/libpng16 -I/opt/local/include/cairo -I/opt/local/include/glib-2.0 -I/opt/local/lib/glib-2.0/include -I/opt/local/include/pixman-1 -I/opt/local/include/freetype2 -I/opt/local/include/libpng16 -I/opt/local/include -I/opt/local/include -I/opt/local/include -I/opt/local/include -I/opt/local/include -L/opt/local/lib -Wl,-headerpad_max_install_names -arch x86_64 glebtool.cpp cutils.o file_io.o   -o ../../build/bin/glebtool
1178:info:build ../../build/bin/glebtool -setrelpath /opt/local/bin /opt/local/lib /opt/local/share/gle-graphics/4.2.5 /opt/local/share/doc/gle-graphics ../config.h
1179:info:build GLE will be installed as follows:
1180:info:build Binary:   "/opt/local/bin"
1181:info:build Library:  "/opt/local/lib"
1182:info:build           (Up: 1, Relative: "lib")
1183:info:build GLE_TOP:  "/opt/local/share/gle-graphics/4.2.5"
1184:info:build           (Up: 1, Relative: "share/gle-graphics/4.2.5")
1185:info:build DOC:      "/opt/local/share/doc/gle-graphics"
1186:info:build           (Up: 2, Relative: "doc/gle-graphics")
1187:info:build make[1]: Leaving directory `/opt/local/var/macports/build/_opt_local_var_macports_sources_rsync.macports.org_macports_release_tarballs_ports_graphics_gle-graphics/gle-graphics/work/gle-graphics-4.2.5/src/gle'
1188:info:build /Applications/Xcode.app/Contents/Developer/usr/bin/make -C src/gle/bitmap
1189:info:build make[1]: Entering directory `/opt/local/var/macports/build/_opt_local_var_macports_sources_rsync.macports.org_macports_release_tarballs_ports_graphics_gle-graphics/gle-graphics/work/gle-graphics-4.2.5/src/gle/bitmap'
1190:info:build /usr/bin/clang++ -DHAVE_CONFIG_H -DGLEVN="\"4.2.5\"" -Wno-write-strings -D_REENTRANT -I/opt/local/include/poppler/glib -I/opt/local/include/poppler -I/opt/local/include/cairo -I/opt/local/include/glib-2.0 -I/opt/local/lib/glib-2.0/include -I/opt/local/include/pixman-1 -I/opt/local/include/freetype2 -I/opt/local/include/libpng16 -I/opt/local/include/cairo -I/opt/local/include/glib-2.0 -I/opt/local/lib/glib-2.0/include -I/opt/local/include/pixman-1 -I/opt/local/include/freetype2 -I/opt/local/include/libpng16 -I/opt/local/include -I/opt/local/include -I/opt/local/include -I/opt/local/include -I/opt/local/include -c img2ps.cpp -o img2ps.o
1191:info:build /usr/bin/clang++ -DHAVE_CONFIG_H -DGLEVN="\"4.2.5\"" -Wno-write-strings -D_REENTRANT -I/opt/local/include/poppler/glib -I/opt/local/include/poppler -I/opt/local/include/cairo -I/opt/local/include/glib-2.0 -I/opt/local/lib/glib-2.0/include -I/opt/local/include/pixman-1 -I/opt/local/include/freetype2 -I/opt/local/include/libpng16 -I/opt/local/include/cairo -I/opt/local/include/glib-2.0 -I/opt/local/lib/glib-2.0/include -I/opt/local/include/pixman-1 -I/opt/local/include/freetype2 -I/opt/local/include/libpng16 -I/opt/local/include -I/opt/local/include -I/opt/local/include -I/opt/local/include -I/opt/local/include -c lzwencode.cpp -o lzwencode.o
1192:info:build /usr/bin/clang++ -DHAVE_CONFIG_H -DGLEVN="\"4.2.5\"" -Wno-write-strings -D_REENTRANT -I/opt/local/include/poppler/glib -I/opt/local/include/poppler -I/opt/local/include/cairo -I/opt/local/include/glib-2.0 -I/opt/local/lib/glib-2.0/include -I/opt/local/include/pixman-1 -I/opt/local/include/freetype2 -I/opt/local/include/libpng16 -I/opt/local/include/cairo -I/opt/local/include/glib-2.0 -I/opt/local/lib/glib-2.0/include -I/opt/local/include/pixman-1 -I/opt/local/include/freetype2 -I/opt/local/include/libpng16 -I/opt/local/include -I/opt/local/include -I/opt/local/include -I/opt/local/include -I/opt/local/include -c glegif.cpp -o glegif.o
1193:info:build /usr/bin/clang++ -DHAVE_CONFIG_H -DGLEVN="\"4.2.5\"" -Wno-write-strings -D_REENTRANT -I/opt/local/include/poppler/glib -I/opt/local/include/poppler -I/opt/local/include/cairo -I/opt/local/include/glib-2.0 -I/opt/local/lib/glib-2.0/include -I/opt/local/include/pixman-1 -I/opt/local/include/freetype2 -I/opt/local/include/libpng16 -I/opt/local/include/cairo -I/opt/local/include/glib-2.0 -I/opt/local/lib/glib-2.0/include -I/opt/local/include/pixman-1 -I/opt/local/include/freetype2 -I/opt/local/include/libpng16 -I/opt/local/include -I/opt/local/include -I/opt/local/include -I/opt/local/include -I/opt/local/include -c glejpeg.cpp -o glejpeg.o
1194:info:build /usr/bin/clang++ -DHAVE_CONFIG_H -DGLEVN="\"4.2.5\"" -Wno-write-strings -D_REENTRANT -I/opt/local/include/poppler/glib -I/opt/local/include/poppler -I/opt/local/include/cairo -I/opt/local/include/glib-2.0 -I/opt/local/lib/glib-2.0/include -I/opt/local/include/pixman-1 -I/opt/local/include/freetype2 -I/opt/local/include/libpng16 -I/opt/local/include/cairo -I/opt/local/include/glib-2.0 -I/opt/local/lib/glib-2.0/include -I/opt/local/include/pixman-1 -I/opt/local/include/freetype2 -I/opt/local/include/libpng16 -I/opt/local/include -I/opt/local/include -I/opt/local/include -I/opt/local/include -I/opt/local/include -c gletiff.cpp -o gletiff.o
1195:info:build /usr/bin/clang++ -DHAVE_CONFIG_H -DGLEVN="\"4.2.5\"" -Wno-write-strings -D_REENTRANT -I/opt/local/include/poppler/glib -I/opt/local/include/poppler -I/opt/local/include/cairo -I/opt/local/include/glib-2.0 -I/opt/local/lib/glib-2.0/include -I/opt/local/include/pixman-1 -I/opt/local/include/freetype2 -I/opt/local/include/libpng16 -I/opt/local/include/cairo -I/opt/local/include/glib-2.0 -I/opt/local/lib/glib-2.0/include -I/opt/local/include/pixman-1 -I/opt/local/include/freetype2 -I/opt/local/include/libpng16 -I/opt/local/include -I/opt/local/include -I/opt/local/include -I/opt/local/include -I/opt/local/include -c glepng.cpp -o glepng.o
1196:info:build /usr/bin/clang++ -DHAVE_CONFIG_H -DGLEVN="\"4.2.5\"" -Wno-write-strings -D_REENTRANT -I/opt/local/include/poppler/glib -I/opt/local/include/poppler -I/opt/local/include/cairo -I/opt/local/include/glib-2.0 -I/opt/local/lib/glib-2.0/include -I/opt/local/include/pixman-1 -I/opt/local/include/freetype2 -I/opt/local/include/libpng16 -I/opt/local/include/cairo -I/opt/local/include/glib-2.0 -I/opt/local/lib/glib-2.0/include -I/opt/local/include/pixman-1 -I/opt/local/include/freetype2 -I/opt/local/include/libpng16 -I/opt/local/include -I/opt/local/include -I/opt/local/include -I/opt/local/include -I/opt/local/include -c ascii85.cpp -o ascii85.o
1197:info:build make[1]: Leaving directory `/opt/local/var/macports/build/_opt_local_var_macports_sources_rsync.macports.org_macports_release_tarballs_ports_graphics_gle-graphics/gle-graphics/work/gle-graphics-4.2.5/src/gle/bitmap'
1198:info:build /Applications/Xcode.app/Contents/Developer/usr/bin/make -C src/gle/surface
1199:info:build make[1]: Entering directory `/opt/local/var/macports/build/_opt_local_var_macports_sources_rsync.macports.org_macports_release_tarballs_ports_graphics_gle-graphics/gle-graphics/work/gle-graphics-4.2.5/src/gle/surface'
1200:info:build /usr/bin/clang++ -DHAVE_CONFIG_H -DGLEVN="\"4.2.5\"" -Wno-write-strings -D_REENTRANT -I/opt/local/include/poppler/glib -I/opt/local/include/poppler -I/opt/local/include/cairo -I/opt/local/include/glib-2.0 -I/opt/local/lib/glib-2.0/include -I/opt/local/include/pixman-1 -I/opt/local/include/freetype2 -I/opt/local/include/libpng16 -I/opt/local/include/cairo -I/opt/local/include/glib-2.0 -I/opt/local/lib/glib-2.0/include -I/opt/local/include/pixman-1 -I/opt/local/include/freetype2 -I/opt/local/include/libpng16 -I/opt/local/include -I/opt/local/include -I/opt/local/include -I/opt/local/include -I/opt/local/include -c gsurface.cpp -o gsurface.o
1201:info:build /usr/bin/clang++ -DHAVE_CONFIG_H -DGLEVN="\"4.2.5\"" -Wno-write-strings -D_REENTRANT -I/opt/local/include/poppler/glib -I/opt/local/include/poppler -I/opt/local/include/cairo -I/opt/local/include/glib-2.0 -I/opt/local/lib/glib-2.0/include -I/opt/local/include/pixman-1 -I/opt/local/include/freetype2 -I/opt/local/include/libpng16 -I/opt/local/include/cairo -I/opt/local/include/glib-2.0 -I/opt/local/lib/glib-2.0/include -I/opt/local/include/pixman-1 -I/opt/local/include/freetype2 -I/opt/local/include/libpng16 -I/opt/local/include -I/opt/local/include -I/opt/local/include -I/opt/local/include -I/opt/local/include -c hide.cpp -o hide.o
1202:info:build /usr/bin/clang++ -DHAVE_CONFIG_H -DGLEVN="\"4.2.5\"" -Wno-write-strings -D_REENTRANT -I/opt/local/include/poppler/glib -I/opt/local/include/poppler -I/opt/local/include/cairo -I/opt/local/include/glib-2.0 -I/opt/local/lib/glib-2.0/include -I/opt/local/include/pixman-1 -I/opt/local/include/freetype2 -I/opt/local/include/libpng16 -I/opt/local/include/cairo -I/opt/local/include/glib-2.0 -I/opt/local/lib/glib-2.0/include -I/opt/local/include/pixman-1 -I/opt/local/include/freetype2 -I/opt/local/include/libpng16 -I/opt/local/include -I/opt/local/include -I/opt/local/include -I/opt/local/include -I/opt/local/include -c fcontour.cpp -o fcontour.o
1203:info:build /usr/bin/clang++ -DHAVE_CONFIG_H -DGLEVN="\"4.2.5\"" -Wno-write-strings -D_REENTRANT -I/opt/local/include/poppler/glib -I/opt/local/include/poppler -I/opt/local/include/cairo -I/opt/local/include/glib-2.0 -I/opt/local/lib/glib-2.0/include -I/opt/local/include/pixman-1 -I/opt/local/include/freetype2 -I/opt/local/include/libpng16 -I/opt/local/include/cairo -I/opt/local/include/glib-2.0 -I/opt/local/lib/glib-2.0/include -I/opt/local/include/pixman-1 -I/opt/local/include/freetype2 -I/opt/local/include/libpng16 -I/opt/local/include -I/opt/local/include -I/opt/local/include -I/opt/local/include -I/opt/local/include -c ffitcontour.cpp -o ffitcontour.o
1204:info:build /usr/bin/clang++ -DHAVE_CONFIG_H -DGLEVN="\"4.2.5\"" -Wno-write-strings -D_REENTRANT -I/opt/local/include/poppler/glib -I/opt/local/include/poppler -I/opt/local/include/cairo -I/opt/local/include/glib-2.0 -I/opt/local/lib/glib-2.0/include -I/opt/local/include/pixman-1 -I/opt/local/include/freetype2 -I/opt/local/include/libpng16 -I/opt/local/include/cairo -I/opt/local/include/glib-2.0 -I/opt/local/lib/glib-2.0/include -I/opt/local/include/pixman-1 -I/opt/local/include/freetype2 -I/opt/local/include/libpng16 -I/opt/local/include -I/opt/local/include -I/opt/local/include -I/opt/local/include -I/opt/local/include -c gcontour.cpp -o gcontour.o
1205:info:build In file included from ffitcontour.cpp:53:
1206:info:build In file included from /Applications/Xcode.app/Contents/Developer/Toolchains/XcodeDefault.xctoolchain/usr/include/c++/v1/math.h:310:
1207:info:build In file included from /Applications/Xcode.app/Contents/Developer/Toolchains/XcodeDefault.xctoolchain/usr/include/c++/v1/limits:112:
1208:info:build /Applications/Xcode.app/Contents/Developer/Toolchains/XcodeDefault.xctoolchain/usr/include/c++/v1/__undef_min_max:17:2: warning: : macro min is incompatible with C++.  #undefing min [-W#warnings]
1209:info:build #warning: macro min is incompatible with C++.  #undefing min
1210:info:build  ^
1211:info:build /Applications/Xcode.app/Contents/Developer/Toolchains/XcodeDefault.xctoolchain/usr/include/c++/v1/__undef_min_max:29:2: warning: : macro max is incompatible with C++.  #undefing max [-W#warnings]
1212:info:build #warning: macro max is incompatible with C++.  #undefing max
1213:info:build  ^
1214:info:build In file included from ffitcontour.cpp:53:
1215:info:build /Applications/Xcode.app/Contents/Developer/Toolchains/XcodeDefault.xctoolchain/usr/include/c++/v1/math.h:693:5: error: expected unqualified-id
1216:info:build abs(float __lcpp_x) _NOEXCEPT {return ::fabsf(__lcpp_x);}
1217:info:build     ^
1218:info:build /Applications/Xcode.app/Contents/Developer/Toolchains/XcodeDefault.xctoolchain/usr/include/c++/v1/math.h:693:5: error: expected ')'
1219:info:build /Applications/Xcode.app/Contents/Developer/Toolchains/XcodeDefault.xctoolchain/usr/include/c++/v1/math.h:693:1: note: to match this '('
1220:info:build abs(float __lcpp_x) _NOEXCEPT {return ::fabsf(__lcpp_x);}
1221:info:build ^
1222:info:build ./f2c.h:184:17: note: expanded from macro 'abs'
1223:info:build #define abs(x) ((x) >= 0 ? (x) : -(x))
1224:info:build                 ^
1225:info:build In file included from ffitcontour.cpp:53:
1226:info:build /Applications/Xcode.app/Contents/Developer/Toolchains/XcodeDefault.xctoolchain/usr/include/c++/v1/math.h:693:1: error: expected ')'
1227:info:build abs(float __lcpp_x) _NOEXCEPT {return ::fabsf(__lcpp_x);}
1228:info:build ^
1229:info:build ./f2c.h:184:21: note: expanded from macro 'abs'
1230:info:build #define abs(x) ((x) >= 0 ? (x) : -(x))
1231:info:build                     ^
1232:info:build /Applications/Xcode.app/Contents/Developer/Toolchains/XcodeDefault.xctoolchain/usr/include/c++/v1/math.h:693:1: note: to match this '('
1233:info:build ./f2c.h:184:16: note: expanded from macro 'abs'
1234:info:build #define abs(x) ((x) >= 0 ? (x) : -(x))
1235:info:build                ^
1236:info:build In file included from ffitcontour.cpp:53:
1237:info:build /Applications/Xcode.app/Contents/Developer/Toolchains/XcodeDefault.xctoolchain/usr/include/c++/v1/math.h:697:5: error: expected unqualified-id
1238:info:build abs(double __lcpp_x) _NOEXCEPT {return ::fabs(__lcpp_x);}
1239:info:build     ^
1240:info:build /Applications/Xcode.app/Contents/Developer/Toolchains/XcodeDefault.xctoolchain/usr/include/c++/v1/math.h:697:5: error: expected ')'
1241:info:build /Applications/Xcode.app/Contents/Developer/Toolchains/XcodeDefault.xctoolchain/usr/include/c++/v1/math.h:697:1: note: to match this '('
1242:info:build abs(double __lcpp_x) _NOEXCEPT {return ::fabs(__lcpp_x);}
1243:info:build ^
1244:info:build ./f2c.h:184:17: note: expanded from macro 'abs'
1245:info:build #define abs(x) ((x) >= 0 ? (x) : -(x))
1246:info:build                 ^
1247:info:build In file included from ffitcontour.cpp:53:
1248:info:build /Applications/Xcode.app/Contents/Developer/Toolchains/XcodeDefault.xctoolchain/usr/include/c++/v1/math.h:697:1: error: expected ')'
1249:info:build abs(double __lcpp_x) _NOEXCEPT {return ::fabs(__lcpp_x);}
1250:info:build ^
1251:info:build ./f2c.h:184:21: note: expanded from macro 'abs'
1252:info:build #define abs(x) ((x) >= 0 ? (x) : -(x))
1253:info:build                     ^
1254:info:build /Applications/Xcode.app/Contents/Developer/Toolchains/XcodeDefault.xctoolchain/usr/include/c++/v1/math.h:697:1: note: to match this '('
1255:info:build ./f2c.h:184:16: note: expanded from macro 'abs'
1256:info:build #define abs(x) ((x) >= 0 ? (x) : -(x))
1257:info:build                ^
1258:info:build In file included from ffitcontour.cpp:53:
1259:info:build /Applications/Xcode.app/Contents/Developer/Toolchains/XcodeDefault.xctoolchain/usr/include/c++/v1/math.h:701:5: error: expected unqualified-id
1260:info:build abs(long double __lcpp_x) _NOEXCEPT {return ::fabsl(__lcpp_x);}
1261:info:build     ^
1262:info:build /Applications/Xcode.app/Contents/Developer/Toolchains/XcodeDefault.xctoolchain/usr/include/c++/v1/math.h:701:5: error: expected ')'
1263:info:build /Applications/Xcode.app/Contents/Developer/Toolchains/XcodeDefault.xctoolchain/usr/include/c++/v1/math.h:701:1: note: to match this '('
1264:info:build abs(long double __lcpp_x) _NOEXCEPT {return ::fabsl(__lcpp_x);}
1265:info:build ^
1266:info:build ./f2c.h:184:17: note: expanded from macro 'abs'
1267:info:build #define abs(x) ((x) >= 0 ? (x) : -(x))
1268:info:build                 ^
1269:info:build In file included from ffitcontour.cpp:53:
1270:info:build /Applications/Xcode.app/Contents/Developer/Toolchains/XcodeDefault.xctoolchain/usr/include/c++/v1/math.h:701:1: error: expected ')'
1271:info:build abs(long double __lcpp_x) _NOEXCEPT {return ::fabsl(__lcpp_x);}
1272:info:build ^
1273:info:build ./f2c.h:184:21: note: expanded from macro 'abs'
1274:info:build #define abs(x) ((x) >= 0 ? (x) : -(x))
1275:info:build                     ^
1276:info:build /Applications/Xcode.app/Contents/Developer/Toolchains/XcodeDefault.xctoolchain/usr/include/c++/v1/math.h:701:1: note: to match this '('
1277:info:build ./f2c.h:184:16: note: expanded from macro 'abs'
1278:info:build #define abs(x) ((x) >= 0 ? (x) : -(x))
1279:info:build                ^
1280:info:build 2 warnings and 9 errors generated.
1281:info:build make[1]: *** [ffitcontour.o] Error 1
1282:info:build make[1]: *** Waiting for unfinished jobs....
1283:info:build In file included from gsurface.cpp:44:
1284:info:build In file included from ./../all.h:73:
1285:info:build In file included from ./../glepro.h:42:
1286:info:build In file included from ./../tokens/Tokenizer.h:51:
1287:info:build In file included from ./../tokens/StringKeyHash.h:57:
1288:info:build /Applications/Xcode.app/Contents/Developer/Toolchains/XcodeDefault.xctoolchain/usr/include/c++/v1/ext/hash_map:213:5: warning: Use of the header <ext/hash_map> is deprecated.  Migrate to <unordered_map> [-W#warnings]
1289:info:build In file included from hide.cpp:43:
1290:info:build In file included from ./../all.h:73:
1291:info:build In file included from ./../glepro.h:42:
1292:info:build In file included from ./../tokens/Tokenizer.h:51:
1293:info:build In file included from ./../tokens/StringKeyHash.h:57:
1294:info:build /Applications/Xcode.app/Contents/Developer/Toolchains/XcodeDefault.xctoolchain/usr/include/c++/v1/ext/hash_map#   warning Use of the header <ext/hash_map> is deprecated.  Migrate to <unordered_map>
1295:info:build     ^
1296:info:build :213:5: warning: Use of the header <ext/hash_map> is deprecated.  Migrate to <unordered_map> [-W#warnings]
1297:info:build #   warning Use of the header <ext/hash_map> is deprecated.  Migrate to <unordered_map>
1298:info:build     ^
1299:info:build In file included from gcontour.cpp:43:
1300:info:build In file included from ./../all.h:73:
1301:info:build In file included from ./../glepro.h:42:
1302:info:build In file included from ./../tokens/Tokenizer.h:51:
1303:info:build In file included from ./../tokens/StringKeyHash.h:57:
1304:info:build /Applications/Xcode.app/Contents/Developer/Toolchains/XcodeDefault.xctoolchain/usr/include/c++/v1/ext/hash_map:213:5: warning: Use of the header <ext/hash_map> is deprecated.  Migrate to <unordered_map> [-W#warnings]
1305:info:build #   warning Use of the header <ext/hash_map> is deprecated.  Migrate to <unordered_map>
1306:info:build     ^
1307:info:build 1 warning generated.
1308:info:build 1 warning generated.
1309:info:build 1 warning generated.
1310:info:build make[1]: Leaving directory `/opt/local/var/macports/build/_opt_local_var_macports_sources_rsync.macports.org_macports_release_tarballs_ports_graphics_gle-graphics/gle-graphics/work/gle-graphics-4.2.5/src/gle/surface'
1311:info:build make: *** [make_all] Error 2
1312:info:build make: Leaving directory `/opt/local/var/macports/build/_opt_local_var_macports_sources_rsync.macports.org_macports_release_tarballs_ports_graphics_gle-graphics/gle-graphics/work/gle-graphics-4.2.5'
1313:info:build Command failed:  cd "/opt/local/var/macports/build/_opt_local_var_macports_sources_rsync.macports.org_macports_release_tarballs_ports_graphics_gle-graphics/gle-graphics/work/gle-graphics-4.2.5" && /usr/bin/make -j4 -w all
1314:info:build Exit code: 2
1315:error:build Failed to build gle-graphics: command execution failed
1316:debug:build Error code: CHILDSTATUS 22143 2
1317:debug:build Backtrace: command execution failed
1318:debug:build     while executing
1319:debug:build "system {*}$notty {*}$nice $fullcmdstring"
1320:debug:build     invoked from within
1321:debug:build "command_exec build"
1322:debug:build     (procedure "portbuild::build_main" line 8)
1323:debug:build     invoked from within
1324:debug:build "$procedure $targetname"
1325:error:build See /opt/local/var/macports/logs/_opt_local_var_macports_sources_rsync.macports.org_macports_release_tarballs_ports_graphics_gle-graphics/gle-graphics/main.log for details.