Ticket #56803: main.log

File main.log, 124.0 KB (added by amadeus24, 3 years ago)

main.log

Line 
1version:1
2:debug:sysinfo macOS 10.13 (darwin/17.6.0) arch i386
3:debug:sysinfo MacPorts 2.5.3
4:debug:sysinfo Xcode 9.4.1
5:debug:sysinfo SDK 10.13
6:debug:sysinfo MACOSX_DEPLOYMENT_TARGET: 10.13
7:msg:main --->  Computing dependencies for pdf2htmlex:info:main .:debug:main pdf2htmlex has no conflicts
8:debug:main Searching for dependency: cmake
9:debug:main Found Dependency: receipt exists for cmake
10:debug:main Searching for dependency: fontforge
11:debug:main Found Dependency: receipt exists for fontforge
12:debug:main Searching for dependency: pkgconfig
13:debug:main Found Dependency: receipt exists for pkgconfig
14:debug:main Searching for dependency: poppler
15:debug:main Found Dependency: receipt exists for poppler
16:debug:main Searching for dependency: poppler-data
17:debug:main Found Dependency: receipt exists for poppler-data
18:debug:main Executing org.macports.main (pdf2htmlex)
19:debug:main dropping privileges: euid changed to 502, egid changed to 501.
20:debug:archivefetch archivefetch phase started at Thu Jul  5 22:44:11 CEST 2018
21:msg:archivefetch --->  Fetching archive for pdf2htmlex
22:debug:archivefetch Executing org.macports.archivefetch (pdf2htmlex)
23:debug:archivefetch euid/egid changed to: 0/0
24:debug:archivefetch chowned /opt/local/var/macports/incoming to macports
25:debug:archivefetch euid/egid changed to: 502/501
26:info:archivefetch --->  pdf2htmlex-0.11_23.darwin_17.x86_64.tbz2 doesn't seem to exist in /opt/local/var/macports/incoming/verified
27:msg:archivefetch --->  Attempting to fetch pdf2htmlex-0.11_23.darwin_17.x86_64.tbz2 from https://packages.macports.org/pdf2htmlex
28:debug:archivefetch Fetching archive failed: The requested URL returned error: 404 Not Found
29:msg:archivefetch --->  Attempting to fetch pdf2htmlex-0.11_23.darwin_17.x86_64.tbz2 from http://nue.de.packages.macports.org/pdf2htmlex
30:debug:archivefetch Fetching archive failed: The requested URL returned error: 404 Not Found
31:msg:archivefetch --->  Attempting to fetch pdf2htmlex-0.11_23.darwin_17.x86_64.tbz2 from http://lil.fr.packages.macports.org/pdf2htmlex
32:debug:archivefetch Fetching archive failed: The requested URL returned error: 404 Not Found
33:debug:archivefetch Privilege de-escalation not attempted as not running as root.
34:debug:fetch fetch phase started at Thu Jul  5 22:44:11 CEST 2018
35:notice:fetch --->  Fetching distfiles for pdf2htmlex
36:debug:fetch Executing org.macports.fetch (pdf2htmlex)
37:debug:fetch Privilege de-escalation not attempted as not running as root.
38:debug:checksum checksum phase started at Thu Jul  5 22:44:11 CEST 2018
39:notice:checksum --->  Verifying checksums for pdf2htmlex
40:debug:checksum Executing org.macports.checksum (pdf2htmlex)
41:info:checksum --->  Checksumming pdf2htmlEX-43e3174cbc.tar.gz
42:debug:checksum Calculated (rmd160) is ee5b354ad260398e9408bfe832ae184a61d4a9a3
43:debug:checksum Correct (rmd160) checksum for pdf2htmlEX-43e3174cbc.tar.gz
44:debug:checksum Calculated (sha256) is ff745f8d78bb0dc084d5e9f8eaa6efc8f6ef1e77d6971f3a4722201f29b61f41
45:debug:checksum Correct (sha256) checksum for pdf2htmlEX-43e3174cbc.tar.gz
46:debug:checksum Privilege de-escalation not attempted as not running as root.
47:debug:extract extract phase started at Thu Jul  5 22:44:11 CEST 2018
48:notice:extract --->  Extracting pdf2htmlex
49:debug:extract Executing org.macports.extract (pdf2htmlex)
50:info:extract --->  Extracting pdf2htmlEX-43e3174cbc.tar.gz
51:debug:extract setting option extract.args to '/opt/local/var/macports/distfiles/pdf2htmlex/pdf2htmlEX-43e3174cbc.tar.gz'
52:debug:extract Environment:
53:debug:extract CC_PRINT_OPTIONS='YES'
54:debug:extract CC_PRINT_OPTIONS_FILE='/opt/local/var/macports/build/_opt_local_var_macports_sources_rsync.macports.org_macports_release_tarballs_ports_textproc_pdf2htmlex/pdf2htmlex/work/.CC_PRINT_OPTIONS'
55:debug:extract CPATH='/opt/local/include'
56:debug:extract LIBRARY_PATH='/opt/local/lib'
57:debug:extract MACOSX_DEPLOYMENT_TARGET='10.13'
58:info:extract Executing:  cd "/opt/local/var/macports/build/_opt_local_var_macports_sources_rsync.macports.org_macports_release_tarballs_ports_textproc_pdf2htmlex/pdf2htmlex/work" && /usr/bin/gzip -dc '/opt/local/var/macports/distfiles/pdf2htmlex/pdf2htmlEX-43e3174cbc.tar.gz' | /usr/bin/tar -xf -
59:debug:extract system:  cd "/opt/local/var/macports/build/_opt_local_var_macports_sources_rsync.macports.org_macports_release_tarballs_ports_textproc_pdf2htmlex/pdf2htmlex/work" && /usr/bin/gzip -dc '/opt/local/var/macports/distfiles/pdf2htmlex/pdf2htmlEX-43e3174cbc.tar.gz' | /usr/bin/tar -xf -
60:debug:extract euid/egid changed to: 0/0
61:debug:extract chowned /opt/local/var/macports/build/_opt_local_var_macports_sources_rsync.macports.org_macports_release_tarballs_ports_textproc_pdf2htmlex/pdf2htmlex/work to macports
62:debug:extract euid/egid changed to: 502/501
63:debug:extract Executing proc-post-org.macports.extract-extract-0
64:debug:extract Privilege de-escalation not attempted as not running as root.
65:debug:patch patch phase started at Thu Jul  5 22:44:11 CEST 2018
66:debug:patch Executing org.macports.patch (pdf2htmlex)
67:notice:patch --->  Applying patches to pdf2htmlex
68:info:patch --->  Applying patch-poppler-0.31.diff
69:debug:patch Environment:
70:debug:patch CC_PRINT_OPTIONS='YES'
71:debug:patch CC_PRINT_OPTIONS_FILE='/opt/local/var/macports/build/_opt_local_var_macports_sources_rsync.macports.org_macports_release_tarballs_ports_textproc_pdf2htmlex/pdf2htmlex/work/.CC_PRINT_OPTIONS'
72:debug:patch CPATH='/opt/local/include'
73:debug:patch LIBRARY_PATH='/opt/local/lib'
74:debug:patch MACOSX_DEPLOYMENT_TARGET='10.13'
75:info:patch Executing:  cd "/opt/local/var/macports/build/_opt_local_var_macports_sources_rsync.macports.org_macports_release_tarballs_ports_textproc_pdf2htmlex/pdf2htmlex/work/pdf2htmlEX-43e3174cbc" && /usr/bin/patch -p0 < '/opt/local/var/macports/sources/rsync.macports.org/macports/release/tarballs/ports/textproc/pdf2htmlex/files/patch-poppler-0.31.diff'
76:debug:patch system:  cd "/opt/local/var/macports/build/_opt_local_var_macports_sources_rsync.macports.org_macports_release_tarballs_ports_textproc_pdf2htmlex/pdf2htmlex/work/pdf2htmlEX-43e3174cbc" && /usr/bin/patch -p0 < '/opt/local/var/macports/sources/rsync.macports.org/macports/release/tarballs/ports/textproc/pdf2htmlex/files/patch-poppler-0.31.diff'
77:info:patch patching file src/BackgroundRenderer/SplashBackgroundRenderer.h
78:info:patch patching file src/HTMLRenderer/font.cc
79:debug:patch Privilege de-escalation not attempted as not running as root.
80:debug:configure configure phase started at Thu Jul  5 22:44:11 CEST 2018
81:notice:configure --->  Configuring pdf2htmlex
82:debug:configure Preferred compilers: clang macports-clang-5.0 macports-clang-4.0
83:debug:configure Using compiler 'Xcode Clang'
84:debug:configure Executing proc-pre-org.macports.configure-configure-0
85:debug:configure Executing proc-pre-org.macports.configure-configure-1
86:debug:configure Executing proc-pre-org.macports.configure-configure-2
87:debug:configure Executing org.macports.configure (pdf2htmlex)
88:debug:configure Environment:
89:debug:configure CC='/usr/bin/clang'
90:debug:configure CC_PRINT_OPTIONS='YES'
91:debug:configure CC_PRINT_OPTIONS_FILE='/opt/local/var/macports/build/_opt_local_var_macports_sources_rsync.macports.org_macports_release_tarballs_ports_textproc_pdf2htmlex/pdf2htmlex/work/.CC_PRINT_OPTIONS'
92:debug:configure CFLAGS='-pipe -Os'
93:debug:configure CPATH='/opt/local/include'
94:debug:configure CPPFLAGS='-I/opt/local/include'
95:debug:configure CXX='/usr/bin/clang++'
96:debug:configure CXXFLAGS='-pipe -Os -stdlib=libc++'
97:debug:configure F77FLAGS='-m64'
98:debug:configure F90FLAGS='-pipe -Os -m64'
99:debug:configure FCFLAGS='-pipe -Os -m64'
100:debug:configure FFLAGS='-pipe -Os'
101:debug:configure INSTALL='/usr/bin/install -c'
102:debug:configure LDFLAGS='-L/opt/local/lib -Wl,-headerpad_max_install_names'
103:debug:configure LIBRARY_PATH='/opt/local/lib'
104:debug:configure MACOSX_DEPLOYMENT_TARGET='10.13'
105:debug:configure OBJC='/usr/bin/clang'
106:debug:configure OBJCFLAGS='-pipe -Os'
107:debug:configure OBJCXX='/usr/bin/clang++'
108:debug:configure OBJCXXFLAGS='-pipe -Os -stdlib=libc++'
109:info:configure Executing:  cd "/opt/local/var/macports/build/_opt_local_var_macports_sources_rsync.macports.org_macports_release_tarballs_ports_textproc_pdf2htmlex/pdf2htmlex/work/build" && /opt/local/bin/cmake -DCMAKE_INSTALL_PREFIX='/opt/local' -DCMAKE_BUILD_TYPE=Release -DCMAKE_BUILD_WITH_INSTALL_RPATH=ON -DCMAKE_C_COMPILER="$CC" -DCMAKE_COLOR_MAKEFILE=ON -DCMAKE_CXX_COMPILER="$CXX" -DCMAKE_FIND_FRAMEWORK=LAST -DCMAKE_INSTALL_NAME_DIR=/opt/local/lib -DCMAKE_INSTALL_RPATH=/opt/local/lib -DCMAKE_MODULE_PATH=/opt/local/share/cmake/Modules -DCMAKE_SYSTEM_PREFIX_PATH="/opt/local;/opt/local;/usr" -DCMAKE_VERBOSE_MAKEFILE=ON -DCMAKE_POLICY_DEFAULT_CMP0025=NEW -Wno-dev -DCMAKE_C_FLAGS_RELEASE="-DNDEBUG" -DCMAKE_CXX_FLAGS_RELEASE="-DNDEBUG" -DCMAKE_OSX_ARCHITECTURES="x86_64" -DCMAKE_OSX_DEPLOYMENT_TARGET="10.13" -DCMAKE_OSX_SYSROOT="/" /opt/local/var/macports/build/_opt_local_var_macports_sources_rsync.macports.org_macports_release_tarballs_ports_textproc_pdf2htmlex/pdf2htmlex/work/pdf2htmlEX-43e3174cbc
110:debug:configure system:  cd "/opt/local/var/macports/build/_opt_local_var_macports_sources_rsync.macports.org_macports_release_tarballs_ports_textproc_pdf2htmlex/pdf2htmlex/work/build" && /opt/local/bin/cmake -DCMAKE_INSTALL_PREFIX='/opt/local' -DCMAKE_BUILD_TYPE=Release -DCMAKE_BUILD_WITH_INSTALL_RPATH=ON -DCMAKE_C_COMPILER="$CC" -DCMAKE_COLOR_MAKEFILE=ON -DCMAKE_CXX_COMPILER="$CXX" -DCMAKE_FIND_FRAMEWORK=LAST -DCMAKE_INSTALL_NAME_DIR=/opt/local/lib -DCMAKE_INSTALL_RPATH=/opt/local/lib -DCMAKE_MODULE_PATH=/opt/local/share/cmake/Modules -DCMAKE_SYSTEM_PREFIX_PATH="/opt/local;/opt/local;/usr" -DCMAKE_VERBOSE_MAKEFILE=ON -DCMAKE_POLICY_DEFAULT_CMP0025=NEW -Wno-dev -DCMAKE_C_FLAGS_RELEASE="-DNDEBUG" -DCMAKE_CXX_FLAGS_RELEASE="-DNDEBUG" -DCMAKE_OSX_ARCHITECTURES="x86_64" -DCMAKE_OSX_DEPLOYMENT_TARGET="10.13" -DCMAKE_OSX_SYSROOT="/" /opt/local/var/macports/build/_opt_local_var_macports_sources_rsync.macports.org_macports_release_tarballs_ports_textproc_pdf2htmlex/pdf2htmlex/work/pdf2htmlEX-43e3174cbc
111:info:configure -- The C compiler identification is AppleClang 9.1.0.9020039
112:info:configure -- The CXX compiler identification is AppleClang 9.1.0.9020039
113:info:configure -- Check for working C compiler: /usr/bin/clang
114:info:configure -- Check for working C compiler: /usr/bin/clang -- works
115:info:configure -- Detecting C compiler ABI info
116:info:configure -- Detecting C compiler ABI info - done
117:info:configure -- Detecting C compile features
118:info:configure -- Detecting C compile features - done
119:info:configure -- Check for working CXX compiler: /usr/bin/clang++
120:info:configure -- Check for working CXX compiler: /usr/bin/clang++ -- works
121:info:configure -- Detecting CXX compiler ABI info
122:info:configure -- Detecting CXX compiler ABI info - done
123:info:configure -- Detecting CXX compile features
124:info:configure -- Detecting CXX compile features - done
125:info:configure -- Found PkgConfig: /opt/local/bin/pkg-config (found version "0.29.2")
126:info:configure -- Checking for module 'poppler>=0.25.0'
127:info:configure --   Found poppler, version 0.66.0
128:info:configure -- Checking for module 'libfontforge>=2.0.0'
129:info:configure --   No package 'libfontforge' found
130:info:configure Trying to locate old versions of fontforge...
131:info:configure Found fontforge.h: /opt/local/include/fontforge/fontforge.h
132:info:configure Found config.h: /opt/local/include/fontforge/config.h
133:info:configure Found fontforge: /opt/local/lib/libfontforge.dylib
134:info:configure Found gunicode: /opt/local/lib/libgunicode.dylib
135:info:configure Looking for libraries of python, which is required by fontforge, if you can link fontforge without python, you may disable this
136:info:configure -- Checking for one of the modules 'python;python-2.7'
137:info:configure -- Performing Test CXX0X_SUPPORT
138:info:configure -- Performing Test CXX0X_SUPPORT - Success
139:info:configure -- Configuring done
140:info:configure -- Generating done
141:info:configure -- Build files have been written to: /opt/local/var/macports/build/_opt_local_var_macports_sources_rsync.macports.org_macports_release_tarballs_ports_textproc_pdf2htmlex/pdf2htmlex/work/build
142:debug:configure Executing proc-post-org.macports.configure-configure-0
143:debug:configure Privilege de-escalation not attempted as not running as root.
144:debug:build build phase started at Thu Jul  5 22:44:15 CEST 2018
145:notice:build --->  Building pdf2htmlex
146:debug:build Executing org.macports.build (pdf2htmlex)
147:debug:build Environment:
148:debug:build CC_PRINT_OPTIONS='YES'
149:debug:build CC_PRINT_OPTIONS_FILE='/opt/local/var/macports/build/_opt_local_var_macports_sources_rsync.macports.org_macports_release_tarballs_ports_textproc_pdf2htmlex/pdf2htmlex/work/.CC_PRINT_OPTIONS'
150:debug:build CPATH='/opt/local/include'
151:debug:build LIBRARY_PATH='/opt/local/lib'
152:debug:build MACOSX_DEPLOYMENT_TARGET='10.13'
153:info:build Executing:  cd "/opt/local/var/macports/build/_opt_local_var_macports_sources_rsync.macports.org_macports_release_tarballs_ports_textproc_pdf2htmlex/pdf2htmlex/work/build" && /usr/bin/make -j8 -w all VERBOSE=ON
154:debug:build system:  cd "/opt/local/var/macports/build/_opt_local_var_macports_sources_rsync.macports.org_macports_release_tarballs_ports_textproc_pdf2htmlex/pdf2htmlex/work/build" && /usr/bin/make -j8 -w all VERBOSE=ON
155:info:build make: Entering directory `/opt/local/var/macports/build/_opt_local_var_macports_sources_rsync.macports.org_macports_release_tarballs_ports_textproc_pdf2htmlex/pdf2htmlex/work/build'
156:info:build /opt/local/bin/cmake -H/opt/local/var/macports/build/_opt_local_var_macports_sources_rsync.macports.org_macports_release_tarballs_ports_textproc_pdf2htmlex/pdf2htmlex/work/pdf2htmlEX-43e3174cbc -B/opt/local/var/macports/build/_opt_local_var_macports_sources_rsync.macports.org_macports_release_tarballs_ports_textproc_pdf2htmlex/pdf2htmlex/work/build --check-build-system CMakeFiles/Makefile.cmake 0
157:info:build /opt/local/bin/cmake -E cmake_progress_start /opt/local/var/macports/build/_opt_local_var_macports_sources_rsync.macports.org_macports_release_tarballs_ports_textproc_pdf2htmlex/pdf2htmlex/work/build/CMakeFiles /opt/local/var/macports/build/_opt_local_var_macports_sources_rsync.macports.org_macports_release_tarballs_ports_textproc_pdf2htmlex/pdf2htmlex/work/build/CMakeFiles/progress.marks
158:info:build /Applications/Xcode.app/Contents/Developer/usr/bin/make -f CMakeFiles/Makefile2 all
159:info:build make[1]: Entering directory `/opt/local/var/macports/build/_opt_local_var_macports_sources_rsync.macports.org_macports_release_tarballs_ports_textproc_pdf2htmlex/pdf2htmlex/work/build'
160:info:build /Applications/Xcode.app/Contents/Developer/usr/bin/make -f CMakeFiles/pdf2htmlEX_resources.dir/build.make CMakeFiles/pdf2htmlEX_resources.dir/depend
161:info:build /Applications/Xcode.app/Contents/Developer/usr/bin/make -f CMakeFiles/pdf2htmlEX.dir/build.make CMakeFiles/pdf2htmlEX.dir/depend
162:info:build make[2]: Entering directory `/opt/local/var/macports/build/_opt_local_var_macports_sources_rsync.macports.org_macports_release_tarballs_ports_textproc_pdf2htmlex/pdf2htmlex/work/build'
163:info:build cd /opt/local/var/macports/build/_opt_local_var_macports_sources_rsync.macports.org_macports_release_tarballs_ports_textproc_pdf2htmlex/pdf2htmlex/work/build && /opt/local/bin/cmake -E cmake_depends "Unix Makefiles" /opt/local/var/macports/build/_opt_local_var_macports_sources_rsync.macports.org_macports_release_tarballs_ports_textproc_pdf2htmlex/pdf2htmlex/work/pdf2htmlEX-43e3174cbc /opt/local/var/macports/build/_opt_local_var_macports_sources_rsync.macports.org_macports_release_tarballs_ports_textproc_pdf2htmlex/pdf2htmlex/work/pdf2htmlEX-43e3174cbc /opt/local/var/macports/build/_opt_local_var_macports_sources_rsync.macports.org_macports_release_tarballs_ports_textproc_pdf2htmlex/pdf2htmlex/work/build /opt/local/var/macports/build/_opt_local_var_macports_sources_rsync.macports.org_macports_release_tarballs_ports_textproc_pdf2htmlex/pdf2htmlex/work/build /opt/local/var/macports/build/_opt_local_var_macports_sources_rsync.macports.org_macports_release_tarballs_ports_textproc_pdf2htmlex/pdf2htmlex/work/build/CMakeFiles/pdf2htmlEX_resources.dir/DependInfo.cmake --color=
164:info:build make[2]: Entering directory `/opt/local/var/macports/build/_opt_local_var_macports_sources_rsync.macports.org_macports_release_tarballs_ports_textproc_pdf2htmlex/pdf2htmlex/work/build'
165:info:build cd /opt/local/var/macports/build/_opt_local_var_macports_sources_rsync.macports.org_macports_release_tarballs_ports_textproc_pdf2htmlex/pdf2htmlex/work/build && /opt/local/bin/cmake -E cmake_depends "Unix Makefiles" /opt/local/var/macports/build/_opt_local_var_macports_sources_rsync.macports.org_macports_release_tarballs_ports_textproc_pdf2htmlex/pdf2htmlex/work/pdf2htmlEX-43e3174cbc /opt/local/var/macports/build/_opt_local_var_macports_sources_rsync.macports.org_macports_release_tarballs_ports_textproc_pdf2htmlex/pdf2htmlex/work/pdf2htmlEX-43e3174cbc /opt/local/var/macports/build/_opt_local_var_macports_sources_rsync.macports.org_macports_release_tarballs_ports_textproc_pdf2htmlex/pdf2htmlex/work/build /opt/local/var/macports/build/_opt_local_var_macports_sources_rsync.macports.org_macports_release_tarballs_ports_textproc_pdf2htmlex/pdf2htmlex/work/build /opt/local/var/macports/build/_opt_local_var_macports_sources_rsync.macports.org_macports_release_tarballs_ports_textproc_pdf2htmlex/pdf2htmlex/work/build/CMakeFiles/pdf2htmlEX.dir/DependInfo.cmake --color=
166:info:build Dependee "/opt/local/var/macports/build/_opt_local_var_macports_sources_rsync.macports.org_macports_release_tarballs_ports_textproc_pdf2htmlex/pdf2htmlex/work/build/CMakeFiles/pdf2htmlEX_resources.dir/DependInfo.cmake" is newer than depender "/opt/local/var/macports/build/_opt_local_var_macports_sources_rsync.macports.org_macports_release_tarballs_ports_textproc_pdf2htmlex/pdf2htmlex/work/build/CMakeFiles/pdf2htmlEX_resources.dir/depend.internal".
167:info:build Dependee "/opt/local/var/macports/build/_opt_local_var_macports_sources_rsync.macports.org_macports_release_tarballs_ports_textproc_pdf2htmlex/pdf2htmlex/work/build/CMakeFiles/CMakeDirectoryInformation.cmake" is newer than depender "/opt/local/var/macports/build/_opt_local_var_macports_sources_rsync.macports.org_macports_release_tarballs_ports_textproc_pdf2htmlex/pdf2htmlex/work/build/CMakeFiles/pdf2htmlEX_resources.dir/depend.internal".
168:info:build Dependee "/opt/local/var/macports/build/_opt_local_var_macports_sources_rsync.macports.org_macports_release_tarballs_ports_textproc_pdf2htmlex/pdf2htmlex/work/build/CMakeFiles/pdf2htmlEX.dir/DependInfo.cmake" is newer than depender "/opt/local/var/macports/build/_opt_local_var_macports_sources_rsync.macports.org_macports_release_tarballs_ports_textproc_pdf2htmlex/pdf2htmlex/work/build/CMakeFiles/pdf2htmlEX.dir/depend.internal".
169:info:build Dependee "/opt/local/var/macports/build/_opt_local_var_macports_sources_rsync.macports.org_macports_release_tarballs_ports_textproc_pdf2htmlex/pdf2htmlex/work/build/CMakeFiles/CMakeDirectoryInformation.cmake" is newer than depender "/opt/local/var/macports/build/_opt_local_var_macports_sources_rsync.macports.org_macports_release_tarballs_ports_textproc_pdf2htmlex/pdf2htmlex/work/build/CMakeFiles/pdf2htmlEX.dir/depend.internal".
170:info:build Scanning dependencies of target pdf2htmlEX_resources
171:info:build make[2]: Leaving directory `/opt/local/var/macports/build/_opt_local_var_macports_sources_rsync.macports.org_macports_release_tarballs_ports_textproc_pdf2htmlex/pdf2htmlex/work/build'
172:info:build /Applications/Xcode.app/Contents/Developer/usr/bin/make -f CMakeFiles/pdf2htmlEX_resources.dir/build.make CMakeFiles/pdf2htmlEX_resources.dir/build
173:info:build make[2]: Entering directory `/opt/local/var/macports/build/_opt_local_var_macports_sources_rsync.macports.org_macports_release_tarballs_ports_textproc_pdf2htmlex/pdf2htmlex/work/build'
174:info:build [  6%] Generating /opt/local/var/macports/build/_opt_local_var_macports_sources_rsync.macports.org_macports_release_tarballs_ports_textproc_pdf2htmlex/pdf2htmlex/work/pdf2htmlEX-43e3174cbc/share/pdf2htmlEX.min.js
175:info:build [  6%] Generating /opt/local/var/macports/build/_opt_local_var_macports_sources_rsync.macports.org_macports_release_tarballs_ports_textproc_pdf2htmlex/pdf2htmlex/work/pdf2htmlEX-43e3174cbc/share/base.min.css, /opt/local/var/macports/build/_opt_local_var_macports_sources_rsync.macports.org_macports_release_tarballs_ports_textproc_pdf2htmlex/pdf2htmlex/work/pdf2htmlEX-43e3174cbc/share/fancy.min.css
176:info:build /opt/local/var/macports/build/_opt_local_var_macports_sources_rsync.macports.org_macports_release_tarballs_ports_textproc_pdf2htmlex/pdf2htmlex/work/pdf2htmlEX-43e3174cbc/share/build_js.sh
177:info:build /opt/local/var/macports/build/_opt_local_var_macports_sources_rsync.macports.org_macports_release_tarballs_ports_textproc_pdf2htmlex/pdf2htmlex/work/pdf2htmlEX-43e3174cbc/share/build_css.sh
178:info:build Building pdf2htmlEX.min.js with closure-compiler...
179:info:build Building /opt/local/var/macports/build/_opt_local_var_macports_sources_rsync.macports.org_macports_release_tarballs_ports_textproc_pdf2htmlex/pdf2htmlex/work/pdf2htmlEX-43e3174cbc/share/base.min.css with YUI Compressor
180:info:build Scanning dependencies of target pdf2htmlEX
181:info:build make[2]: Leaving directory `/opt/local/var/macports/build/_opt_local_var_macports_sources_rsync.macports.org_macports_release_tarballs_ports_textproc_pdf2htmlex/pdf2htmlex/work/build'
182:info:build /Applications/Xcode.app/Contents/Developer/usr/bin/make -f CMakeFiles/pdf2htmlEX.dir/build.make CMakeFiles/pdf2htmlEX.dir/build
183:info:build make[2]: Entering directory `/opt/local/var/macports/build/_opt_local_var_macports_sources_rsync.macports.org_macports_release_tarballs_ports_textproc_pdf2htmlex/pdf2htmlex/work/build'
184:info:build [ 12%] Building CXX object CMakeFiles/pdf2htmlEX.dir/src/pdf2htmlEX.cc.o
185:info:build [ 16%] Building CXX object CMakeFiles/pdf2htmlEX.dir/src/HTMLRenderer/image.cc.o
186:info:build [ 16%] Building CXX object CMakeFiles/pdf2htmlEX.dir/src/HTMLRenderer/link.cc.o
187:info:build /usr/bin/clang++   -I/opt/local/var/macports/build/_opt_local_var_macports_sources_rsync.macports.org_macports_release_tarballs_ports_textproc_pdf2htmlex/pdf2htmlex/work/pdf2htmlEX-43e3174cbc/src -I/opt/local/include/poppler -I/opt/local/include/fontforge -I/opt/local/include  -pipe -Os -stdlib=libc++ -Wall -stdlib=libc++ -std=c++0x -O2 -DNDEBUG -arch x86_64 -mmacosx-version-min=10.13   -o CMakeFiles/pdf2htmlEX.dir/src/pdf2htmlEX.cc.o -c /opt/local/var/macports/build/_opt_local_var_macports_sources_rsync.macports.org_macports_release_tarballs_ports_textproc_pdf2htmlex/pdf2htmlex/work/pdf2htmlEX-43e3174cbc/src/pdf2htmlEX.cc
188:info:build [ 22%] Building CXX object CMakeFiles/pdf2htmlEX.dir/src/HTMLRenderer/font.cc.o
189:info:build [ 22%] Building CXX object CMakeFiles/pdf2htmlEX.dir/src/HTMLRenderer/draw.cc.o
190:info:build [ 25%] Building CXX object CMakeFiles/pdf2htmlEX.dir/src/HTMLRenderer/general.cc.o
191:info:build /usr/bin/clang++   -I/opt/local/var/macports/build/_opt_local_var_macports_sources_rsync.macports.org_macports_release_tarballs_ports_textproc_pdf2htmlex/pdf2htmlex/work/pdf2htmlEX-43e3174cbc/src -I/opt/local/include/poppler -I/opt/local/include/fontforge -I/opt/local/include  -pipe -Os -stdlib=libc++ -Wall -stdlib=libc++ -std=c++0x -O2 -DNDEBUG -arch x86_64 -mmacosx-version-min=10.13   -o CMakeFiles/pdf2htmlEX.dir/src/HTMLRenderer/link.cc.o -c /opt/local/var/macports/build/_opt_local_var_macports_sources_rsync.macports.org_macports_release_tarballs_ports_textproc_pdf2htmlex/pdf2htmlex/work/pdf2htmlEX-43e3174cbc/src/HTMLRenderer/link.cc
192:info:build /usr/bin/clang++   -I/opt/local/var/macports/build/_opt_local_var_macports_sources_rsync.macports.org_macports_release_tarballs_ports_textproc_pdf2htmlex/pdf2htmlex/work/pdf2htmlEX-43e3174cbc/src -I/opt/local/include/poppler -I/opt/local/include/fontforge -I/opt/local/include  -pipe -Os -stdlib=libc++ -Wall -stdlib=libc++ -std=c++0x -O2 -DNDEBUG -arch x86_64 -mmacosx-version-min=10.13   -o CMakeFiles/pdf2htmlEX.dir/src/HTMLRenderer/font.cc.o -c /opt/local/var/macports/build/_opt_local_var_macports_sources_rsync.macports.org_macports_release_tarballs_ports_textproc_pdf2htmlex/pdf2htmlex/work/pdf2htmlEX-43e3174cbc/src/HTMLRenderer/font.cc
193:info:build /usr/bin/clang++   -I/opt/local/var/macports/build/_opt_local_var_macports_sources_rsync.macports.org_macports_release_tarballs_ports_textproc_pdf2htmlex/pdf2htmlex/work/pdf2htmlEX-43e3174cbc/src -I/opt/local/include/poppler -I/opt/local/include/fontforge -I/opt/local/include  -pipe -Os -stdlib=libc++ -Wall -stdlib=libc++ -std=c++0x -O2 -DNDEBUG -arch x86_64 -mmacosx-version-min=10.13   -o CMakeFiles/pdf2htmlEX.dir/src/HTMLRenderer/image.cc.o -c /opt/local/var/macports/build/_opt_local_var_macports_sources_rsync.macports.org_macports_release_tarballs_ports_textproc_pdf2htmlex/pdf2htmlex/work/pdf2htmlEX-43e3174cbc/src/HTMLRenderer/image.cc
194:info:build /usr/bin/clang++   -I/opt/local/var/macports/build/_opt_local_var_macports_sources_rsync.macports.org_macports_release_tarballs_ports_textproc_pdf2htmlex/pdf2htmlex/work/pdf2htmlEX-43e3174cbc/src -I/opt/local/include/poppler -I/opt/local/include/fontforge -I/opt/local/include  -pipe -Os -stdlib=libc++ -Wall -stdlib=libc++ -std=c++0x -O2 -DNDEBUG -arch x86_64 -mmacosx-version-min=10.13   -o CMakeFiles/pdf2htmlEX.dir/src/HTMLRenderer/general.cc.o -c /opt/local/var/macports/build/_opt_local_var_macports_sources_rsync.macports.org_macports_release_tarballs_ports_textproc_pdf2htmlex/pdf2htmlex/work/pdf2htmlEX-43e3174cbc/src/HTMLRenderer/general.cc
195:info:build /usr/bin/clang++   -I/opt/local/var/macports/build/_opt_local_var_macports_sources_rsync.macports.org_macports_release_tarballs_ports_textproc_pdf2htmlex/pdf2htmlex/work/pdf2htmlEX-43e3174cbc/src -I/opt/local/include/poppler -I/opt/local/include/fontforge -I/opt/local/include  -pipe -Os -stdlib=libc++ -Wall -stdlib=libc++ -std=c++0x -O2 -DNDEBUG -arch x86_64 -mmacosx-version-min=10.13   -o CMakeFiles/pdf2htmlEX.dir/src/HTMLRenderer/draw.cc.o -c /opt/local/var/macports/build/_opt_local_var_macports_sources_rsync.macports.org_macports_release_tarballs_ports_textproc_pdf2htmlex/pdf2htmlex/work/pdf2htmlEX-43e3174cbc/src/HTMLRenderer/draw.cc
196:info:build Done.
197:info:build Building /opt/local/var/macports/build/_opt_local_var_macports_sources_rsync.macports.org_macports_release_tarballs_ports_textproc_pdf2htmlex/pdf2htmlex/work/pdf2htmlEX-43e3174cbc/share/fancy.min.css with YUI Compressor
198:info:build Done.
199:info:build [ 29%] Building CXX object CMakeFiles/pdf2htmlEX.dir/src/HTMLRenderer/outline.cc.o
200:info:build /usr/bin/clang++   -I/opt/local/var/macports/build/_opt_local_var_macports_sources_rsync.macports.org_macports_release_tarballs_ports_textproc_pdf2htmlex/pdf2htmlex/work/pdf2htmlEX-43e3174cbc/src -I/opt/local/include/poppler -I/opt/local/include/fontforge -I/opt/local/include  -pipe -Os -stdlib=libc++ -Wall -stdlib=libc++ -std=c++0x -O2 -DNDEBUG -arch x86_64 -mmacosx-version-min=10.13   -o CMakeFiles/pdf2htmlEX.dir/src/HTMLRenderer/outline.cc.o -c /opt/local/var/macports/build/_opt_local_var_macports_sources_rsync.macports.org_macports_release_tarballs_ports_textproc_pdf2htmlex/pdf2htmlex/work/pdf2htmlEX-43e3174cbc/src/HTMLRenderer/outline.cc
201:info:build In file included from /opt/local/var/macports/build/_opt_local_var_macports_sources_rsync.macports.org_macports_release_tarballs_ports_textproc_pdf2htmlex/pdf2htmlex/work/pdf2htmlEX-43e3174cbc/src/HTMLRenderer/image.cc:10:
202:info:build In file included from /opt/local/var/macports/build/_opt_local_var_macports_sources_rsync.macports.org_macports_release_tarballs_ports_textproc_pdf2htmlex/pdf2htmlex/work/pdf2htmlEX-43e3174cbc/src/HTMLRenderer/HTMLRenderer.h:27:
203:info:build /opt/local/var/macports/build/_opt_local_var_macports_sources_rsync.macports.org_macports_release_tarballs_ports_textproc_pdf2htmlex/pdf2htmlex/work/pdf2htmlEX-43e3174cbc/src/StringFormatter.h:37:12: warning: class 'GuardedPointer' was previously declared as a struct [-Wmismatched-tags]
204:info:build     friend class GuardedPointer;
205:info:build            ^
206:info:build /opt/local/var/macports/build/_opt_local_var_macports_sources_rsync.macports.org_macports_release_tarballs_ports_textproc_pdf2htmlex/pdf2htmlex/work/pdf2htmlEX-43e3174cbc/src/StringFormatter.h:19:12: note: previous use is here
207:info:build     struct GuardedPointer
208:info:build            ^
209:info:build /opt/local/var/macports/build/_opt_local_var_macports_sources_rsync.macports.org_macports_release_tarballs_ports_textproc_pdf2htmlex/pdf2htmlex/work/pdf2htmlEX-43e3174cbc/src/StringFormatter.h:37:12: note: did you mean struct here?
210:info:build     friend class GuardedPointer;
211:info:build            ^~~~~
212:info:build            struct
213:info:build In file included from /opt/local/var/macports/build/_opt_local_var_macports_sources_rsync.macports.org_macports_release_tarballs_ports_textproc_pdf2htmlex/pdf2htmlex/work/pdf2htmlEX-43e3174cbc/src/HTMLRenderer/draw.cc:16:
214:info:build In file included from /opt/local/var/macports/build/_opt_local_var_macports_sources_rsync.macports.org_macports_release_tarballs_ports_textproc_pdf2htmlex/pdf2htmlex/work/pdf2htmlEX-43e3174cbc/src/HTMLRenderer/HTMLRenderer.h:27:
215:info:build /opt/local/var/macports/build/_opt_local_var_macports_sources_rsync.macports.org_macports_release_tarballs_ports_textproc_pdf2htmlex/pdf2htmlex/work/pdf2htmlEX-43e3174cbc/src/StringFormatter.h:37:12: warning: class 'GuardedPointer' was previously declared as a struct [-Wmismatched-tags]
216:info:build     friend class GuardedPointer;
217:info:build            ^
218:info:build /opt/local/var/macports/build/_opt_local_var_macports_sources_rsync.macports.org_macports_release_tarballs_ports_textproc_pdf2htmlex/pdf2htmlex/work/pdf2htmlEX-43e3174cbc/src/StringFormatter.h:19:12: note: previous use is here
219:info:build     struct GuardedPointer
220:info:build            ^
221:info:build /opt/local/var/macports/build/_opt_local_var_macports_sources_rsync.macports.org_macports_release_tarballs_ports_textproc_pdf2htmlex/pdf2htmlex/work/pdf2htmlEX-43e3174cbc/src/StringFormatter.h:37:12: note: did you mean struct here?
222:info:build     friend class GuardedPointer;
223:info:build            ^~~~~
224:info:build            struct
225:info:build In file included from /opt/local/var/macports/build/_opt_local_var_macports_sources_rsync.macports.org_macports_release_tarballs_ports_textproc_pdf2htmlex/pdf2htmlex/work/pdf2htmlEX-43e3174cbc/src/HTMLRenderer/link.cc:16:
226:info:build In file included from /opt/local/var/macports/build/_opt_local_var_macports_sources_rsync.macports.org_macports_release_tarballs_ports_textproc_pdf2htmlex/pdf2htmlex/work/pdf2htmlEX-43e3174cbc/src/HTMLRenderer/HTMLRenderer.h:27:
227:info:build /opt/local/var/macports/build/_opt_local_var_macports_sources_rsync.macports.org_macports_release_tarballs_ports_textproc_pdf2htmlex/pdf2htmlex/work/pdf2htmlEX-43e3174cbc/src/StringFormatter.h:37:12: warning: class 'GuardedPointer' was previously declared as a struct [-Wmismatched-tags]
228:info:build     friend class GuardedPointer;
229:info:build            ^
230:info:build /opt/local/var/macports/build/_opt_local_var_macports_sources_rsync.macports.org_macports_release_tarballs_ports_textproc_pdf2htmlex/pdf2htmlex/work/pdf2htmlEX-43e3174cbc/src/StringFormatter.h:19:12: note: previous use is here
231:info:build     struct GuardedPointer
232:info:build            ^
233:info:build /opt/local/var/macports/build/_opt_local_var_macports_sources_rsync.macports.org_macports_release_tarballs_ports_textproc_pdf2htmlex/pdf2htmlex/work/pdf2htmlEX-43e3174cbc/src/StringFormatter.h:37:12: note: did you mean struct here?
234:info:build     friend class GuardedPointer;
235:info:build            ^~~~~
236:info:build            struct
237:info:build In file included from /opt/local/var/macports/build/_opt_local_var_macports_sources_rsync.macports.org_macports_release_tarballs_ports_textproc_pdf2htmlex/pdf2htmlex/work/pdf2htmlEX-43e3174cbc/src/HTMLRenderer/general.cc:18:
238:info:build In file included from /opt/local/var/macports/build/_opt_local_var_macports_sources_rsync.macports.org_macports_release_tarballs_ports_textproc_pdf2htmlex/pdf2htmlex/work/pdf2htmlEX-43e3174cbc/src/HTMLRenderer/HTMLRenderer.h:27:
239:info:build /opt/local/var/macports/build/_opt_local_var_macports_sources_rsync.macports.org_macports_release_tarballs_ports_textproc_pdf2htmlex/pdf2htmlex/work/pdf2htmlEX-43e3174cbc/src/StringFormatter.h:37:12: warning: class 'GuardedPointer' was previously declared as a struct [-Wmismatched-tags]
240:info:build     friend class GuardedPointer;
241:info:build            ^
242:info:build /opt/local/var/macports/build/_opt_local_var_macports_sources_rsync.macports.org_macports_release_tarballs_ports_textproc_pdf2htmlex/pdf2htmlex/work/pdf2htmlEX-43e3174cbc/src/StringFormatter.h:19:12: note: previous use is here
243:info:build     struct GuardedPointer
244:info:build            ^
245:info:build /opt/local/var/macports/build/_opt_local_var_macports_sources_rsync.macports.org_macports_release_tarballs_ports_textproc_pdf2htmlex/pdf2htmlex/work/pdf2htmlEX-43e3174cbc/src/StringFormatter.h:37:12: note: did you mean struct here?
246:info:build     friend class GuardedPointer;
247:info:build            ^~~~~
248:info:build            struct
249:info:build In file included from /opt/local/var/macports/build/_opt_local_var_macports_sources_rsync.macports.org_macports_release_tarballs_ports_textproc_pdf2htmlex/pdf2htmlex/work/pdf2htmlEX-43e3174cbc/src/pdf2htmlEX.cc:34:
250:info:build In file included from /opt/local/var/macports/build/_opt_local_var_macports_sources_rsync.macports.org_macports_release_tarballs_ports_textproc_pdf2htmlex/pdf2htmlex/work/pdf2htmlEX-43e3174cbc/src/HTMLRenderer/HTMLRenderer.h:27:
251:info:build /opt/local/var/macports/build/_opt_local_var_macports_sources_rsync.macports.org_macports_release_tarballs_ports_textproc_pdf2htmlex/pdf2htmlex/work/pdf2htmlEX-43e3174cbc/src/StringFormatter.h:37:12: warning: class 'GuardedPointer' was previously declared as a struct [-Wmismatched-tags]
252:info:build     friend class GuardedPointer;
253:info:build            ^
254:info:build /opt/local/var/macports/build/_opt_local_var_macports_sources_rsync.macports.org_macports_release_tarballs_ports_textproc_pdf2htmlex/pdf2htmlex/work/pdf2htmlEX-43e3174cbc/src/StringFormatter.h:19:12: note: previous use is here
255:info:build     struct GuardedPointer
256:info:build            ^
257:info:build /opt/local/var/macports/build/_opt_local_var_macports_sources_rsync.macports.org_macports_release_tarballs_ports_textproc_pdf2htmlex/pdf2htmlex/work/pdf2htmlEX-43e3174cbc/src/StringFormatter.h:37:12: note: did you mean struct here?
258:info:build     friend class GuardedPointer;
259:info:build            ^~~~~
260:info:build            struct
261:info:build In file included from /opt/local/var/macports/build/_opt_local_var_macports_sources_rsync.macports.org_macports_release_tarballs_ports_textproc_pdf2htmlex/pdf2htmlex/work/pdf2htmlEX-43e3174cbc/src/HTMLRenderer/font.cc:21:
262:info:build In file included from /opt/local/var/macports/build/_opt_local_var_macports_sources_rsync.macports.org_macports_release_tarballs_ports_textproc_pdf2htmlex/pdf2htmlex/work/pdf2htmlEX-43e3174cbc/src/HTMLRenderer/HTMLRenderer.h:27:
263:info:build /opt/local/var/macports/build/_opt_local_var_macports_sources_rsync.macports.org_macports_release_tarballs_ports_textproc_pdf2htmlex/pdf2htmlex/work/pdf2htmlEX-43e3174cbc/src/StringFormatter.h:37:12: warning: class 'GuardedPointer' was previously declared as a struct [-Wmismatched-tags]
264:info:build     friend class GuardedPointer;
265:info:build            ^
266:info:build /opt/local/var/macports/build/_opt_local_var_macports_sources_rsync.macports.org_macports_release_tarballs_ports_textproc_pdf2htmlex/pdf2htmlex/work/pdf2htmlEX-43e3174cbc/src/StringFormatter.h:19:12: note: previous use is here
267:info:build     struct GuardedPointer
268:info:build            ^
269:info:build /opt/local/var/macports/build/_opt_local_var_macports_sources_rsync.macports.org_macports_release_tarballs_ports_textproc_pdf2htmlex/pdf2htmlex/work/pdf2htmlEX-43e3174cbc/src/StringFormatter.h:37:12: note: did you mean struct here?
270:info:build     friend class GuardedPointer;
271:info:build            ^~~~~
272:info:build            struct
273:info:build In file included from /opt/local/var/macports/build/_opt_local_var_macports_sources_rsync.macports.org_macports_release_tarballs_ports_textproc_pdf2htmlex/pdf2htmlex/work/pdf2htmlEX-43e3174cbc/src/HTMLRenderer/image.cc:10:
274:info:build In file included from /opt/local/var/macports/build/_opt_local_var_macports_sources_rsync.macports.org_macports_release_tarballs_ports_textproc_pdf2htmlex/pdf2htmlex/work/pdf2htmlEX-43e3174cbc/src/HTMLRenderer/HTMLRenderer.h:33:
275:info:build /opt/local/var/macports/build/_opt_local_var_macports_sources_rsync.macports.org_macports_release_tarballs_ports_textproc_pdf2htmlex/pdf2htmlex/work/pdf2htmlEX-43e3174cbc/src/BackgroundRenderer/BackgroundRenderer.h:18:1: warning: class 'Param' was previously declared as a struct [-Wmismatched-tags]
276:info:build class Param;
277:info:build ^
278:info:build /opt/local/var/macports/build/_opt_local_var_macports_sources_rsync.macports.org_macports_release_tarballs_ports_textproc_pdf2htmlex/pdf2htmlex/work/pdf2htmlEX-43e3174cbc/src/Param.h:16:8: note: previous use is here
279:info:build struct Param
280:info:build        ^
281:info:build In file included from /opt/local/var/macports/build/_opt_local_var_macports_sources_rsync.macports.org_macports_release_tarballs_ports_textproc_pdf2htmlex/pdf2htmlex/work/pdf2htmlEX-43e3174cbc/src/HTMLRenderer/draw.cc:16:
282:info:build In file included from /opt/local/var/macports/build/_opt_local_var_macports_sources_rsync.macports.org_macports_release_tarballs_ports_textproc_pdf2htmlex/pdf2htmlex/work/pdf2htmlEX-43e3174cbc/src/HTMLRenderer/HTMLRenderer.h/opt/local/var/macports/build/_opt_local_var_macports_sources_rsync.macports.org_macports_release_tarballs_ports_textproc_pdf2htmlex/pdf2htmlex/work/pdf2htmlEX-43e3174cbc/src/BackgroundRenderer/BackgroundRenderer.h:18:1: note: did you mean struct here?
283:info:build class Param;
284:info:build ^~~~~
285:info:build struct
286:info:build :33:
287:info:build /opt/local/var/macports/build/_opt_local_var_macports_sources_rsync.macports.org_macports_release_tarballs_ports_textproc_pdf2htmlex/pdf2htmlex/work/pdf2htmlEX-43e3174cbc/src/BackgroundRenderer/BackgroundRenderer.h:18:1: warning: class 'Param' was previously declared as a struct [-Wmismatched-tags]
288:info:build class Param;
289:info:build ^
290:info:build /opt/local/var/macports/build/_opt_local_var_macports_sources_rsync.macports.org_macports_release_tarballs_ports_textproc_pdf2htmlex/pdf2htmlex/work/pdf2htmlEX-43e3174cbc/src/Param.h:16:8: note: previous use is here
291:info:build struct Param
292:info:build        ^
293:info:build /opt/local/var/macports/build/_opt_local_var_macports_sources_rsync.macports.org_macports_release_tarballs_ports_textproc_pdf2htmlex/pdf2htmlex/work/pdf2htmlEX-43e3174cbc/src/BackgroundRenderer/BackgroundRenderer.h:18:1: note: did you mean struct here?
294:info:build class Param;
295:info:build ^~~~~
296:info:build struct
297:info:build In file included from /opt/local/var/macports/build/_opt_local_var_macports_sources_rsync.macports.org_macports_release_tarballs_ports_textproc_pdf2htmlex/pdf2htmlex/work/pdf2htmlEX-43e3174cbc/src/HTMLRenderer/image.cc:10:
298:info:build /opt/local/var/macports/build/_opt_local_var_macports_sources_rsync.macports.org_macports_release_tarballs_ports_textproc_pdf2htmlex/pdf2htmlex/work/pdf2htmlEX-43e3174cbc/src/HTMLRenderer/HTMLRenderer.h:124:18: warning: 'pdf2htmlEX::HTMLRenderer::drawString' hides overloaded virtual function [-Woverloaded-virtual]
299:info:build     virtual void drawString(GfxState * state, GooString * s);
300:info:build                  ^
301:info:build /opt/local/include/poppler/OutputDev.h:270:16: note: hidden overloaded virtual function 'OutputDev::drawString' declared here: type mismatch at 2nd parameter ('const GooString *' vs 'GooString *')
302:info:build   virtual void drawString(GfxState * /*state*/, const GooString * /*s*/) {}
303:info:build                ^
304:info:build In file included from /opt/local/var/macports/build/_opt_local_var_macports_sources_rsync.macports.org_macports_release_tarballs_ports_textproc_pdf2htmlex/pdf2htmlex/work/pdf2htmlEX-43e3174cbc/src/HTMLRenderer/link.cc:16In file included from /opt/local/var/macports/build/_opt_local_var_macports_sources_rsync.macports.org_macports_release_tarballs_ports_textproc_pdf2htmlex/pdf2htmlex/work/pdf2htmlEX-43e3174cbc/src/HTMLRenderer/draw.cc:16:
305:info:build /opt/local/var/macports/build/_opt_local_var_macports_sources_rsync.macports.org_macports_release_tarballs_ports_textproc_pdf2htmlex/pdf2htmlex/work/pdf2htmlEX-43e3174cbc/src/HTMLRenderer/HTMLRenderer.h:124:18: warning: :
306:info:build In file included from /opt/local/var/macports/build/_opt_local_var_macports_sources_rsync.macports.org_macports_release_tarballs_ports_textproc_pdf2htmlex/pdf2htmlex/work/pdf2htmlEX-43e3174cbc/src/HTMLRenderer/HTMLRenderer.h'pdf2htmlEX::HTMLRenderer::drawString' hides overloaded virtual function [-Woverloaded-virtual]
307:info:build :33:
308:info:build /opt/local/var/macports/build/_opt_local_var_macports_sources_rsync.macports.org_macports_release_tarballs_ports_textproc_pdf2htmlex/pdf2htmlex/work/pdf2htmlEX-43e3174cbc/src/BackgroundRenderer/BackgroundRenderer.h:18:1: warning: class 'Param' was previously declared as a struct [-Wmismatched-tags]
309:info:build class Param;
310:info:build ^
311:info:build /opt/local/var/macports/build/_opt_local_var_macports_sources_rsync.macports.org_macports_release_tarballs_ports_textproc_pdf2htmlex/pdf2htmlex/work/pdf2htmlEX-43e3174cbc/src/Param.h:16:8: note: previous use is here
312:info:build struct Param
313:info:build        ^
314:info:build     virtual void drawString(GfxState * state, GooString * s);
315:info:build /opt/local/var/macports/build/_opt_local_var_macports_sources_rsync.macports.org_macports_release_tarballs_ports_textproc_pdf2htmlex/pdf2htmlex/work/pdf2htmlEX-43e3174cbc/src/BackgroundRenderer/BackgroundRenderer.h:18:1:                  ^note: did you mean struct here?
316:info:build class Param;
317:info:build ^~~~~
318:info:build struct
319:info:build /opt/local/include/poppler/OutputDev.h:270:16: note: hidden overloaded virtual function 'OutputDev::drawString' declared here: type mismatch at 2nd parameter ('const GooString *' vs 'GooString *')
320:info:build   virtual void drawString(GfxState * /*state*/, const GooString * /*s*/) {}
321:info:build                ^
322:info:build In file included from /opt/local/var/macports/build/_opt_local_var_macports_sources_rsync.macports.org_macports_release_tarballs_ports_textproc_pdf2htmlex/pdf2htmlex/work/pdf2htmlEX-43e3174cbc/src/HTMLRenderer/general.cc:18:
323:info:build In file included from /opt/local/var/macports/build/_opt_local_var_macports_sources_rsync.macports.org_macports_release_tarballs_ports_textproc_pdf2htmlex/pdf2htmlex/work/pdf2htmlEX-43e3174cbc/src/HTMLRenderer/HTMLRenderer.h:33:
324:info:build /opt/local/var/macports/build/_opt_local_var_macports_sources_rsync.macports.org_macports_release_tarballs_ports_textproc_pdf2htmlex/pdf2htmlex/work/pdf2htmlEX-43e3174cbc/src/BackgroundRenderer/BackgroundRenderer.h:18:1: warning: class 'Param' was previously declared as a struct [-Wmismatched-tags]
325:info:build class Param;
326:info:build ^
327:info:build /opt/local/var/macports/build/_opt_local_var_macports_sources_rsync.macports.org_macports_release_tarballs_ports_textproc_pdf2htmlex/pdf2htmlex/work/pdf2htmlEX-43e3174cbc/src/Param.h:16:8: note: previous use is here
328:info:build struct Param
329:info:build        ^
330:info:build /opt/local/var/macports/build/_opt_local_var_macports_sources_rsync.macports.org_macports_release_tarballs_ports_textproc_pdf2htmlex/pdf2htmlex/work/pdf2htmlEX-43e3174cbc/src/BackgroundRenderer/BackgroundRenderer.h:18:1: note: did you mean struct here?
331:info:build class Param;
332:info:build ^~~~~
333:info:build struct
334:info:build In file included from /opt/local/var/macports/build/_opt_local_var_macports_sources_rsync.macports.org_macports_release_tarballs_ports_textproc_pdf2htmlex/pdf2htmlex/work/pdf2htmlEX-43e3174cbc/src/HTMLRenderer/link.cc:16:
335:info:build /opt/local/var/macports/build/_opt_local_var_macports_sources_rsync.macports.org_macports_release_tarballs_ports_textproc_pdf2htmlex/pdf2htmlex/work/pdf2htmlEX-43e3174cbc/src/HTMLRenderer/HTMLRenderer.h:124:18: warning: 'pdf2htmlEX::HTMLRenderer::drawString' hides overloaded virtual function [-Woverloaded-virtual]
336:info:build     virtual void drawString(GfxState * state, GooString * s);
337:info:build                  ^
338:info:build /opt/local/include/poppler/OutputDev.h:270:16: note: hidden overloaded virtual function 'OutputDev::drawString' declared here: type mismatch at 2nd parameter ('const GooString *' vs 'GooString *')
339:info:build   virtual void drawString(GfxState * /*state*/, const GooString * /*s*/) {}
340:info:build                ^
341:info:build In file included from /opt/local/var/macports/build/_opt_local_var_macports_sources_rsync.macports.org_macports_release_tarballs_ports_textproc_pdf2htmlex/pdf2htmlex/work/pdf2htmlEX-43e3174cbc/src/pdf2htmlEX.cc:34:
342:info:build In file included from /opt/local/var/macports/build/_opt_local_var_macports_sources_rsync.macports.org_macports_release_tarballs_ports_textproc_pdf2htmlex/pdf2htmlex/work/pdf2htmlEX-43e3174cbc/src/HTMLRenderer/HTMLRenderer.h:33:
343:info:build /opt/local/var/macports/build/_opt_local_var_macports_sources_rsync.macports.org_macports_release_tarballs_ports_textproc_pdf2htmlex/pdf2htmlex/work/pdf2htmlEX-43e3174cbc/src/BackgroundRenderer/BackgroundRenderer.h:18:1: warning: class 'Param' was previously declared as a struct [-Wmismatched-tags]
344:info:build class Param;
345:info:build ^
346:info:build /opt/local/var/macports/build/_opt_local_var_macports_sources_rsync.macports.org_macports_release_tarballs_ports_textproc_pdf2htmlex/pdf2htmlex/work/pdf2htmlEX-43e3174cbc/src/Param.h:16:8: note: previous use is here
347:info:build struct Param
348:info:build        ^
349:info:build /opt/local/var/macports/build/_opt_local_var_macports_sources_rsync.macports.org_macports_release_tarballs_ports_textproc_pdf2htmlex/pdf2htmlex/work/pdf2htmlEX-43e3174cbc/src/BackgroundRenderer/BackgroundRenderer.h:18:1: note: did you mean struct here?
350:info:build class Param;
351:info:build ^~~~~
352:info:build struct
353:info:build In file included from /opt/local/var/macports/build/_opt_local_var_macports_sources_rsync.macports.org_macports_release_tarballs_ports_textproc_pdf2htmlex/pdf2htmlex/work/pdf2htmlEX-43e3174cbc/src/HTMLRenderer/font.cc:21:
354:info:build In file included from /opt/local/var/macports/build/_opt_local_var_macports_sources_rsync.macports.org_macports_release_tarballs_ports_textproc_pdf2htmlex/pdf2htmlex/work/pdf2htmlEX-43e3174cbc/src/HTMLRenderer/general.cc:18In file included from /opt/local/var/macports/build/_opt_local_var_macports_sources_rsync.macports.org_macports_release_tarballs_ports_textproc_pdf2htmlex/pdf2htmlex/work/pdf2htmlEX-43e3174cbc/src/HTMLRenderer/HTMLRenderer.h:33:
355:info:build /opt/local/var/macports/build/_opt_local_var_macports_sources_rsync.macports.org_macports_release_tarballs_ports_textproc_pdf2htmlex/pdf2htmlex/work/pdf2htmlEX-43e3174cbc/src/BackgroundRenderer/BackgroundRenderer.h:18:1: warning: class 'Param' was previously declared as a struct [-Wmismatched-tags]
356:info:build class Param;
357:info:build ^
358:info:build /opt/local/var/macports/build/_opt_local_var_macports_sources_rsync.macports.org_macports_release_tarballs_ports_textproc_pdf2htmlex/pdf2htmlex/work/pdf2htmlEX-43e3174cbc/src/Param.h:16:8::
359:info:build /opt/local/var/macports/build/_opt_local_var_macports_sources_rsync.macports.org_macports_release_tarballs_ports_textproc_pdf2htmlex/pdf2htmlex/work/pdf2htmlEX-43e3174cbc/src/HTMLRenderer/HTMLRenderer.h:124:18: note: previous use is here
360:info:build struct Param warning: 'pdf2htmlEX::HTMLRenderer::drawString' hides overloaded virtual function [-Woverloaded-virtual]
361:info:build     virtual void drawString(GfxState * state, GooString * s);
362:info:build                  ^
363:info:build /opt/local/include/poppler/OutputDev.h:270:16: note: hidden overloaded virtual function 'OutputDev::drawString' declared here: type mismatch at 2nd parameter ('const GooString *' vs 'GooString *')
364:info:build   virtual void drawString(GfxState * /*state*/, const GooString * /*s*/) {}
365:info:build                ^
366:info:build        ^
367:info:build /opt/local/var/macports/build/_opt_local_var_macports_sources_rsync.macports.org_macports_release_tarballs_ports_textproc_pdf2htmlex/pdf2htmlex/work/pdf2htmlEX-43e3174cbc/src/BackgroundRenderer/BackgroundRenderer.h:18:1: note: did you mean struct here?
368:info:build class Param;
369:info:build ^~~~~
370:info:build struct
371:info:build In file included from /opt/local/var/macports/build/_opt_local_var_macports_sources_rsync.macports.org_macports_release_tarballs_ports_textproc_pdf2htmlex/pdf2htmlex/work/pdf2htmlEX-43e3174cbc/src/pdf2htmlEX.cc:34:
372:info:build /opt/local/var/macports/build/_opt_local_var_macports_sources_rsync.macports.org_macports_release_tarballs_ports_textproc_pdf2htmlex/pdf2htmlex/work/pdf2htmlEX-43e3174cbc/src/HTMLRenderer/HTMLRenderer.h:124:18: warning: 'pdf2htmlEX::HTMLRenderer::drawString' hides overloaded virtual function [-Woverloaded-virtual]
373:info:build     virtual void drawString(GfxState * state, GooString * s);
374:info:build                  ^
375:info:build /opt/local/include/poppler/OutputDev.h:270:16: note: hidden overloaded virtual function 'OutputDev::drawString' declared here: type mismatch at 2nd parameter ('const GooString *' vs 'GooString *')
376:info:build   virtual void drawString(GfxState * /*state*/, const GooString * /*s*/) {}
377:info:build                ^
378:info:build In file included from /opt/local/var/macports/build/_opt_local_var_macports_sources_rsync.macports.org_macports_release_tarballs_ports_textproc_pdf2htmlex/pdf2htmlex/work/pdf2htmlEX-43e3174cbc/src/HTMLRenderer/font.cc:21:
379:info:build /opt/local/var/macports/build/_opt_local_var_macports_sources_rsync.macports.org_macports_release_tarballs_ports_textproc_pdf2htmlex/pdf2htmlex/work/pdf2htmlEX-43e3174cbc/src/HTMLRenderer/HTMLRenderer.h:124:18: warning: 'pdf2htmlEX::HTMLRenderer::drawString' hides overloaded virtual function [-Woverloaded-virtual]
380:info:build     virtual void drawString(GfxState * state, GooString * s);
381:info:build                  ^
382:info:build /opt/local/include/poppler/OutputDev.h:270:16: note: hidden overloaded virtual function 'OutputDev::drawString' declared here: type mismatch at 2nd parameter ('const GooString *' vs 'GooString *')
383:info:build   virtual void drawString(GfxState * /*state*/, const GooString * /*s*/) {}
384:info:build                ^
385:info:build /opt/local/var/macports/build/_opt_local_var_macports_sources_rsync.macports.org_macports_release_tarballs_ports_textproc_pdf2htmlex/pdf2htmlex/work/pdf2htmlEX-43e3174cbc/src/HTMLRenderer/font.cc:70:17: error: no member named 'initRef' in 'Object'
386:info:build         ref_obj.initRef(id->num, id->gen);
387:info:build         ~~~~~~~ ^
388:info:build /opt/local/var/macports/build/_opt_local_var_macports_sources_rsync.macports.org_macports_release_tarballs_ports_textproc_pdf2htmlex/pdf2htmlex/work/pdf2htmlEX-43e3174cbc/src/HTMLRenderer/font.cc:71:29: error: cannot initialize a parameter of type 'int' with an rvalue of type 'Object *'
389:info:build         ref_obj.fetch(xref, &font_obj);
390:info:build                             ^~~~~~~~~
391:info:build /opt/local/include/poppler/Object.h:194:32: note: passing argument to parameter 'recursion' here
392:info:build   Object fetch(XRef *xref, int recursion = 0) const;
393:info:build                                ^
394:info:build /opt/local/var/macports/build/_opt_local_var_macports_sources_rsync.macports.org_macports_release_tarballs_ports_textproc_pdf2htmlex/pdf2htmlex/work/pdf2htmlEX-43e3174cbc/src/HTMLRenderer/font.cc:72:17: error: 'free' is a private member of 'Object'
395:info:build         ref_obj.free();
396:info:build                 ^
397:info:build /opt/local/include/poppler/Object.h:301:8: note: declared private here
398:info:build   void free();
399:info:build        ^
400:info:build /opt/local/var/macports/build/_opt_local_var_macports_sources_rsync.macports.org_macports_release_tarballs_ports_textproc_pdf2htmlex/pdf2htmlex/work/pdf2htmlEX-43e3174cbc/src/HTMLRenderer/font.cc:81:44: error: cannot initialize a parameter of type 'int' with an rvalue of type 'Object *'
401:info:build         if(dict->lookup("DescendantFonts", &font_obj2)->isArray())
402:info:build                                            ^~~~~~~~~~
403:info:build /opt/local/include/poppler/Dict.h:81:38: note: passing argument to parameter 'recursion' here
404:info:build   Object lookup(const char *key, int recursion = 0) const;
405:info:build                                      ^
406:info:build /opt/local/var/macports/build/_opt_local_var_macports_sources_rsync.macports.org_macports_release_tarballs_ports_textproc_pdf2htmlex/pdf2htmlex/work/pdf2htmlEX-43e3174cbc/src/HTMLRenderer/font.cc:92:42: error: cannot initialize a parameter of type 'int' with an rvalue of type 'Object *'
407:info:build                 if(font_obj2.arrayGet(0, &obj2)->isDict())
408:info:build                                          ^~~~~
409:info:build /opt/local/include/poppler/Object.h:341:43: note: passing argument to parameter 'recursion' here
410:info:build inline Object Object::arrayGet(int i, int recursion = 0) const
411:info:build                                           ^
412:info:build /opt/local/var/macports/build/_opt_local_var_macports_sources_rsync.macports.org_macports_release_tarballs_ports_textproc_pdf2htmlex/pdf2htmlex/work/pdf2htmlEX-43e3174cbc/src/HTMLRenderer/font.cc:99:44: error: cannot initialize a parameter of type 'int' with an rvalue of type 'Object *'
413:info:build         if(!dict->lookup("FontDescriptor", &fontdesc_obj)->isDict())
414:info:build                                            ^~~~~~~~~~~~~
415:info:build /opt/local/include/poppler/Dict.h:81:38: note: passing argument to parameter 'recursion' here
416:info:build   Object lookup(const char *key, int recursion = 0) const;
417:info:build                                      ^
418:info:build /opt/local/var/macports/build/_opt_local_var_macports_sources_rsync.macports.org_macports_release_tarballs_ports_textproc_pdf2htmlex/pdf2htmlex/work/pdf2htmlEX-43e3174cbc/src/HTMLRenderer/font.cc:107:38: error: cannot initialize a parameter of type 'int' with an rvalue of type 'Object *'
419:info:build         if(dict->lookup("FontFile3", &obj)->isStream())
420:info:build                                      ^~~~
421:info:build /opt/local/include/poppler/Dict.h:81:38: note: passing argument to parameter 'recursion' here
422:info:build   Object lookup(const char *key, int recursion = 0) const;
423:info:build                                      ^
424:info:build /opt/local/var/macports/build/_opt_local_var_macports_sources_rsync.macports.org_macports_release_tarballs_ports_textproc_pdf2htmlex/pdf2htmlex/work/pdf2htmlEX-43e3174cbc/src/HTMLRenderer/font.cc:109:55: error: cannot initialize a parameter of type 'int' with an rvalue of type 'Object *'
425:info:build             if(obj.streamGetDict()->lookup("Subtype", &obj1)->isName())
426:info:build                                                       ^~~~~
427:info:build /opt/local/include/poppler/Dict.h:81:38: note: passing argument to parameter 'recursion' here
428:info:build   Object lookup(const char *key, int recursion = 0) const;
429:info:build                                      ^
430:info:build /opt/local/var/macports/build/_opt_local_var_macports_sources_rsync.macports.org_macports_release_tarballs_ports_textproc_pdf2htmlex/pdf2htmlex/work/pdf2htmlEX-43e3174cbc/src/HTMLRenderer/font.cc:132:44: error: cannot initialize a parameter of type 'int' with an rvalue of type 'Object *'
431:info:build         else if (dict->lookup("FontFile2", &obj)->isStream())
432:info:build                                            ^~~~
433:info:build /opt/local/include/poppler/Dict.h:81:38: note: passing argument to parameter 'recursion' here
434:info:build   Object lookup(const char *key, int recursion = 0) const;
435:info:build                                      ^
436:info:build /opt/local/var/macports/build/_opt_local_var_macports_sources_rsync.macports.org_macports_release_tarballs_ports_textproc_pdf2htmlex/pdf2htmlex/work/pdf2htmlEX-43e3174cbc/src/HTMLRenderer/font.cc:136:43: error: cannot initialize a parameter of type 'int' with an rvalue of type 'Object *'
437:info:build         else if (dict->lookup("FontFile", &obj)->isStream())
438:info:build                                           ^~~~
439:info:build /opt/local/include/poppler/Dict.h:81:38: note: passing argument to parameter 'recursion' here
440:info:build   Object lookup(const char *key, int recursion = 0) const;
441:info:build                                      ^
442:info:build /opt/local/var/macports/build/_opt_local_var_macports_sources_rsync.macports.org_macports_release_tarballs_ports_textproc_pdf2htmlex/pdf2htmlex/work/pdf2htmlEX-43e3174cbc/src/HTMLRenderer/font.cc:174:10: error: 'free' is a private member of 'Object'
443:info:build     obj2.free();
444:info:build          ^
445:info:build /opt/local/include/poppler/Object.h:301:8: note: declared private here
446:info:build   void free();
447:info:build        ^
448:info:build /opt/local/var/macports/build/_opt_local_var_macports_sources_rsync.macports.org_macports_release_tarballs_ports_textproc_pdf2htmlex/pdf2htmlex/work/pdf2htmlEX-43e3174cbc/src/HTMLRenderer/font.cc:175:10: error: 'free' is a private member of 'Object'
449:info:build     obj1.free();
450:info:build          ^
451:info:build /opt/local/include/poppler/Object.h:301:8: note: declared private here
452:info:build   void free();
453:info:build        ^
454:info:build /opt/local/var/macports/build/_opt_local_var_macports_sources_rsync.macports.org_macports_release_tarballs_ports_textproc_pdf2htmlex/pdf2htmlex/work/pdf2htmlEX-43e3174cbc/src/HTMLRenderer/font.cc:176:9: error: 'free' is a private member of 'Object'
455:info:build     obj.free();
456:info:build         ^
457:info:build /opt/local/include/poppler/Object.h:301:8: note: declared private here
458:info:build   void free();
459:info:build        ^
460:info:build /opt/local/var/macports/build/_opt_local_var_macports_sources_rsync.macports.org_macports_release_tarballs_ports_textproc_pdf2htmlex/pdf2htmlex/work/pdf2htmlEX-43e3174cbc/src/HTMLRenderer/font.cc:178:18: error: 'free' is a private member of 'Object'
461:info:build     fontdesc_obj.free();
462:info:build                  ^
463:info:build /opt/local/include/poppler/Object.h:301:8: note: declared private here
464:info:build   void free();
465:info:build        ^
466:info:build /opt/local/var/macports/build/_opt_local_var_macports_sources_rsync.macports.org_macports_release_tarballs_ports_textproc_pdf2htmlex/pdf2htmlex/work/pdf2htmlEX-43e3174cbc/src/HTMLRenderer/font.cc:179:15: error: 'free' is a private member of 'Object'
467:info:build     font_obj2.free();
468:info:build               ^
469:info:build /opt/local/include/poppler/Object.h:301:8: note: declared private here
470:info:build   void free();
471:info:build        ^
472:info:build /opt/local/var/macports/build/_opt_local_var_macports_sources_rsync.macports.org_macports_release_tarballs_ports_textproc_pdf2htmlex/pdf2htmlex/work/pdf2htmlEX-43e3174cbc/src/HTMLRenderer/font.cc:180:14: error: 'free' is a private member of 'Object'
473:info:build     font_obj.free();
474:info:build              ^
475:info:build /opt/local/include/poppler/Object.h:301:8: note: declared private here
476:info:build   void free();
477:info:build        ^
478:info:build /opt/local/var/macports/build/_opt_local_var_macports_sources_rsync.macports.org_macports_release_tarballs_ports_textproc_pdf2htmlex/pdf2htmlex/work/pdf2htmlEX-43e3174cbc/src/HTMLRenderer/font.cc:622:32: error: member function 'mapToUnicode' not viable: 'this' argument has type 'const CharCodeToUnicode', but function is not marked const
479:info:build                 int n = ctu ? (ctu->mapToUnicode(cur_code, &pu)) : 0;
480:info:build                                ^~~
481:info:build /opt/local/include/poppler/CharCodeToUnicode.h:98:7: note: 'mapToUnicode' declared here
482:info:build   int mapToUnicode(CharCode c, Unicode **u);
483:info:build       ^
484:info:build /opt/local/var/macports/build/_opt_local_var_macports_sources_rsync.macports.org_macports_release_tarballs_ports_textproc_pdf2htmlex/pdf2htmlex/work/pdf2htmlEX-43e3174cbc/src/HTMLRenderer/font.cc:744:13: error: member function 'decRefCnt' not viable: 'this' argument has type 'const CharCodeToUnicode', but function is not marked const
485:info:build             ctu->decRefCnt();
486:info:build             ^~~
487:info:build /opt/local/include/poppler/CharCodeToUnicode.h:87:8: note: 'decRefCnt' declared here
488:info:build   void decRefCnt();
489:info:build        ^
490:info:build 3 warnings generated.
491:info:build [ 32%] Building CXX object CMakeFiles/pdf2htmlEX.dir/src/HTMLRenderer/state.cc.o
492:info:build /usr/bin/clang++   -I/opt/local/var/macports/build/_opt_local_var_macports_sources_rsync.macports.org_macports_release_tarballs_ports_textproc_pdf2htmlex/pdf2htmlex/work/pdf2htmlEX-43e3174cbc/src -I/opt/local/include/poppler -I/opt/local/include/fontforge -I/opt/local/include  -pipe -Os -stdlib=libc++ -Wall -stdlib=libc++ -std=c++0x -O2 -DNDEBUG -arch x86_64 -mmacosx-version-min=10.13   -o CMakeFiles/pdf2htmlEX.dir/src/HTMLRenderer/state.cc.o -c /opt/local/var/macports/build/_opt_local_var_macports_sources_rsync.macports.org_macports_release_tarballs_ports_textproc_pdf2htmlex/pdf2htmlex/work/pdf2htmlEX-43e3174cbc/src/HTMLRenderer/state.cc
493:info:build In file included from /opt/local/var/macports/build/_opt_local_var_macports_sources_rsync.macports.org_macports_release_tarballs_ports_textproc_pdf2htmlex/pdf2htmlex/work/pdf2htmlEX-43e3174cbc/src/HTMLRenderer/outline.cc:15:
494:info:build In file included from /opt/local/var/macports/build/_opt_local_var_macports_sources_rsync.macports.org_macports_release_tarballs_ports_textproc_pdf2htmlex/pdf2htmlex/work/pdf2htmlEX-43e3174cbc/src/HTMLRenderer/HTMLRenderer.h:27:
495:info:build /opt/local/var/macports/build/_opt_local_var_macports_sources_rsync.macports.org_macports_release_tarballs_ports_textproc_pdf2htmlex/pdf2htmlex/work/pdf2htmlEX-43e3174cbc/src/StringFormatter.h:37:12: warning: class 'GuardedPointer' was previously declared as a struct [-Wmismatched-tags]
496:info:build     friend class GuardedPointer;
497:info:build            ^
498:info:build /opt/local/var/macports/build/_opt_local_var_macports_sources_rsync.macports.org_macports_release_tarballs_ports_textproc_pdf2htmlex/pdf2htmlex/work/pdf2htmlEX-43e3174cbc/src/StringFormatter.h:19:12: note: previous use is here
499:info:build     struct GuardedPointer
500:info:build            ^
501:info:build /opt/local/var/macports/build/_opt_local_var_macports_sources_rsync.macports.org_macports_release_tarballs_ports_textproc_pdf2htmlex/pdf2htmlex/work/pdf2htmlEX-43e3174cbc/src/StringFormatter.h:37:12: note: did you mean struct here?
502:info:build     friend class GuardedPointer;
503:info:build            ^~~~~
504:info:build            struct
505:info:build 3 warnings and 18 errors generated.
506:info:build make[2]: *** [CMakeFiles/pdf2htmlEX.dir/src/HTMLRenderer/font.cc.o] Error 1
507:info:build make[2]: *** Waiting for unfinished jobs....
508:info:build In file included from /opt/local/var/macports/build/_opt_local_var_macports_sources_rsync.macports.org_macports_release_tarballs_ports_textproc_pdf2htmlex/pdf2htmlex/work/pdf2htmlEX-43e3174cbc/src/HTMLRenderer/outline.cc:15:
509:info:build In file included from /opt/local/var/macports/build/_opt_local_var_macports_sources_rsync.macports.org_macports_release_tarballs_ports_textproc_pdf2htmlex/pdf2htmlex/work/pdf2htmlEX-43e3174cbc/src/HTMLRenderer/HTMLRenderer.h:33:
510:info:build /opt/local/var/macports/build/_opt_local_var_macports_sources_rsync.macports.org_macports_release_tarballs_ports_textproc_pdf2htmlex/pdf2htmlex/work/pdf2htmlEX-43e3174cbc/src/BackgroundRenderer/BackgroundRenderer.h:18:1: warning: class 'Param' was previously declared as a struct [-Wmismatched-tags]
511:info:build class Param;
512:info:build ^
513:info:build /opt/local/var/macports/build/_opt_local_var_macports_sources_rsync.macports.org_macports_release_tarballs_ports_textproc_pdf2htmlex/pdf2htmlex/work/pdf2htmlEX-43e3174cbc/src/Param.h:16:8: note: previous use is here
514:info:build struct Param
515:info:build        ^
516:info:build /opt/local/var/macports/build/_opt_local_var_macports_sources_rsync.macports.org_macports_release_tarballs_ports_textproc_pdf2htmlex/pdf2htmlex/work/pdf2htmlEX-43e3174cbc/src/BackgroundRenderer/BackgroundRenderer.h:18:1: note: did you mean struct here?
517:info:build class Param;
518:info:build ^~~~~
519:info:build struct
520:info:build In file included from /opt/local/var/macports/build/_opt_local_var_macports_sources_rsync.macports.org_macports_release_tarballs_ports_textproc_pdf2htmlex/pdf2htmlex/work/pdf2htmlEX-43e3174cbc/src/HTMLRenderer/outline.cc:15:
521:info:build /opt/local/var/macports/build/_opt_local_var_macports_sources_rsync.macports.org_macports_release_tarballs_ports_textproc_pdf2htmlex/pdf2htmlex/work/pdf2htmlEX-43e3174cbc/src/HTMLRenderer/HTMLRenderer.h:124:18: warning: 'pdf2htmlEX::HTMLRenderer::drawString' hides overloaded virtual function [-Woverloaded-virtual]
522:info:build     virtual void drawString(GfxState * state, GooString * s);
523:info:build                  ^
524:info:build /opt/local/include/poppler/OutputDev.h:270:16: note: hidden overloaded virtual function 'OutputDev::drawString' declared here: type mismatch at 2nd parameter ('const GooString *' vs 'GooString *')
525:info:build   virtual void drawString(GfxState * /*state*/, const GooString * /*s*/) {}
526:info:build                ^
527:info:build /opt/local/var/macports/build/_opt_local_var_macports_sources_rsync.macports.org_macports_release_tarballs_ports_textproc_pdf2htmlex/pdf2htmlex/work/pdf2htmlEX-43e3174cbc/src/HTMLRenderer/outline.cc:36:42: error: cannot initialize a parameter of type 'LinkAction *' with an rvalue of type 'const LinkAction *'
528:info:build         string dest = get_linkaction_str(item->getAction(), detail);
529:info:build                                          ^~~~~~~~~~~~~~~~~
530:info:build /opt/local/var/macports/build/_opt_local_var_macports_sources_rsync.macports.org_macports_release_tarballs_ports_textproc_pdf2htmlex/pdf2htmlex/work/pdf2htmlEX-43e3174cbc/src/HTMLRenderer/HTMLRenderer.h:153:48: note: passing argument to parameter here
531:info:build     std::string get_linkaction_str(LinkAction *, std::string & detail);
532:info:build                                                ^
533:info:build /opt/local/var/macports/build/_opt_local_var_macports_sources_rsync.macports.org_macports_release_tarballs_ports_textproc_pdf2htmlex/pdf2htmlex/work/pdf2htmlEX-43e3174cbc/src/HTMLRenderer/outline.cc:56:35: error: cannot initialize a parameter of type 'GooList *' with an rvalue of type 'const GooList *'
534:info:build             process_outline_items(item->getKids());
535:info:build                                   ^~~~~~~~~~~~~~~
536:info:build /opt/local/var/macports/build/_opt_local_var_macports_sources_rsync.macports.org_macports_release_tarballs_ports_textproc_pdf2htmlex/pdf2htmlex/work/pdf2htmlEX-43e3174cbc/src/HTMLRenderer/outline.cc:24:52: note: passing argument to parameter 'items' here
537:info:build void HTMLRenderer::process_outline_items(GooList * items)
538:info:build                                                    ^
539:info:build /opt/local/var/macports/build/_opt_local_var_macports_sources_rsync.macports.org_macports_release_tarballs_ports_textproc_pdf2htmlex/pdf2htmlex/work/pdf2htmlEX-43e3174cbc/src/HTMLRenderer/outline.cc:71:27: error: cannot initialize a parameter of type 'GooList *' with an rvalue of type 'const GooList *'
540:info:build     process_outline_items(outline->getItems());
541:info:build                           ^~~~~~~~~~~~~~~~~~~
542:info:build /opt/local/var/macports/build/_opt_local_var_macports_sources_rsync.macports.org_macports_release_tarballs_ports_textproc_pdf2htmlex/pdf2htmlex/work/pdf2htmlEX-43e3174cbc/src/HTMLRenderer/outline.cc:24:52: note: passing argument to parameter 'items' here
543:info:build void HTMLRenderer::process_outline_items(GooList * items)
544:info:build                                                    ^
545:info:build 3 warnings and 3 errors generated.
546:info:build make[2]: *** [CMakeFiles/pdf2htmlEX.dir/src/HTMLRenderer/outline.cc.o] Error 1
547:info:build 3 warnings generated.
548:info:build 3 warnings generated.
549:info:build In file included from /opt/local/var/macports/build/_opt_local_var_macports_sources_rsync.macports.org_macports_release_tarballs_ports_textproc_pdf2htmlex/pdf2htmlex/work/pdf2htmlEX-43e3174cbc/src/HTMLRenderer/state.cc:12:
550:info:build In file included from /opt/local/var/macports/build/_opt_local_var_macports_sources_rsync.macports.org_macports_release_tarballs_ports_textproc_pdf2htmlex/pdf2htmlex/work/pdf2htmlEX-43e3174cbc/src/HTMLRenderer/HTMLRenderer.h:27:
551:info:build /opt/local/var/macports/build/_opt_local_var_macports_sources_rsync.macports.org_macports_release_tarballs_ports_textproc_pdf2htmlex/pdf2htmlex/work/pdf2htmlEX-43e3174cbc/src/StringFormatter.h:37:12: warning: class 'GuardedPointer' was previously declared as a struct [-Wmismatched-tags]
552:info:build     friend class GuardedPointer;
553:info:build            ^
554:info:build /opt/local/var/macports/build/_opt_local_var_macports_sources_rsync.macports.org_macports_release_tarballs_ports_textproc_pdf2htmlex/pdf2htmlex/work/pdf2htmlEX-43e3174cbc/src/StringFormatter.h:19:12: note: previous use is here
555:info:build     struct GuardedPointer
556:info:build            ^
557:info:build /opt/local/var/macports/build/_opt_local_var_macports_sources_rsync.macports.org_macports_release_tarballs_ports_textproc_pdf2htmlex/pdf2htmlex/work/pdf2htmlEX-43e3174cbc/src/StringFormatter.h:37:12: note: did you mean struct here?
558:info:build     friend class GuardedPointer;
559:info:build            ^~~~~
560:info:build            struct
561:info:build In file included from /opt/local/var/macports/build/_opt_local_var_macports_sources_rsync.macports.org_macports_release_tarballs_ports_textproc_pdf2htmlex/pdf2htmlex/work/pdf2htmlEX-43e3174cbc/src/HTMLRenderer/state.cc:12:
562:info:build In file included from /opt/local/var/macports/build/_opt_local_var_macports_sources_rsync.macports.org_macports_release_tarballs_ports_textproc_pdf2htmlex/pdf2htmlex/work/pdf2htmlEX-43e3174cbc/src/HTMLRenderer/HTMLRenderer.h:33:
563:info:build /opt/local/var/macports/build/_opt_local_var_macports_sources_rsync.macports.org_macports_release_tarballs_ports_textproc_pdf2htmlex/pdf2htmlex/work/pdf2htmlEX-43e3174cbc/src/BackgroundRenderer/BackgroundRenderer.h:18:1: warning: class 'Param' was previously declared as a struct [-Wmismatched-tags]
564:info:build class Param;
565:info:build ^
566:info:build /opt/local/var/macports/build/_opt_local_var_macports_sources_rsync.macports.org_macports_release_tarballs_ports_textproc_pdf2htmlex/pdf2htmlex/work/pdf2htmlEX-43e3174cbc/src/Param.h:16:8: note: previous use is here
567:info:build struct Param
568:info:build        ^
569:info:build /opt/local/var/macports/build/_opt_local_var_macports_sources_rsync.macports.org_macports_release_tarballs_ports_textproc_pdf2htmlex/pdf2htmlex/work/pdf2htmlEX-43e3174cbc/src/BackgroundRenderer/BackgroundRenderer.h:18:1: note: did you mean struct here?
570:info:build class Param;
571:info:build ^~~~~
572:info:build struct
573:info:build In file included from /opt/local/var/macports/build/_opt_local_var_macports_sources_rsync.macports.org_macports_release_tarballs_ports_textproc_pdf2htmlex/pdf2htmlex/work/pdf2htmlEX-43e3174cbc/src/HTMLRenderer/state.cc:12:
574:info:build /opt/local/var/macports/build/_opt_local_var_macports_sources_rsync.macports.org_macports_release_tarballs_ports_textproc_pdf2htmlex/pdf2htmlex/work/pdf2htmlEX-43e3174cbc/src/HTMLRenderer/HTMLRenderer.h:124:18: warning: 'pdf2htmlEX::HTMLRenderer::drawString' hides overloaded virtual function [-Woverloaded-virtual]
575:info:build     virtual void drawString(GfxState * state, GooString * s);
576:info:build                  ^
577:info:build /opt/local/include/poppler/OutputDev.h:270:16: note: hidden overloaded virtual function 'OutputDev::drawString' declared here: type mismatch at 2nd parameter ('const GooString *' vs 'GooString *')
578:info:build   virtual void drawString(GfxState * /*state*/, const GooString * /*s*/) {}
579:info:build                ^
580:info:build 3 warnings generated.
581:info:build 3 warnings generated.
582:info:build Done.
583:info:build make[2]: Leaving directory `/opt/local/var/macports/build/_opt_local_var_macports_sources_rsync.macports.org_macports_release_tarballs_ports_textproc_pdf2htmlex/pdf2htmlex/work/build'
584:info:build [ 32%] Built target pdf2htmlEX_resources
585:info:build 3 warnings generated.
586:info:build make[2]: Leaving directory `/opt/local/var/macports/build/_opt_local_var_macports_sources_rsync.macports.org_macports_release_tarballs_ports_textproc_pdf2htmlex/pdf2htmlex/work/build'
587:info:build make[1]: *** [CMakeFiles/pdf2htmlEX.dir/all] Error 2
588:info:build make[1]: Leaving directory `/opt/local/var/macports/build/_opt_local_var_macports_sources_rsync.macports.org_macports_release_tarballs_ports_textproc_pdf2htmlex/pdf2htmlex/work/build'
589:info:build make: *** [all] Error 2
590:info:build make: Leaving directory `/opt/local/var/macports/build/_opt_local_var_macports_sources_rsync.macports.org_macports_release_tarballs_ports_textproc_pdf2htmlex/pdf2htmlex/work/build'
591:info:build Command failed:  cd "/opt/local/var/macports/build/_opt_local_var_macports_sources_rsync.macports.org_macports_release_tarballs_ports_textproc_pdf2htmlex/pdf2htmlex/work/build" && /usr/bin/make -j8 -w all VERBOSE=ON
592:info:build Exit code: 2
593:error:build Failed to build pdf2htmlex: command execution failed
594:debug:build Error code: CHILDSTATUS 10827 2
595:debug:build Backtrace: command execution failed
596:debug:build     while executing
597:debug:build "system {*}$notty {*}$nice $fullcmdstring"
598:debug:build     invoked from within
599:debug:build "command_exec build"
600:debug:build     (procedure "portbuild::build_main" line 8)
601:debug:build     invoked from within
602:debug:build "$procedure $targetname"
603:error:build See /opt/local/var/macports/logs/_opt_local_var_macports_sources_rsync.macports.org_macports_release_tarballs_ports_textproc_pdf2htmlex/pdf2htmlex/main.log for details.
604version:1
605:debug:sysinfo macOS 10.13 (darwin/17.6.0) arch i386
606:debug:sysinfo MacPorts 2.5.3
607:debug:sysinfo Xcode 9.4.1
608:debug:sysinfo SDK 10.13
609:debug:sysinfo MACOSX_DEPLOYMENT_TARGET: 10.13
610:msg:clean --->  Computing dependencies for pdf2htmlex:info:clean .:debug:clean pdf2htmlex has no conflicts
611:debug:clean Searching for dependency: cmake
612:debug:clean Found Dependency: receipt exists for cmake
613:debug:clean Searching for dependency: fontforge
614:debug:clean Found Dependency: receipt exists for fontforge
615:debug:clean Searching for dependency: pkgconfig
616:debug:clean Found Dependency: receipt exists for pkgconfig
617:debug:clean Searching for dependency: poppler
618:debug:clean Found Dependency: receipt exists for poppler
619:debug:clean Searching for dependency: poppler-data
620:debug:clean Found Dependency: receipt exists for poppler-data
621:debug:main Executing org.macports.main (pdf2htmlex)
622:debug:main dropping privileges: euid changed to 502, egid changed to 501.
623:debug:main Skipping completed org.macports.archivefetch (pdf2htmlex)
624:debug:main Privilege de-escalation not attempted as not running as root.
625:debug:main Skipping completed org.macports.fetch (pdf2htmlex)
626:debug:main Privilege de-escalation not attempted as not running as root.
627:debug:main Skipping completed org.macports.checksum (pdf2htmlex)
628:debug:main Privilege de-escalation not attempted as not running as root.
629:debug:main Skipping completed org.macports.extract (pdf2htmlex)
630:debug:main Privilege de-escalation not attempted as not running as root.
631:debug:main Skipping completed org.macports.patch (pdf2htmlex)
632:debug:main Privilege de-escalation not attempted as not running as root.
633:debug:main Skipping completed org.macports.configure (pdf2htmlex)
634:debug:main Privilege de-escalation not attempted as not running as root.
635:debug:build build phase started at Thu Jul 12 14:10:27 CEST 2018
636:notice:build --->  Building pdf2htmlex
637:debug:build Executing org.macports.build (pdf2htmlex)
638:debug:build Environment:
639:debug:build CC_PRINT_OPTIONS='YES'
640:debug:build CC_PRINT_OPTIONS_FILE='/opt/local/var/macports/build/_opt_local_var_macports_sources_rsync.macports.org_macports_release_tarballs_ports_textproc_pdf2htmlex/pdf2htmlex/work/.CC_PRINT_OPTIONS'
641:debug:build CPATH='/opt/local/include'
642:debug:build LIBRARY_PATH='/opt/local/lib'
643:debug:build MACOSX_DEPLOYMENT_TARGET='10.13'
644:info:build Executing:  cd "/opt/local/var/macports/build/_opt_local_var_macports_sources_rsync.macports.org_macports_release_tarballs_ports_textproc_pdf2htmlex/pdf2htmlex/work/build" && /usr/bin/make -j8 -w all VERBOSE=ON
645:debug:build system:  cd "/opt/local/var/macports/build/_opt_local_var_macports_sources_rsync.macports.org_macports_release_tarballs_ports_textproc_pdf2htmlex/pdf2htmlex/work/build" && /usr/bin/make -j8 -w all VERBOSE=ON
646:info:build make: Entering directory `/opt/local/var/macports/build/_opt_local_var_macports_sources_rsync.macports.org_macports_release_tarballs_ports_textproc_pdf2htmlex/pdf2htmlex/work/build'
647:info:build /opt/local/bin/cmake -H/opt/local/var/macports/build/_opt_local_var_macports_sources_rsync.macports.org_macports_release_tarballs_ports_textproc_pdf2htmlex/pdf2htmlex/work/pdf2htmlEX-43e3174cbc -B/opt/local/var/macports/build/_opt_local_var_macports_sources_rsync.macports.org_macports_release_tarballs_ports_textproc_pdf2htmlex/pdf2htmlex/work/build --check-build-system CMakeFiles/Makefile.cmake 0
648:info:build /opt/local/bin/cmake -E cmake_progress_start /opt/local/var/macports/build/_opt_local_var_macports_sources_rsync.macports.org_macports_release_tarballs_ports_textproc_pdf2htmlex/pdf2htmlex/work/build/CMakeFiles /opt/local/var/macports/build/_opt_local_var_macports_sources_rsync.macports.org_macports_release_tarballs_ports_textproc_pdf2htmlex/pdf2htmlex/work/build/CMakeFiles/progress.marks
649:info:build /Applications/Xcode.app/Contents/Developer/usr/bin/make -f CMakeFiles/Makefile2 all
650:info:build make[1]: Entering directory `/opt/local/var/macports/build/_opt_local_var_macports_sources_rsync.macports.org_macports_release_tarballs_ports_textproc_pdf2htmlex/pdf2htmlex/work/build'
651:info:build /Applications/Xcode.app/Contents/Developer/usr/bin/make -f CMakeFiles/pdf2htmlEX_resources.dir/build.make CMakeFiles/pdf2htmlEX_resources.dir/depend
652:info:build /Applications/Xcode.app/Contents/Developer/usr/bin/make -f CMakeFiles/pdf2htmlEX.dir/build.make CMakeFiles/pdf2htmlEX.dir/depend
653:info:build make[2]: Entering directory `/opt/local/var/macports/build/_opt_local_var_macports_sources_rsync.macports.org_macports_release_tarballs_ports_textproc_pdf2htmlex/pdf2htmlex/work/build'
654:info:build cd /opt/local/var/macports/build/_opt_local_var_macports_sources_rsync.macports.org_macports_release_tarballs_ports_textproc_pdf2htmlex/pdf2htmlex/work/build && /opt/local/bin/cmake -E cmake_depends "Unix Makefiles" /opt/local/var/macports/build/_opt_local_var_macports_sources_rsync.macports.org_macports_release_tarballs_ports_textproc_pdf2htmlex/pdf2htmlex/work/pdf2htmlEX-43e3174cbc /opt/local/var/macports/build/_opt_local_var_macports_sources_rsync.macports.org_macports_release_tarballs_ports_textproc_pdf2htmlex/pdf2htmlex/work/pdf2htmlEX-43e3174cbc /opt/local/var/macports/build/_opt_local_var_macports_sources_rsync.macports.org_macports_release_tarballs_ports_textproc_pdf2htmlex/pdf2htmlex/work/build /opt/local/var/macports/build/_opt_local_var_macports_sources_rsync.macports.org_macports_release_tarballs_ports_textproc_pdf2htmlex/pdf2htmlex/work/build /opt/local/var/macports/build/_opt_local_var_macports_sources_rsync.macports.org_macports_release_tarballs_ports_textproc_pdf2htmlex/pdf2htmlex/work/build/CMakeFiles/pdf2htmlEX_resources.dir/DependInfo.cmake --color=
655:info:build make[2]: Entering directory `/opt/local/var/macports/build/_opt_local_var_macports_sources_rsync.macports.org_macports_release_tarballs_ports_textproc_pdf2htmlex/pdf2htmlex/work/build'
656:info:build cd /opt/local/var/macports/build/_opt_local_var_macports_sources_rsync.macports.org_macports_release_tarballs_ports_textproc_pdf2htmlex/pdf2htmlex/work/build && /opt/local/bin/cmake -E cmake_depends "Unix Makefiles" /opt/local/var/macports/build/_opt_local_var_macports_sources_rsync.macports.org_macports_release_tarballs_ports_textproc_pdf2htmlex/pdf2htmlex/work/pdf2htmlEX-43e3174cbc /opt/local/var/macports/build/_opt_local_var_macports_sources_rsync.macports.org_macports_release_tarballs_ports_textproc_pdf2htmlex/pdf2htmlex/work/pdf2htmlEX-43e3174cbc /opt/local/var/macports/build/_opt_local_var_macports_sources_rsync.macports.org_macports_release_tarballs_ports_textproc_pdf2htmlex/pdf2htmlex/work/build /opt/local/var/macports/build/_opt_local_var_macports_sources_rsync.macports.org_macports_release_tarballs_ports_textproc_pdf2htmlex/pdf2htmlex/work/build /opt/local/var/macports/build/_opt_local_var_macports_sources_rsync.macports.org_macports_release_tarballs_ports_textproc_pdf2htmlex/pdf2htmlex/work/build/CMakeFiles/pdf2htmlEX.dir/DependInfo.cmake --color=
657:info:build make[2]: Leaving directory `/opt/local/var/macports/build/_opt_local_var_macports_sources_rsync.macports.org_macports_release_tarballs_ports_textproc_pdf2htmlex/pdf2htmlex/work/build'
658:info:build /Applications/Xcode.app/Contents/Developer/usr/bin/make -f CMakeFiles/pdf2htmlEX_resources.dir/build.make CMakeFiles/pdf2htmlEX_resources.dir/build
659:info:build make[2]: Entering directory `/opt/local/var/macports/build/_opt_local_var_macports_sources_rsync.macports.org_macports_release_tarballs_ports_textproc_pdf2htmlex/pdf2htmlex/work/build'
660:info:build make[2]: Nothing to be done for `CMakeFiles/pdf2htmlEX_resources.dir/build'.
661:info:build make[2]: Leaving directory `/opt/local/var/macports/build/_opt_local_var_macports_sources_rsync.macports.org_macports_release_tarballs_ports_textproc_pdf2htmlex/pdf2htmlex/work/build'
662:info:build make[2]: Leaving directory `/opt/local/var/macports/build/_opt_local_var_macports_sources_rsync.macports.org_macports_release_tarballs_ports_textproc_pdf2htmlex/pdf2htmlex/work/build'
663:info:build /Applications/Xcode.app/Contents/Developer/usr/bin/make -f CMakeFiles/pdf2htmlEX.dir/build.make CMakeFiles/pdf2htmlEX.dir/build
664:info:build [  6%] Built target pdf2htmlEX_resources
665:info:build make[2]: Entering directory `/opt/local/var/macports/build/_opt_local_var_macports_sources_rsync.macports.org_macports_release_tarballs_ports_textproc_pdf2htmlex/pdf2htmlex/work/build'
666:info:build [ 16%] Building CXX object CMakeFiles/pdf2htmlEX.dir/src/HTMLRenderer/outline.cc.o
667:info:build [ 16%] Building CXX object CMakeFiles/pdf2htmlEX.dir/src/HTMLRenderer/text.cc.o
668:info:build [ 16%] Building CXX object CMakeFiles/pdf2htmlEX.dir/src/util/encoding.cc.o
669:info:build [ 25%] Building CXX object CMakeFiles/pdf2htmlEX.dir/src/util/const.cc.o
670:info:build [ 25%] Building CXX object CMakeFiles/pdf2htmlEX.dir/src/BackgroundRenderer/BackgroundRenderer.cc.o
671:info:build [ 25%] Building CXX object CMakeFiles/pdf2htmlEX.dir/src/BackgroundRenderer/SplashBackgroundRenderer.cc.o
672:info:build /usr/bin/clang++   -I/opt/local/var/macports/build/_opt_local_var_macports_sources_rsync.macports.org_macports_release_tarballs_ports_textproc_pdf2htmlex/pdf2htmlex/work/pdf2htmlEX-43e3174cbc/src -I/opt/local/include/poppler -I/opt/local/include/fontforge -I/opt/local/include  -pipe -Os -stdlib=libc++ -Wall -stdlib=libc++ -std=c++0x -O2 -DNDEBUG -arch x86_64 -mmacosx-version-min=10.13   -o CMakeFiles/pdf2htmlEX.dir/src/util/encoding.cc.o -c /opt/local/var/macports/build/_opt_local_var_macports_sources_rsync.macports.org_macports_release_tarballs_ports_textproc_pdf2htmlex/pdf2htmlex/work/pdf2htmlEX-43e3174cbc/src/util/encoding.cc
673:info:build [ 29%] Building CXX object CMakeFiles/pdf2htmlEX.dir/src/HTMLRenderer/font.cc.o
674:info:build /usr/bin/clang++   -I/opt/local/var/macports/build/_opt_local_var_macports_sources_rsync.macports.org_macports_release_tarballs_ports_textproc_pdf2htmlex/pdf2htmlex/work/pdf2htmlEX-43e3174cbc/src -I/opt/local/include/poppler -I/opt/local/include/fontforge -I/opt/local/include  -pipe -Os -stdlib=libc++ -Wall -stdlib=libc++ -std=c++0x -O2 -DNDEBUG -arch x86_64 -mmacosx-version-min=10.13   -o CMakeFiles/pdf2htmlEX.dir/src/util/const.cc.o -c /opt/local/var/macports/build/_opt_local_var_macports_sources_rsync.macports.org_macports_release_tarballs_ports_textproc_pdf2htmlex/pdf2htmlex/work/pdf2htmlEX-43e3174cbc/src/util/const.cc
675:info:build /usr/bin/clang++   -I/opt/local/var/macports/build/_opt_local_var_macports_sources_rsync.macports.org_macports_release_tarballs_ports_textproc_pdf2htmlex/pdf2htmlex/work/pdf2htmlEX-43e3174cbc/src -I/opt/local/include/poppler -I/opt/local/include/fontforge -I/opt/local/include  -pipe -Os -stdlib=libc++ -Wall -stdlib=libc++ -std=c++0x -O2 -DNDEBUG -arch x86_64 -mmacosx-version-min=10.13   -o CMakeFiles/pdf2htmlEX.dir/src/BackgroundRenderer/SplashBackgroundRenderer.cc.o -c /opt/local/var/macports/build/_opt_local_var_macports_sources_rsync.macports.org_macports_release_tarballs_ports_textproc_pdf2htmlex/pdf2htmlex/work/pdf2htmlEX-43e3174cbc/src/BackgroundRenderer/SplashBackgroundRenderer.cc
676:info:build [ 32%] Building CXX object CMakeFiles/pdf2htmlEX.dir/src/BackgroundRenderer/CairoBackgroundRenderer.cc.o
677:info:build /usr/bin/clang++   -I/opt/local/var/macports/build/_opt_local_var_macports_sources_rsync.macports.org_macports_release_tarballs_ports_textproc_pdf2htmlex/pdf2htmlex/work/pdf2htmlEX-43e3174cbc/src -I/opt/local/include/poppler -I/opt/local/include/fontforge -I/opt/local/include  -pipe -Os -stdlib=libc++ -Wall -stdlib=libc++ -std=c++0x -O2 -DNDEBUG -arch x86_64 -mmacosx-version-min=10.13   -o CMakeFiles/pdf2htmlEX.dir/src/BackgroundRenderer/CairoBackgroundRenderer.cc.o -c /opt/local/var/macports/build/_opt_local_var_macports_sources_rsync.macports.org_macports_release_tarballs_ports_textproc_pdf2htmlex/pdf2htmlex/work/pdf2htmlEX-43e3174cbc/src/BackgroundRenderer/CairoBackgroundRenderer.cc
678:info:build /usr/bin/clang++   -I/opt/local/var/macports/build/_opt_local_var_macports_sources_rsync.macports.org_macports_release_tarballs_ports_textproc_pdf2htmlex/pdf2htmlex/work/pdf2htmlEX-43e3174cbc/src -I/opt/local/include/poppler -I/opt/local/include/fontforge -I/opt/local/include  -pipe -Os -stdlib=libc++ -Wall -stdlib=libc++ -std=c++0x -O2 -DNDEBUG -arch x86_64 -mmacosx-version-min=10.13   -o CMakeFiles/pdf2htmlEX.dir/src/BackgroundRenderer/BackgroundRenderer.cc.o -c /opt/local/var/macports/build/_opt_local_var_macports_sources_rsync.macports.org_macports_release_tarballs_ports_textproc_pdf2htmlex/pdf2htmlex/work/pdf2htmlEX-43e3174cbc/src/BackgroundRenderer/BackgroundRenderer.cc
679:info:build /usr/bin/clang++   -I/opt/local/var/macports/build/_opt_local_var_macports_sources_rsync.macports.org_macports_release_tarballs_ports_textproc_pdf2htmlex/pdf2htmlex/work/pdf2htmlEX-43e3174cbc/src -I/opt/local/include/poppler -I/opt/local/include/fontforge -I/opt/local/include  -pipe -Os -stdlib=libc++ -Wall -stdlib=libc++ -std=c++0x -O2 -DNDEBUG -arch x86_64 -mmacosx-version-min=10.13   -o CMakeFiles/pdf2htmlEX.dir/src/HTMLRenderer/text.cc.o -c /opt/local/var/macports/build/_opt_local_var_macports_sources_rsync.macports.org_macports_release_tarballs_ports_textproc_pdf2htmlex/pdf2htmlex/work/pdf2htmlEX-43e3174cbc/src/HTMLRenderer/text.cc
680:info:build /usr/bin/clang++   -I/opt/local/var/macports/build/_opt_local_var_macports_sources_rsync.macports.org_macports_release_tarballs_ports_textproc_pdf2htmlex/pdf2htmlex/work/pdf2htmlEX-43e3174cbc/src -I/opt/local/include/poppler -I/opt/local/include/fontforge -I/opt/local/include  -pipe -Os -stdlib=libc++ -Wall -stdlib=libc++ -std=c++0x -O2 -DNDEBUG -arch x86_64 -mmacosx-version-min=10.13   -o CMakeFiles/pdf2htmlEX.dir/src/HTMLRenderer/outline.cc.o -c /opt/local/var/macports/build/_opt_local_var_macports_sources_rsync.macports.org_macports_release_tarballs_ports_textproc_pdf2htmlex/pdf2htmlex/work/pdf2htmlEX-43e3174cbc/src/HTMLRenderer/outline.cc
681:info:build /usr/bin/clang++   -I/opt/local/var/macports/build/_opt_local_var_macports_sources_rsync.macports.org_macports_release_tarballs_ports_textproc_pdf2htmlex/pdf2htmlex/work/pdf2htmlEX-43e3174cbc/src -I/opt/local/include/poppler -I/opt/local/include/fontforge -I/opt/local/include  -pipe -Os -stdlib=libc++ -Wall -stdlib=libc++ -std=c++0x -O2 -DNDEBUG -arch x86_64 -mmacosx-version-min=10.13   -o CMakeFiles/pdf2htmlEX.dir/src/HTMLRenderer/font.cc.o -c /opt/local/var/macports/build/_opt_local_var_macports_sources_rsync.macports.org_macports_release_tarballs_ports_textproc_pdf2htmlex/pdf2htmlex/work/pdf2htmlEX-43e3174cbc/src/HTMLRenderer/font.cc
682:info:build [ 35%] Building C object CMakeFiles/pdf2htmlEX.dir/src/util/ffw.c.o
683:info:build /usr/bin/clang  -I/opt/local/var/macports/build/_opt_local_var_macports_sources_rsync.macports.org_macports_release_tarballs_ports_textproc_pdf2htmlex/pdf2htmlex/work/pdf2htmlEX-43e3174cbc/src -I/opt/local/include/poppler -I/opt/local/include/fontforge -I/opt/local/include  -pipe -Os -include /opt/local/include/fontforge/config.h -Wall -O2 -DNDEBUG -arch x86_64 -mmacosx-version-min=10.13   -o CMakeFiles/pdf2htmlEX.dir/src/util/ffw.c.o   -c /opt/local/var/macports/build/_opt_local_var_macports_sources_rsync.macports.org_macports_release_tarballs_ports_textproc_pdf2htmlex/pdf2htmlex/work/pdf2htmlEX-43e3174cbc/src/util/ffw.c
684:info:build [ 38%] Building CXX object CMakeFiles/pdf2htmlEX.dir/src/util/math.cc.o
685:info:build /usr/bin/clang++   -I/opt/local/var/macports/build/_opt_local_var_macports_sources_rsync.macports.org_macports_release_tarballs_ports_textproc_pdf2htmlex/pdf2htmlex/work/pdf2htmlEX-43e3174cbc/src -I/opt/local/include/poppler -I/opt/local/include/fontforge -I/opt/local/include  -pipe -Os -stdlib=libc++ -Wall -stdlib=libc++ -std=c++0x -O2 -DNDEBUG -arch x86_64 -mmacosx-version-min=10.13   -o CMakeFiles/pdf2htmlEX.dir/src/util/math.cc.o -c /opt/local/var/macports/build/_opt_local_var_macports_sources_rsync.macports.org_macports_release_tarballs_ports_textproc_pdf2htmlex/pdf2htmlex/work/pdf2htmlEX-43e3174cbc/src/util/math.cc
686:info:build In file included from /opt/local/var/macports/build/_opt_local_var_macports_sources_rsync.macports.org_macports_release_tarballs_ports_textproc_pdf2htmlex/pdf2htmlex/work/pdf2htmlEX-43e3174cbc/src/BackgroundRenderer/BackgroundRenderer.cc:10:
687:info:build In file included from /opt/local/var/macports/build/_opt_local_var_macports_sources_rsync.macports.org_macports_release_tarballs_ports_textproc_pdf2htmlex/pdf2htmlex/work/pdf2htmlEX-43e3174cbc/src/HTMLRenderer/HTMLRenderer.h:In file included from 27/opt/local/var/macports/build/_opt_local_var_macports_sources_rsync.macports.org_macports_release_tarballs_ports_textproc_pdf2htmlex/pdf2htmlex/work/pdf2htmlEX-43e3174cbc/src/HTMLRenderer/text.cc:
688:info:build :12:
689:info:build /opt/local/var/macports/build/_opt_local_var_macports_sources_rsync.macports.org_macports_release_tarballs_ports_textproc_pdf2htmlex/pdf2htmlex/work/pdf2htmlEX-43e3174cbc/src/StringFormatter.h:37:In file included from 12:/opt/local/var/macports/build/_opt_local_var_macports_sources_rsync.macports.org_macports_release_tarballs_ports_textproc_pdf2htmlex/pdf2htmlex/work/pdf2htmlEX-43e3174cbc/src/HTMLRenderer/HTMLRenderer.h :warning: class 'GuardedPointer' was previously declared as a struct [-Wmismatched-tags]
690:info:build     friend class GuardedPointer;
691:info:build            ^
692:info:build /opt/local/var/macports/build/_opt_local_var_macports_sources_rsync.macports.org_macports_release_tarballs_ports_textproc_pdf2htmlex/pdf2htmlex/work/pdf2htmlEX-43e3174cbc/src/StringFormatter.h:19:12: note: previous use is here
693:info:build     struct GuardedPointer
694:info:build            ^
695:info:build 27:
696:info:build /opt/local/var/macports/build/_opt_local_var_macports_sources_rsync.macports.org_macports_release_tarballs_ports_textproc_pdf2htmlex/pdf2htmlex/work/pdf2htmlEX-43e3174cbc/src/StringFormatter.h:37:12: warning: class 'GuardedPointer' was previously declared as a struct [-Wmismatched-tags]
697:info:build     friend class GuardedPointer;
698:info:build            ^
699:info:build /opt/local/var/macports/build/_opt_local_var_macports_sources_rsync.macports.org_macports_release_tarballs_ports_textproc_pdf2htmlex/pdf2htmlex/work/pdf2htmlEX-43e3174cbc/src/StringFormatter.h:19:12: note: previous use is here
700:info:build     struct GuardedPointer
701:info:build            ^
702:info:build /opt/local/var/macports/build/_opt_local_var_macports_sources_rsync.macports.org_macports_release_tarballs_ports_textproc_pdf2htmlex/pdf2htmlex/work/pdf2htmlEX-43e3174cbc/src/StringFormatter.h/opt/local/var/macports/build/_opt_local_var_macports_sources_rsync.macports.org_macports_release_tarballs_ports_textproc_pdf2htmlex/pdf2htmlex/work/pdf2htmlEX-43e3174cbc/src/StringFormatter.h:37:12: note: :did you mean struct here?
703:info:build     friend class GuardedPointer;
704:info:build            ^~~~~
705:info:build            struct
706:info:build 37:12: note: did you mean struct here?
707:info:build     friend class GuardedPointer;
708:info:build            ^~~~~
709:info:build            struct
710:info:build In file included from /opt/local/var/macports/build/_opt_local_var_macports_sources_rsync.macports.org_macports_release_tarballs_ports_textproc_pdf2htmlex/pdf2htmlex/work/pdf2htmlEX-43e3174cbc/src/HTMLRenderer/outline.cc:15:
711:info:build In file included from /opt/local/var/macports/build/_opt_local_var_macports_sources_rsync.macports.org_macports_release_tarballs_ports_textproc_pdf2htmlex/pdf2htmlex/work/pdf2htmlEX-43e3174cbc/src/HTMLRenderer/HTMLRenderer.h:27:
712:info:build /opt/local/var/macports/build/_opt_local_var_macports_sources_rsync.macports.org_macports_release_tarballs_ports_textproc_pdf2htmlex/pdf2htmlex/work/pdf2htmlEX-43e3174cbc/src/StringFormatter.h:37:12: warning: class 'GuardedPointer' was previously declared as a struct [-Wmismatched-tags]
713:info:build     friend class GuardedPointer;
714:info:build            ^
715:info:build /opt/local/var/macports/build/_opt_local_var_macports_sources_rsync.macports.org_macports_release_tarballs_ports_textproc_pdf2htmlex/pdf2htmlex/work/pdf2htmlEX-43e3174cbc/src/StringFormatter.h:19:12: note: previous use is here
716:info:build     struct GuardedPointer
717:info:build            ^
718:info:build /opt/local/var/macports/build/_opt_local_var_macports_sources_rsync.macports.org_macports_release_tarballs_ports_textproc_pdf2htmlex/pdf2htmlex/work/pdf2htmlEX-43e3174cbc/src/StringFormatter.h:37:12: note: did you mean struct here?
719:info:build     friend class GuardedPointer;
720:info:build            ^~~~~
721:info:build            struct
722:info:build In file included from /opt/local/var/macports/build/_opt_local_var_macports_sources_rsync.macports.org_macports_release_tarballs_ports_textproc_pdf2htmlex/pdf2htmlex/work/pdf2htmlEX-43e3174cbc/src/BackgroundRenderer/SplashBackgroundRenderer.cc:20:
723:info:build In file included from /opt/local/var/macports/build/_opt_local_var_macports_sources_rsync.macports.org_macports_release_tarballs_ports_textproc_pdf2htmlex/pdf2htmlex/work/pdf2htmlEX-43e3174cbc/src/BackgroundRenderer/SplashBackgroundRenderer.h:20:
724:info:build In file included from /opt/local/var/macports/build/_opt_local_var_macports_sources_rsync.macports.org_macports_release_tarballs_ports_textproc_pdf2htmlex/pdf2htmlex/work/pdf2htmlEX-43e3174cbc/src/HTMLRenderer/HTMLRenderer.h:27:
725:info:build /opt/local/var/macports/build/_opt_local_var_macports_sources_rsync.macports.org_macports_release_tarballs_ports_textproc_pdf2htmlex/pdf2htmlex/work/pdf2htmlEX-43e3174cbc/src/StringFormatter.h:37:12: warning: class 'GuardedPointer' was previously declared as a struct [-Wmismatched-tags]
726:info:build     friend class GuardedPointer;
727:info:build            ^
728:info:build /opt/local/var/macports/build/_opt_local_var_macports_sources_rsync.macports.org_macports_release_tarballs_ports_textproc_pdf2htmlex/pdf2htmlex/work/pdf2htmlEX-43e3174cbc/src/StringFormatter.h:19:12: note: previous use is here
729:info:build     struct GuardedPointer
730:info:build            ^
731:info:build /opt/local/var/macports/build/_opt_local_var_macports_sources_rsync.macports.org_macports_release_tarballs_ports_textproc_pdf2htmlex/pdf2htmlex/work/pdf2htmlEX-43e3174cbc/src/StringFormatter.h:37:12: note: did you mean struct here?
732:info:build     friend class GuardedPointer;
733:info:build            ^~~~~
734:info:build            struct
735:info:build [ 41%] Building CXX object CMakeFiles/pdf2htmlEX.dir/src/util/misc.cc.o
736:info:build /usr/bin/clang++   -I/opt/local/var/macports/build/_opt_local_var_macports_sources_rsync.macports.org_macports_release_tarballs_ports_textproc_pdf2htmlex/pdf2htmlex/work/pdf2htmlEX-43e3174cbc/src -I/opt/local/include/poppler -I/opt/local/include/fontforge -I/opt/local/include  -pipe -Os -stdlib=libc++ -Wall -stdlib=libc++ -std=c++0x -O2 -DNDEBUG -arch x86_64 -mmacosx-version-min=10.13   -o CMakeFiles/pdf2htmlEX.dir/src/util/misc.cc.o -c /opt/local/var/macports/build/_opt_local_var_macports_sources_rsync.macports.org_macports_release_tarballs_ports_textproc_pdf2htmlex/pdf2htmlex/work/pdf2htmlEX-43e3174cbc/src/util/misc.cc
737:info:build In file included from /opt/local/var/macports/build/_opt_local_var_macports_sources_rsync.macports.org_macports_release_tarballs_ports_textproc_pdf2htmlex/pdf2htmlex/work/pdf2htmlEX-43e3174cbc/src/HTMLRenderer/font.cc:21:
738:info:build In file included from /opt/local/var/macports/build/_opt_local_var_macports_sources_rsync.macports.org_macports_release_tarballs_ports_textproc_pdf2htmlex/pdf2htmlex/work/pdf2htmlEX-43e3174cbc/src/HTMLRenderer/HTMLRenderer.h:27:
739:info:build /opt/local/var/macports/build/_opt_local_var_macports_sources_rsync.macports.org_macports_release_tarballs_ports_textproc_pdf2htmlex/pdf2htmlex/work/pdf2htmlEX-43e3174cbc/src/StringFormatter.h:37:12: warning: class 'GuardedPointer' was previously declared as a struct [-Wmismatched-tags]
740:info:build     friend class GuardedPointer;
741:info:build            ^
742:info:build /opt/local/var/macports/build/_opt_local_var_macports_sources_rsync.macports.org_macports_release_tarballs_ports_textproc_pdf2htmlex/pdf2htmlex/work/pdf2htmlEX-43e3174cbc/src/StringFormatter.h:19:12: note: previous use is here
743:info:build     struct GuardedPointer
744:info:build            ^
745:info:build /opt/local/var/macports/build/_opt_local_var_macports_sources_rsync.macports.org_macports_release_tarballs_ports_textproc_pdf2htmlex/pdf2htmlex/work/pdf2htmlEX-43e3174cbc/src/StringFormatter.h:37:12: note: did you mean struct here?
746:info:build     friend class GuardedPointer;
747:info:build            ^~~~~
748:info:build            struct
749:info:build In file included from /opt/local/var/macports/build/_opt_local_var_macports_sources_rsync.macports.org_macports_release_tarballs_ports_textproc_pdf2htmlex/pdf2htmlex/work/pdf2htmlEX-43e3174cbc/src/BackgroundRenderer/BackgroundRenderer.cc:10:
750:info:build In file included from /opt/local/var/macports/build/_opt_local_var_macports_sources_rsync.macports.org_macports_release_tarballs_ports_textproc_pdf2htmlex/pdf2htmlex/work/pdf2htmlEX-43e3174cbc/src/HTMLRenderer/HTMLRenderer.h:33:
751:info:build /opt/local/var/macports/build/_opt_local_var_macports_sources_rsync.macports.org_macports_release_tarballs_ports_textproc_pdf2htmlex/pdf2htmlex/work/pdf2htmlEX-43e3174cbc/src/BackgroundRenderer/BackgroundRenderer.h:18:1: warning: class 'Param' was previously declared as a struct [-Wmismatched-tags]
752:info:build class Param;
753:info:build ^
754:info:build /opt/local/var/macports/build/_opt_local_var_macports_sources_rsync.macports.org_macports_release_tarballs_ports_textproc_pdf2htmlex/pdf2htmlex/work/pdf2htmlEX-43e3174cbc/src/Param.h:16:8: note: previous use is here
755:info:build struct Param
756:info:build        ^
757:info:build /opt/local/var/macports/build/_opt_local_var_macports_sources_rsync.macports.org_macports_release_tarballs_ports_textproc_pdf2htmlex/pdf2htmlex/work/pdf2htmlEX-43e3174cbc/src/BackgroundRenderer/BackgroundRenderer.h:18:1: note: did you mean struct here?
758:info:build class Param;
759:info:build ^~~~~
760:info:build struct
761:info:build In file included from /opt/local/var/macports/build/_opt_local_var_macports_sources_rsync.macports.org_macports_release_tarballs_ports_textproc_pdf2htmlex/pdf2htmlex/work/pdf2htmlEX-43e3174cbc/src/HTMLRenderer/text.cc:12:
762:info:build In file included from /opt/local/var/macports/build/_opt_local_var_macports_sources_rsync.macports.org_macports_release_tarballs_ports_textproc_pdf2htmlex/pdf2htmlex/work/pdf2htmlEX-43e3174cbc/src/HTMLRenderer/HTMLRenderer.h:33:
763:info:build /opt/local/var/macports/build/_opt_local_var_macports_sources_rsync.macports.org_macports_release_tarballs_ports_textproc_pdf2htmlex/pdf2htmlex/work/pdf2htmlEX-43e3174cbc/src/BackgroundRenderer/BackgroundRenderer.h:18:1: warning: class 'Param' was previously declared as a struct [-Wmismatched-tags]
764:info:build class Param;
765:info:build ^
766:info:build /opt/local/var/macports/build/_opt_local_var_macports_sources_rsync.macports.org_macports_release_tarballs_ports_textproc_pdf2htmlex/pdf2htmlex/work/pdf2htmlEX-43e3174cbc/src/Param.h:16:8: note: previous use is here
767:info:build struct Param
768:info:build        ^
769:info:build /opt/local/var/macports/build/_opt_local_var_macports_sources_rsync.macports.org_macports_release_tarballs_ports_textproc_pdf2htmlex/pdf2htmlex/work/pdf2htmlEX-43e3174cbc/src/BackgroundRenderer/BackgroundRenderer.h:18:1: note: did you mean struct here?
770:info:build class Param;
771:info:build ^~~~~
772:info:build struct
773:info:build In file included from /opt/local/var/macports/build/_opt_local_var_macports_sources_rsync.macports.org_macports_release_tarballs_ports_textproc_pdf2htmlex/pdf2htmlex/work/pdf2htmlEX-43e3174cbc/src/HTMLRenderer/outline.cc:15:
774:info:build In file included from /opt/local/var/macports/build/_opt_local_var_macports_sources_rsync.macports.org_macports_release_tarballs_ports_textproc_pdf2htmlex/pdf2htmlex/work/pdf2htmlEX-43e3174cbc/src/HTMLRenderer/HTMLRenderer.h:33:
775:info:build /opt/local/var/macports/build/_opt_local_var_macports_sources_rsync.macports.org_macports_release_tarballs_ports_textproc_pdf2htmlex/pdf2htmlex/work/pdf2htmlEX-43e3174cbc/src/BackgroundRenderer/BackgroundRenderer.h:18:1: warning: class 'Param' was previously declared as a struct [-Wmismatched-tags]
776:info:build class Param;
777:info:build ^
778:info:build /opt/local/var/macports/build/_opt_local_var_macports_sources_rsync.macports.org_macports_release_tarballs_ports_textproc_pdf2htmlex/pdf2htmlex/work/pdf2htmlEX-43e3174cbc/src/Param.h:16:8: note: previous use is here
779:info:build struct Param
780:info:build        ^
781:info:build In file included from /opt/local/var/macports/build/_opt_local_var_macports_sources_rsync.macports.org_macports_release_tarballs_ports_textproc_pdf2htmlex/pdf2htmlex/work/pdf2htmlEX-43e3174cbc/src/BackgroundRenderer/BackgroundRenderer.cc:10:
782:info:build /opt/local/var/macports/build/_opt_local_var_macports_sources_rsync.macports.org_macports_release_tarballs_ports_textproc_pdf2htmlex/pdf2htmlex/work/pdf2htmlEX-43e3174cbc/src/HTMLRenderer/HTMLRenderer.h:124:18: warning: 'pdf2htmlEX::HTMLRenderer::drawString' hides overloaded virtual function [-Woverloaded-virtual]
783:info:build     virtual void drawString(GfxState * state, GooString * s);
784:info:build                  ^
785:info:build /opt/local/var/macports/build/_opt_local_var_macports_sources_rsync.macports.org_macports_release_tarballs_ports_textproc_pdf2htmlex/pdf2htmlex/work/pdf2htmlEX-43e3174cbc/src/BackgroundRenderer/BackgroundRenderer.h:18:1: note: did you mean struct here?
786:info:build class Param;
787:info:build ^~~~~
788:info:build struct
789:info:build /opt/local/include/poppler/OutputDev.h:270:16: note: hidden overloaded virtual function 'OutputDev::drawString' declared here: type mismatch at 2nd parameter ('const GooString *' vs 'GooString *')
790:info:build   virtual void drawString(GfxState * /*state*/, const GooString * /*s*/) {}
791:info:build                ^
792:info:build In file included from /opt/local/var/macports/build/_opt_local_var_macports_sources_rsync.macports.org_macports_release_tarballs_ports_textproc_pdf2htmlex/pdf2htmlex/work/pdf2htmlEX-43e3174cbc/src/HTMLRenderer/text.cc:12:
793:info:build /opt/local/var/macports/build/_opt_local_var_macports_sources_rsync.macports.org_macports_release_tarballs_ports_textproc_pdf2htmlex/pdf2htmlex/work/pdf2htmlEX-43e3174cbc/src/HTMLRenderer/HTMLRenderer.h:124:18: warning: 'pdf2htmlEX::HTMLRenderer::drawString' hides overloaded virtual function [-Woverloaded-virtual]
794:info:build     virtual void drawString(GfxState * state, GooString * s);
795:info:build                  ^
796:info:build /opt/local/include/poppler/OutputDev.h:270:16: note: hidden overloaded virtual function 'OutputDev::drawString' declared here: type mismatch at 2nd parameter ('const GooString *' vs 'GooString *')
797:info:build   virtual void drawString(GfxState * /*state*/, const GooString * /*s*/) {}
798:info:build                ^
799:info:build In file included from /opt/local/var/macports/build/_opt_local_var_macports_sources_rsync.macports.org_macports_release_tarballs_ports_textproc_pdf2htmlex/pdf2htmlex/work/pdf2htmlEX-43e3174cbc/src/HTMLRenderer/outline.cc:15:
800:info:build /opt/local/var/macports/build/_opt_local_var_macports_sources_rsync.macports.org_macports_release_tarballs_ports_textproc_pdf2htmlex/pdf2htmlex/work/pdf2htmlEX-43e3174cbc/src/HTMLRenderer/HTMLRenderer.h:124:18: warning: 'pdf2htmlEX::HTMLRenderer::drawString' hides overloaded virtual function [-Woverloaded-virtual]
801:info:build     virtual void drawString(GfxState * state, GooString * s);
802:info:build                  ^
803:info:build /opt/local/include/poppler/OutputDev.h:270:16: note: hidden overloaded virtual function 'OutputDev::drawString' declared here: type mismatch at 2nd parameter ('const GooString *' vs 'GooString *')
804:info:build   virtual void drawString(GfxState * /*state*/, const GooString * /*s*/) {}
805:info:build                ^
806:info:build /opt/local/var/macports/build/_opt_local_var_macports_sources_rsync.macports.org_macports_release_tarballs_ports_textproc_pdf2htmlex/pdf2htmlex/work/pdf2htmlEX-43e3174cbc/src/HTMLRenderer/outline.cc:36:42: error: cannot initialize a parameter of type 'LinkAction *' with an rvalue of type 'const LinkAction *'
807:info:build         string dest = get_linkaction_str(item->getAction(), detail);
808:info:build                                          ^~~~~~~~~~~~~~~~~
809:info:build /opt/local/var/macports/build/_opt_local_var_macports_sources_rsync.macports.org_macports_release_tarballs_ports_textproc_pdf2htmlex/pdf2htmlex/work/pdf2htmlEX-43e3174cbc/src/HTMLRenderer/HTMLRenderer.h:153:48: note: passing argument to parameter here
810:info:build     std::string get_linkaction_str(LinkAction *, std::string & detail);
811:info:build                                                ^
812:info:build /opt/local/var/macports/build/_opt_local_var_macports_sources_rsync.macports.org_macports_release_tarballs_ports_textproc_pdf2htmlex/pdf2htmlex/work/pdf2htmlEX-43e3174cbc/src/HTMLRenderer/outline.cc:56:35: error: cannot initialize a parameter of type 'GooList *' with an rvalue of type 'const GooList *'
813:info:build             process_outline_items(item->getKids());
814:info:build                                   ^~~~~~~~~~~~~~~
815:info:build /opt/local/var/macports/build/_opt_local_var_macports_sources_rsync.macports.org_macports_release_tarballs_ports_textproc_pdf2htmlex/pdf2htmlex/work/pdf2htmlEX-43e3174cbc/src/HTMLRenderer/outline.cc:24:52: note: passing argument to parameter 'items' here
816:info:build void HTMLRenderer::process_outline_items(GooList * items)
817:info:build                                                    ^
818:info:build /opt/local/var/macports/build/_opt_local_var_macports_sources_rsync.macports.org_macports_release_tarballs_ports_textproc_pdf2htmlex/pdf2htmlex/work/pdf2htmlEX-43e3174cbc/src/HTMLRenderer/outline.cc:71:27: error: cannot initialize a parameter of type 'GooList *' with an rvalue of type 'const GooList *'
819:info:build     process_outline_items(outline->getItems());
820:info:build                           ^~~~~~~~~~~~~~~~~~~
821:info:build /opt/local/var/macports/build/_opt_local_var_macports_sources_rsync.macports.org_macports_release_tarballs_ports_textproc_pdf2htmlex/pdf2htmlex/work/pdf2htmlEX-43e3174cbc/src/HTMLRenderer/outline.cc:24:52: note: passing argument to parameter 'items' here
822:info:build void HTMLRenderer::process_outline_items(GooList * items)
823:info:build                                                    ^
824:info:build In file included from /opt/local/var/macports/build/_opt_local_var_macports_sources_rsync.macports.org_macports_release_tarballs_ports_textproc_pdf2htmlex/pdf2htmlex/work/pdf2htmlEX-43e3174cbc/src/BackgroundRenderer/SplashBackgroundRenderer.cc:20:
825:info:build In file included from /opt/local/var/macports/build/_opt_local_var_macports_sources_rsync.macports.org_macports_release_tarballs_ports_textproc_pdf2htmlex/pdf2htmlex/work/pdf2htmlEX-43e3174cbc/src/BackgroundRenderer/SplashBackgroundRenderer.h:20:
826:info:build In file included from /opt/local/var/macports/build/_opt_local_var_macports_sources_rsync.macports.org_macports_release_tarballs_ports_textproc_pdf2htmlex/pdf2htmlex/work/pdf2htmlEX-43e3174cbc/src/HTMLRenderer/HTMLRenderer.h:33:
827:info:build /opt/local/var/macports/build/_opt_local_var_macports_sources_rsync.macports.org_macports_release_tarballs_ports_textproc_pdf2htmlex/pdf2htmlex/work/pdf2htmlEX-43e3174cbc/src/BackgroundRenderer/BackgroundRenderer.h:18:1: warning: class 'Param' was previously declared as a struct [-Wmismatched-tags]
828:info:build class Param;
829:info:build ^
830:info:build /opt/local/var/macports/build/_opt_local_var_macports_sources_rsync.macports.org_macports_release_tarballs_ports_textproc_pdf2htmlex/pdf2htmlex/work/pdf2htmlEX-43e3174cbc/src/Param.h:16:8: note: previous use is here
831:info:build struct Param
832:info:build        ^
833:info:build /opt/local/var/macports/build/_opt_local_var_macports_sources_rsync.macports.org_macports_release_tarballs_ports_textproc_pdf2htmlex/pdf2htmlex/work/pdf2htmlEX-43e3174cbc/src/BackgroundRenderer/BackgroundRenderer.h:18:1: note: did you mean struct here?
834:info:build class Param;
835:info:build ^~~~~
836:info:build struct
837:info:build In file included from /opt/local/var/macports/build/_opt_local_var_macports_sources_rsync.macports.org_macports_release_tarballs_ports_textproc_pdf2htmlex/pdf2htmlex/work/pdf2htmlEX-43e3174cbc/src/BackgroundRenderer/SplashBackgroundRenderer.cc:20:
838:info:build In file included from /opt/local/var/macports/build/_opt_local_var_macports_sources_rsync.macports.org_macports_release_tarballs_ports_textproc_pdf2htmlex/pdf2htmlex/work/pdf2htmlEX-43e3174cbc/src/BackgroundRenderer/SplashBackgroundRenderer.h:20:
839:info:build /opt/local/var/macports/build/_opt_local_var_macports_sources_rsync.macports.org_macports_release_tarballs_ports_textproc_pdf2htmlex/pdf2htmlex/work/pdf2htmlEX-43e3174cbc/src/HTMLRenderer/HTMLRenderer.h:124:18: warning: 'pdf2htmlEX::HTMLRenderer::drawString' hides overloaded virtual function [-Woverloaded-virtual]
840:info:build     virtual void drawString(GfxState * state, GooString * s);
841:info:build                  ^
842:info:build /opt/local/include/poppler/OutputDev.h:270:16: note: hidden overloaded virtual function 'OutputDev::drawString' declared here: type mismatch at 2nd parameter ('const GooString *' vs 'GooString *')
843:info:build   virtual void drawString(GfxState * /*state*/, const GooString * /*s*/) {}
844:info:build                ^
845:info:build In file included from /opt/local/var/macports/build/_opt_local_var_macports_sources_rsync.macports.org_macports_release_tarballs_ports_textproc_pdf2htmlex/pdf2htmlex/work/pdf2htmlEX-43e3174cbc/src/HTMLRenderer/font.cc:21:
846:info:build In file included from /opt/local/var/macports/build/_opt_local_var_macports_sources_rsync.macports.org_macports_release_tarballs_ports_textproc_pdf2htmlex/pdf2htmlex/work/pdf2htmlEX-43e3174cbc/src/HTMLRenderer/HTMLRenderer.h:33:
847:info:build /opt/local/var/macports/build/_opt_local_var_macports_sources_rsync.macports.org_macports_release_tarballs_ports_textproc_pdf2htmlex/pdf2htmlex/work/pdf2htmlEX-43e3174cbc/src/BackgroundRenderer/BackgroundRenderer.h:18:1: warning: class 'Param' was previously declared as a struct [-Wmismatched-tags]
848:info:build class Param;
849:info:build ^
850:info:build /opt/local/var/macports/build/_opt_local_var_macports_sources_rsync.macports.org_macports_release_tarballs_ports_textproc_pdf2htmlex/pdf2htmlex/work/pdf2htmlEX-43e3174cbc/src/Param.h:16:8: note: previous use is here
851:info:build struct Param
852:info:build        ^
853:info:build /opt/local/var/macports/build/_opt_local_var_macports_sources_rsync.macports.org_macports_release_tarballs_ports_textproc_pdf2htmlex/pdf2htmlex/work/pdf2htmlEX-43e3174cbc/src/BackgroundRenderer/BackgroundRenderer.h:18:1: note: did you mean struct here?
854:info:build class Param;
855:info:build ^~~~~
856:info:build struct
857:info:build In file included from /opt/local/var/macports/build/_opt_local_var_macports_sources_rsync.macports.org_macports_release_tarballs_ports_textproc_pdf2htmlex/pdf2htmlex/work/pdf2htmlEX-43e3174cbc/src/HTMLRenderer/font.cc:21:
858:info:build /opt/local/var/macports/build/_opt_local_var_macports_sources_rsync.macports.org_macports_release_tarballs_ports_textproc_pdf2htmlex/pdf2htmlex/work/pdf2htmlEX-43e3174cbc/src/HTMLRenderer/HTMLRenderer.h:124:18: warning: 'pdf2htmlEX::HTMLRenderer::drawString' hides overloaded virtual function [-Woverloaded-virtual]
859:info:build     virtual void drawString(GfxState * state, GooString * s);
860:info:build                  ^
861:info:build /opt/local/include/poppler/OutputDev.h:270:16: note: hidden overloaded virtual function 'OutputDev::drawString' declared here: type mismatch at 2nd parameter ('const GooString *' vs 'GooString *')
862:info:build   virtual void drawString(GfxState * /*state*/, const GooString * /*s*/) {}
863:info:build                ^
864:info:build /opt/local/var/macports/build/_opt_local_var_macports_sources_rsync.macports.org_macports_release_tarballs_ports_textproc_pdf2htmlex/pdf2htmlex/work/pdf2htmlEX-43e3174cbc/src/HTMLRenderer/font.cc:70:17: error: no member named 'initRef' in 'Object'
865:info:build         ref_obj.initRef(id->num, id->gen);
866:info:build         ~~~~~~~ ^
867:info:build /opt/local/var/macports/build/_opt_local_var_macports_sources_rsync.macports.org_macports_release_tarballs_ports_textproc_pdf2htmlex/pdf2htmlex/work/pdf2htmlEX-43e3174cbc/src/HTMLRenderer/font.cc:71:29: error: cannot initialize a parameter of type 'int' with an rvalue of type 'Object *'
868:info:build         ref_obj.fetch(xref, &font_obj);
869:info:build                             ^~~~~~~~~
870:info:build /opt/local/include/poppler/Object.h:194:32: note: passing argument to parameter 'recursion' here
871:info:build   Object fetch(XRef *xref, int recursion = 0) const;
872:info:build                                ^
873:info:build /opt/local/var/macports/build/_opt_local_var_macports_sources_rsync.macports.org_macports_release_tarballs_ports_textproc_pdf2htmlex/pdf2htmlex/work/pdf2htmlEX-43e3174cbc/src/HTMLRenderer/font.cc:72:17: error: 'free' is a private member of 'Object'
874:info:build         ref_obj.free();
875:info:build                 ^
876:info:build /opt/local/include/poppler/Object.h:301:8: note: declared private here
877:info:build   void free();
878:info:build        ^
879:info:build /opt/local/var/macports/build/_opt_local_var_macports_sources_rsync.macports.org_macports_release_tarballs_ports_textproc_pdf2htmlex/pdf2htmlex/work/pdf2htmlEX-43e3174cbc/src/HTMLRenderer/font.cc:81:44: error: cannot initialize a parameter of type 'int' with an rvalue of type 'Object *'
880:info:build         if(dict->lookup("DescendantFonts", &font_obj2)->isArray())
881:info:build                                            ^~~~~~~~~~
882:info:build /opt/local/include/poppler/Dict.h:81:38: note: passing argument to parameter 'recursion' here
883:info:build   Object lookup(const char *key, int recursion = 0) const;
884:info:build                                      ^
885:info:build /opt/local/var/macports/build/_opt_local_var_macports_sources_rsync.macports.org_macports_release_tarballs_ports_textproc_pdf2htmlex/pdf2htmlex/work/pdf2htmlEX-43e3174cbc/src/HTMLRenderer/font.cc:92:42: error: cannot initialize a parameter of type 'int' with an rvalue of type 'Object *'
886:info:build                 if(font_obj2.arrayGet(0, &obj2)->isDict())
887:info:build                                          ^~~~~
888:info:build /opt/local/include/poppler/Object.h:341:43: note: passing argument to parameter 'recursion' here
889:info:build inline Object Object::arrayGet(int i, int recursion = 0) const
890:info:build                                           ^
891:info:build /opt/local/var/macports/build/_opt_local_var_macports_sources_rsync.macports.org_macports_release_tarballs_ports_textproc_pdf2htmlex/pdf2htmlex/work/pdf2htmlEX-43e3174cbc/src/HTMLRenderer/font.cc:99:44: error: cannot initialize a parameter of type 'int' with an rvalue of type 'Object *'
892:info:build         if(!dict->lookup("FontDescriptor", &fontdesc_obj)->isDict())
893:info:build                                            ^~~~~~~~~~~~~
894:info:build /opt/local/include/poppler/Dict.h:81:38: note: passing argument to parameter 'recursion' here
895:info:build   Object lookup(const char *key, int recursion = 0) const;
896:info:build                                      ^
897:info:build /opt/local/var/macports/build/_opt_local_var_macports_sources_rsync.macports.org_macports_release_tarballs_ports_textproc_pdf2htmlex/pdf2htmlex/work/pdf2htmlEX-43e3174cbc/src/HTMLRenderer/font.cc:107:38: error: cannot initialize a parameter of type 'int' with an rvalue of type 'Object *'
898:info:build         if(dict->lookup("FontFile3", &obj)->isStream())
899:info:build                                      ^~~~
900:info:build /opt/local/include/poppler/Dict.h:81:38: note: passing argument to parameter 'recursion' here
901:info:build   Object lookup(const char *key, int recursion = 0) const;
902:info:build                                      ^
903:info:build /opt/local/var/macports/build/_opt_local_var_macports_sources_rsync.macports.org_macports_release_tarballs_ports_textproc_pdf2htmlex/pdf2htmlex/work/pdf2htmlEX-43e3174cbc/src/HTMLRenderer/font.cc:109:55: error: cannot initialize a parameter of type 'int' with an rvalue of type 'Object *'
904:info:build             if(obj.streamGetDict()->lookup("Subtype", &obj1)->isName())
905:info:build                                                       ^~~~~
906:info:build /opt/local/include/poppler/Dict.h:81:38: note: passing argument to parameter 'recursion' here
907:info:build   Object lookup(const char *key, int recursion = 0) const;
908:info:build                                      ^
909:info:build /opt/local/var/macports/build/_opt_local_var_macports_sources_rsync.macports.org_macports_release_tarballs_ports_textproc_pdf2htmlex/pdf2htmlex/work/pdf2htmlEX-43e3174cbc/src/HTMLRenderer/font.cc:132:44: error: cannot initialize a parameter of type 'int' with an rvalue of type 'Object *'
910:info:build         else if (dict->lookup("FontFile2", &obj)->isStream())
911:info:build                                            ^~~~
912:info:build /opt/local/include/poppler/Dict.h:81:38: note: passing argument to parameter 'recursion' here
913:info:build   Object lookup(const char *key, int recursion = 0) const;
914:info:build                                      ^
915:info:build /opt/local/var/macports/build/_opt_local_var_macports_sources_rsync.macports.org_macports_release_tarballs_ports_textproc_pdf2htmlex/pdf2htmlex/work/pdf2htmlEX-43e3174cbc/src/HTMLRenderer/font.cc:136:43: error: cannot initialize a parameter of type 'int' with an rvalue of type 'Object *'
916:info:build         else if (dict->lookup("FontFile", &obj)->isStream())
917:info:build                                           ^~~~
918:info:build /opt/local/include/poppler/Dict.h:81:38: note: passing argument to parameter 'recursion' here
919:info:build   Object lookup(const char *key, int recursion = 0) const;
920:info:build                                      ^
921:info:build /opt/local/var/macports/build/_opt_local_var_macports_sources_rsync.macports.org_macports_release_tarballs_ports_textproc_pdf2htmlex/pdf2htmlex/work/pdf2htmlEX-43e3174cbc/src/HTMLRenderer/font.cc:174:10: error: 'free' is a private member of 'Object'
922:info:build     obj2.free();
923:info:build          ^
924:info:build /opt/local/include/poppler/Object.h:301:8: note: declared private here
925:info:build   void free();
926:info:build        ^
927:info:build /opt/local/var/macports/build/_opt_local_var_macports_sources_rsync.macports.org_macports_release_tarballs_ports_textproc_pdf2htmlex/pdf2htmlex/work/pdf2htmlEX-43e3174cbc/src/HTMLRenderer/font.cc:175:10: error: 'free' is a private member of 'Object'
928:info:build     obj1.free();
929:info:build          ^
930:info:build /opt/local/include/poppler/Object.h:301:8: note: declared private here
931:info:build   void free();
932:info:build        ^
933:info:build /opt/local/var/macports/build/_opt_local_var_macports_sources_rsync.macports.org_macports_release_tarballs_ports_textproc_pdf2htmlex/pdf2htmlex/work/pdf2htmlEX-43e3174cbc/src/HTMLRenderer/font.cc:176:9: error: 'free' is a private member of 'Object'
934:info:build     obj.free();
935:info:build         ^
936:info:build /opt/local/include/poppler/Object.h:301:8: note: declared private here
937:info:build   void free();
938:info:build        ^
939:info:build /opt/local/var/macports/build/_opt_local_var_macports_sources_rsync.macports.org_macports_release_tarballs_ports_textproc_pdf2htmlex/pdf2htmlex/work/pdf2htmlEX-43e3174cbc/src/HTMLRenderer/font.cc:178:18: error: 'free' is a private member of 'Object'
940:info:build     fontdesc_obj.free();
941:info:build                  ^
942:info:build /opt/local/include/poppler/Object.h:301:8: note: declared private here
943:info:build   void free();
944:info:build        ^
945:info:build /opt/local/var/macports/build/_opt_local_var_macports_sources_rsync.macports.org_macports_release_tarballs_ports_textproc_pdf2htmlex/pdf2htmlex/work/pdf2htmlEX-43e3174cbc/src/HTMLRenderer/font.cc:179:15: error: 'free' is a private member of 'Object'
946:info:build     font_obj2.free();
947:info:build               ^
948:info:build /opt/local/include/poppler/Object.h:301:8: note: declared private here
949:info:build   void free();
950:info:build        ^
951:info:build /opt/local/var/macports/build/_opt_local_var_macports_sources_rsync.macports.org_macports_release_tarballs_ports_textproc_pdf2htmlex/pdf2htmlex/work/pdf2htmlEX-43e3174cbc/src/HTMLRenderer/font.cc:180:14: error: 'free' is a private member of 'Object'
952:info:build     font_obj.free();
953:info:build              ^
954:info:build /opt/local/include/poppler/Object.h:301:8: note: declared private here
955:info:build   void free();
956:info:build        ^
957:info:build 3 warnings and 3 errors generated.
958:info:build make[2]: *** [CMakeFiles/pdf2htmlEX.dir/src/HTMLRenderer/outline.cc.o] Error 1
959:info:build make[2]: *** Waiting for unfinished jobs....
960:info:build [ 45%] Building CXX object CMakeFiles/pdf2htmlEX.dir/src/util/path.cc.o
961:info:build /usr/bin/clang++   -I/opt/local/var/macports/build/_opt_local_var_macports_sources_rsync.macports.org_macports_release_tarballs_ports_textproc_pdf2htmlex/pdf2htmlex/work/pdf2htmlEX-43e3174cbc/src -I/opt/local/include/poppler -I/opt/local/include/fontforge -I/opt/local/include  -pipe -Os -stdlib=libc++ -Wall -stdlib=libc++ -std=c++0x -O2 -DNDEBUG -arch x86_64 -mmacosx-version-min=10.13   -o CMakeFiles/pdf2htmlEX.dir/src/util/path.cc.o -c /opt/local/var/macports/build/_opt_local_var_macports_sources_rsync.macports.org_macports_release_tarballs_ports_textproc_pdf2htmlex/pdf2htmlex/work/pdf2htmlEX-43e3174cbc/src/util/path.cc
962:info:build /opt/local/var/macports/build/_opt_local_var_macports_sources_rsync.macports.org_macports_release_tarballs_ports_textproc_pdf2htmlex/pdf2htmlex/work/pdf2htmlEX-43e3174cbc/src/HTMLRenderer/font.cc:622:32: error: member function 'mapToUnicode' not viable: 'this' argument has type 'const CharCodeToUnicode', but function is not marked const
963:info:build                 int n = ctu ? (ctu->mapToUnicode(cur_code, &pu)) : 0;
964:info:build                                ^~~
965:info:build /opt/local/include/poppler/CharCodeToUnicode.h:98:7: note: 'mapToUnicode' declared here
966:info:build   int mapToUnicode(CharCode c, Unicode **u);
967:info:build       ^
968:info:build /opt/local/var/macports/build/_opt_local_var_macports_sources_rsync.macports.org_macports_release_tarballs_ports_textproc_pdf2htmlex/pdf2htmlex/work/pdf2htmlEX-43e3174cbc/src/HTMLRenderer/font.cc:744:13: error: member function 'decRefCnt' not viable: 'this' argument has type 'const CharCodeToUnicode', but function is not marked const
969:info:build             ctu->decRefCnt();
970:info:build             ^~~
971:info:build /opt/local/include/poppler/CharCodeToUnicode.h:87:8: note: 'decRefCnt' declared here
972:info:build   void decRefCnt();
973:info:build        ^
974:info:build 3 warnings generated.
975:info:build 3 warnings generated.
976:info:build 3 warnings and 18 errors generated.
977:info:build make[2]: *** [CMakeFiles/pdf2htmlEX.dir/src/HTMLRenderer/font.cc.o] Error 1
978:info:build 3 warnings generated.
979:info:build make[2]: Leaving directory `/opt/local/var/macports/build/_opt_local_var_macports_sources_rsync.macports.org_macports_release_tarballs_ports_textproc_pdf2htmlex/pdf2htmlex/work/build'
980:info:build make[1]: *** [CMakeFiles/pdf2htmlEX.dir/all] Error 2
981:info:build make[1]: Leaving directory `/opt/local/var/macports/build/_opt_local_var_macports_sources_rsync.macports.org_macports_release_tarballs_ports_textproc_pdf2htmlex/pdf2htmlex/work/build'
982:info:build make: *** [all] Error 2
983:info:build make: Leaving directory `/opt/local/var/macports/build/_opt_local_var_macports_sources_rsync.macports.org_macports_release_tarballs_ports_textproc_pdf2htmlex/pdf2htmlex/work/build'
984:info:build Command failed:  cd "/opt/local/var/macports/build/_opt_local_var_macports_sources_rsync.macports.org_macports_release_tarballs_ports_textproc_pdf2htmlex/pdf2htmlex/work/build" && /usr/bin/make -j8 -w all VERBOSE=ON
985:info:build Exit code: 2
986:error:build Failed to build pdf2htmlex: command execution failed
987:debug:build Error code: CHILDSTATUS 69619 2
988:debug:build Backtrace: command execution failed
989:debug:build     while executing
990:debug:build "system {*}$notty {*}$nice $fullcmdstring"
991:debug:build     invoked from within
992:debug:build "command_exec build"
993:debug:build     (procedure "portbuild::build_main" line 8)
994:debug:build     invoked from within
995:debug:build "$procedure $targetname"
996:error:build See /opt/local/var/macports/logs/_opt_local_var_macports_sources_rsync.macports.org_macports_release_tarballs_ports_textproc_pdf2htmlex/pdf2htmlex/main.log for details.