Opened 13 years ago

Closed 13 years ago

Last modified 11 years ago

#13659 closed defect (invalid)

tk 8.4.16 fails to build

Reported by: glen.henshaw@… Owned by: mww@…
Priority: Normal Milestone:
Component: ports Version: 1.6.0
Keywords: Cc:
Port:

Description (last modified by jmpp@…)

PowerBook G4, MacOSX 10.5.1, XCode 3.0

tk 8.4.16 fails to build with the following error:

Macintosh:~ ghenshaw$ sudo /opt/local/bin/port clean --all -f tk
--->  Cleaning tk
Macintosh:~ ghenshaw$ sudo /opt/local/bin/port upgrade tk
--->  Fetching tk
--->  Attempting to fetch tk8.4.16-src.tar.gz from http://downloads.sourceforge.net/tcl
--->  Attempting to fetch tcl8.4.16-src.tar.gz from http://downloads.sourceforge.net/tcl
--->  Verifying checksum(s) for tk
--->  Extracting tk
--->  Configuring tk
--->  Building tk with target all
Error: Target org.macports.build returned: shell command " cd "/opt/local/var/macports/build/_opt_local_var_macports_sources_rsync.macports.org_release_ports_x11_tk/work/tk8.4.16/unix" && make all " returned error 2
Command output: /opt/local/var/macports/build/_opt_local_var_macports_sources_rsync.macports.org_release_ports_x11_tk/work/tk8.4.16/unix/../generic/tk3d.c:139: error: syntax error before ')' token
/opt/local/var/macports/build/_opt_local_var_macports_sources_rsync.macports.org_release_ports_x11_tk/work/tk8.4.16/unix/../generic/tk3d.c:139: error: syntax error before ')' token
/opt/local/var/macports/build/_opt_local_var_macports_sources_rsync.macports.org_release_ports_x11_tk/work/tk8.4.16/unix/../generic/tk3d.c:140: error: syntax error before ')' token
/opt/local/var/macports/build/_opt_local_var_macports_sources_rsync.macports.org_release_ports_x11_tk/work/tk8.4.16/unix/../generic/tk3d.c: In function 'Tk_Get3DBorder':
/opt/local/var/macports/build/_opt_local_var_macports_sources_rsync.macports.org_release_ports_x11_tk/work/tk8.4.16/unix/../generic/tk3d.c:199: error: syntax error before ')' token
/opt/local/var/macports/build/_opt_local_var_macports_sources_rsync.macports.org_release_ports_x11_tk/work/tk8.4.16/unix/../generic/tk3d.c:210: error: syntax error before ')' token
/opt/local/var/macports/build/_opt_local_var_macports_sources_rsync.macports.org_release_ports_x11_tk/work/tk8.4.16/unix/../generic/tk3d.c:210: error: syntax error before ')' token
/opt/local/var/macports/build/_opt_local_var_macports_sources_rsync.macports.org_release_ports_x11_tk/work/tk8.4.16/unix/../generic/tk3d.c:211: error: syntax error before ')' token
/opt/local/var/macports/build/_opt_local_var_macports_sources_rsync.macports.org_release_ports_x11_tk/work/tk8.4.16/unix/../generic/tk3d.c:233: error: syntax error before ')' token
/opt/local/var/macports/build/_opt_local_var_macports_sources_rsync.macports.org_release_ports_x11_tk/work/tk8.4.16/unix/../generic/tk3d.c:233: error: syntax error before ')' token
/opt/local/var/macports/build/_opt_local_var_macports_sources_rsync.macports.org_release_ports_x11_tk/work/tk8.4.16/unix/../generic/tk3d.c:234: error: syntax error before ')' token
/opt/local/var/macports/build/_opt_local_var_macports_sources_rsync.macports.org_release_ports_x11_tk/work/tk8.4.16/unix/../generic/tk3d.c:235: error: syntax error before ')' token
/opt/local/var/macports/build/_opt_local_var_macports_sources_rsync.macports.org_release_ports_x11_tk/work/tk8.4.16/unix/../generic/tk3d.c:236: error: syntax error before ')' token
/opt/local/var/macports/build/_opt_local_var_macports_sources_rsync.macports.org_release_ports_x11_tk/work/tk8.4.16/unix/../generic/tk3d.c: In function 'Tk_Draw3DPolygon':
/opt/local/var/macports/build/_opt_local_var_macports_sources_rsync.macports.org_release_ports_x11_tk/work/tk8.4.16/unix/../generic/tk3d.c:775: error: syntax error before ')' token
/opt/local/var/macports/build/_opt_local_var_macports_sources_rsync.macports.org_release_ports_x11_tk/work/tk8.4.16/unix/../generic/tk3d.c: In function 'Tk_Fill3DRectangle':
/opt/local/var/macports/build/_opt_local_var_macports_sources_rsync.macports.org_release_ports_x11_tk/work/tk8.4.16/unix/../generic/tk3d.c:997: error: syntax error before ')' token
/opt/local/var/macports/build/_opt_local_var_macports_sources_rsync.macports.org_release_ports_x11_tk/work/tk8.4.16/unix/../generic/tk3d.c: In function 'Tk_Fill3DPolygon':
/opt/local/var/macports/build/_opt_local_var_macports_sources_rsync.macports.org_release_ports_x11_tk/work/tk8.4.16/unix/../generic/tk3d.c:1044: error: syntax error before ')' token
/opt/local/var/macports/build/_opt_local_var_macports_sources_rsync.macports.org_release_ports_x11_tk/work/tk8.4.16/unix/../generic/tk3d.c: In function 'Tk_Get3DBorderFromObj':
/opt/local/var/macports/build/_opt_local_var_macports_sources_rsync.macports.org_release_ports_x11_tk/work/tk8.4.16/unix/../generic/tk3d.c:1264: error: syntax error before ')' token
/opt/local/var/macports/build/_opt_local_var_macports_sources_rsync.macports.org_release_ports_x11_tk/work/tk8.4.16/unix/../generic/tk3d.c:1280: error: syntax error before ')' token
/opt/local/var/macports/build/_opt_local_var_macports_sources_rsync.macports.org_release_ports_x11_tk/work/tk8.4.16/unix/../generic/tk3d.c:1280: error: syntax error before ')' token
/opt/local/var/macports/build/_opt_local_var_macports_sources_rsync.macports.org_release_ports_x11_tk/work/tk8.4.16/unix/../generic/tk3d.c:1281: error: syntax error before ')' token
/opt/local/var/macports/build/_opt_local_var_macports_sources_rsync.macports.org_release_ports_x11_tk/work/tk8.4.16/unix/../generic/tk3d.c:1307: error: syntax error before ')' token
/opt/local/var/macports/build/_opt_local_var_macports_sources_rsync.macports.org_release_ports_x11_tk/work/tk8.4.16/unix/../generic/tk3d.c:1307: error: syntax error before ')' token
/opt/local/var/macports/build/_opt_local_var_macports_sources_rsync.macports.org_release_ports_x11_tk/work/tk8.4.16/unix/../generic/tk3d.c:1308: error: syntax error before ')' token
/opt/local/var/macports/build/_opt_local_var_macports_sources_rsync.macports.org_release_ports_x11_tk/work/tk8.4.16/unix/../generic/tk3d.c: In function 'TkDebugBorder':
/opt/local/var/macports/build/_opt_local_var_macports_sources_rsync.macports.org_release_ports_x11_tk/work/tk8.4.16/unix/../generic/tk3d.c:1391: error: syntax error before ')' token
make: *** [tk3d.o] Error 1

Error: Unable to upgrade port: 1
Macintosh:~ ghenshaw$ 

Change History (4)

comment:1 Changed 13 years ago by ryandesign (Ryan Schmidt)

Owner: changed from macports-tickets@… to mww@…

tcl and tk have been upgraded to 8.5. Please sudo port selfupdate and see whether you still experience the problem.

comment:2 Changed 13 years ago by jmpp@…

Description: modified (diff)

Please read WikiFormatting to learn how to properly paste terminal output: you should use the {{{ }}} pre-formatted text macro, thanks!

-jmpp

comment:3 Changed 13 years ago by mww@…

Resolution: invalid
Status: newclosed

please re-open this ticket if the problem persists with version 8.5.0!

comment:4 Changed 11 years ago by (none)

Milestone: Port Bugs

Milestone Port Bugs deleted

Note: See TracTickets for help on using tickets.