Opened 12 years ago

Closed 12 years ago

Last modified 5 years ago

#15736 closed defect (worksforme)

aquaterm 1.0.1 (compile error) build failure

Reported by: spamygaby@… Owned by: MarcusCalhoun-Lopez (Marcus Calhoun-Lopez)
Priority: Normal Milestone:
Component: ports Version: 1.6.0
Keywords: aquaterm fail Cc: davidm@…, jp2011213242@…
Port:

Description

I searched in the Trac bug reports but I can't figure out how to make aquaterm compile. My config is a MBPro (Core 2 Duo) with Leopard 10.5.3 and I need aquaterm for GnuPlot. I tried

port clean --all aquaterm
port install -d aquaterm

I tried to change the SDK used (with my macports.conf) to 10.5 (not 10.4), not to compile for ppc, I tried the workarounds in the bug reports, nothing works !

I cleaned and this is the build log :

bash-3.2# port install -d -f aquaterm
--->  Building aquaterm with target -buildstyle Deployment -target AquaTerm
Error: Target org.macports.build returned: shell command " cd "/opt/local/var/macports/build/_opt_local_var_macports_sources_rsync.macports.org_release_ports_aqua_aquaterm/work/aquaterm" && nice -n 15 /usr/bin/xcodebuild -buildstyle Deployment -target AquaTerm " returned error 1
Command output: 

=== BUILDING NATIVE TARGET AquaTerm WITH CONFIGURATION Deployment ===

Checking Dependencies...
Warning: Multiple build commands for output file /opt/local/var/macports/build/_opt_local_var_macports_sources_rsync.macports.org_release_ports_aqua_aquaterm/work/aquaterm/build/Deployment/AquaTerm.app/Contents/Resources/help.html

CompileC build/AquaTerm.build/Deployment/AquaTerm.build/Objects-normal/ppc/main.o /opt/local/var/macports/build/_opt_local_var_macports_sources_rsync.macports.org_release_ports_aqua_aquaterm/work/aquaterm/main.m normal ppc objective-c com.apple.compilers.gcc.4_0
    cd /opt/local/var/macports/build/_opt_local_var_macports_sources_rsync.macports.org_release_ports_aqua_aquaterm/work/aquaterm
    /Developer/usr/bin/gcc-4.0 -x objective-c -arch ppc -pipe -Wno-trigraphs -fpascal-strings -fasm-blocks -O0 -mdynamic-no-pic -fmessage-length=0 -mtune=G4 -fvisibility=hidden -mmacosx-version-min=10.1 -gdwarf-2 -I/opt/local/var/macports/build/_opt_local_var_macports_sources_rsync.macports.org_release_ports_aqua_aquaterm/work/aquaterm/build/AquaTerm.build/Deployment/AquaTerm.build/AquaTerm.hmap -Wmost -Wno-four-char-constants -Wno-unknown-pragmas -F/opt/local/var/macports/build/_opt_local_var_macports_sources_rsync.macports.org_release_ports_aqua_aquaterm/work/aquaterm/build/Deployment -I/opt/local/var/macports/build/_opt_local_var_macports_sources_rsync.macports.org_release_ports_aqua_aquaterm/work/aquaterm/build/Deployment/include -I/opt/local/var/macports/build/_opt_local_var_macports_sources_rsync.macports.org_release_ports_aqua_aquaterm/work/aquaterm/build/AquaTerm.build/Deployment/AquaTerm.build/DerivedSources -isysroot /Developer/SDKs/MacOSX10.4u.sdk -include /Library/Caches/com.apple.Xcode.0/SharedPrecompiledHeaders/AppKit-hhudddpaprlnayeiyfpjrssplngn/AppKit.h -c /opt/local/var/macports/build/_opt_local_var_macports_sources_rsync.macports.org_release_ports_aqua_aquaterm/work/aquaterm/main.m -o /opt/local/var/macports/build/_opt_local_var_macports_sources_rsync.macports.org_release_ports_aqua_aquaterm/work/aquaterm/build/AquaTerm.build/Deployment/AquaTerm.build/Objects-normal/ppc/main.o
cc1obj: warning: /Library/Caches/com.apple.Xcode.0/SharedPrecompiledHeaders/AppKit-hhudddpaprlnayeiyfpjrssplngn/AppKit.h.gch: too short to be a PCH file
cc1obj: error: /Library/Caches/com.apple.Xcode.0/SharedPrecompiledHeaders/AppKit-hhudddpaprlnayeiyfpjrssplngn/AppKit.h: No such file or directory
cc1obj: error: one or more PCH files were found, but they were invalid
cc1obj: error: use -Winvalid-pch for more information

CompileC build/AquaTerm.build/Deployment/AquaTerm.build/Objects-normal/ppc/AQTView.o /opt/local/var/macports/build/_opt_local_var_macports_sources_rsync.macports.org_release_ports_aqua_aquaterm/work/aquaterm/AQTView.m normal ppc objective-c com.apple.compilers.gcc.4_0
    cd /opt/local/var/macports/build/_opt_local_var_macports_sources_rsync.macports.org_release_ports_aqua_aquaterm/work/aquaterm
    /Developer/usr/bin/gcc-4.0 -x objective-c -arch ppc -pipe -Wno-trigraphs -fpascal-strings -fasm-blocks -O0 -mdynamic-no-pic -fmessage-length=0 -mtune=G4 -fvisibility=hidden -mmacosx-version-min=10.1 -gdwarf-2 -I/opt/local/var/macports/build/_opt_local_var_macports_sources_rsync.macports.org_release_ports_aqua_aquaterm/work/aquaterm/build/AquaTerm.build/Deployment/AquaTerm.build/AquaTerm.hmap -Wmost -Wno-four-char-constants -Wno-unknown-pragmas -F/opt/local/var/macports/build/_opt_local_var_macports_sources_rsync.macports.org_release_ports_aqua_aquaterm/work/aquaterm/build/Deployment -I/opt/local/var/macports/build/_opt_local_var_macports_sources_rsync.macports.org_release_ports_aqua_aquaterm/work/aquaterm/build/Deployment/include -I/opt/local/var/macports/build/_opt_local_var_macports_sources_rsync.macports.org_release_ports_aqua_aquaterm/work/aquaterm/build/AquaTerm.build/Deployment/AquaTerm.build/DerivedSources -isysroot /Developer/SDKs/MacOSX10.4u.sdk -include /Library/Caches/com.apple.Xcode.0/SharedPrecompiledHeaders/AppKit-hhudddpaprlnayeiyfpjrssplngn/AppKit.h -c /opt/local/var/macports/build/_opt_local_var_macports_sources_rsync.macports.org_release_ports_aqua_aquaterm/work/aquaterm/AQTView.m -o /opt/local/var/macports/build/_opt_local_var_macports_sources_rsync.macports.org_release_ports_aqua_aquaterm/work/aquaterm/build/AquaTerm.build/Deployment/AquaTerm.build/Objects-normal/ppc/AQTView.o
cc1obj: warning: /Library/Caches/com.apple.Xcode.0/SharedPrecompiledHeaders/AppKit-hhudddpaprlnayeiyfpjrssplngn/AppKit.h.gch: too short to be a PCH file
cc1obj: error: /Library/Caches/com.apple.Xcode.0/SharedPrecompiledHeaders/AppKit-hhudddpaprlnayeiyfpjrssplngn/AppKit.h: No such file or directory
cc1obj: error: one or more PCH files were found, but they were invalid
cc1obj: error: use -Winvalid-pch for more information
/opt/local/var/macports/build/_opt_local_var_macports_sources_rsync.macports.org_release_ports_aqua_aquaterm/work/aquaterm/AQTView.m: In function '-[AQTView _aqtHandleMouseDownAtLocation:button:]':
/opt/local/var/macports/build/_opt_local_var_macports_sources_rsync.macports.org_release_ports_aqua_aquaterm/work/aquaterm/AQTView.m:116: warning: no '-processEvent:' method found
/opt/local/var/macports/build/_opt_local_var_macports_sources_rsync.macports.org_release_ports_aqua_aquaterm/work/aquaterm/AQTView.m:116: warning: (Messages without a matching method signature
/opt/local/var/macports/build/_opt_local_var_macports_sources_rsync.macports.org_release_ports_aqua_aquaterm/work/aquaterm/AQTView.m:116: warning: will be assumed to return 'id' and accept
/opt/local/var/macports/build/_opt_local_var_macports_sources_rsync.macports.org_release_ports_aqua_aquaterm/work/aquaterm/AQTView.m:116: warning: '...' as arguments.)
/opt/local/var/macports/build/_opt_local_var_macports_sources_rsync.macports.org_release_ports_aqua_aquaterm/work/aquaterm/AQTView.m: In function '-[AQTView keyDown:]':
/opt/local/var/macports/build/_opt_local_var_macports_sources_rsync.macports.org_release_ports_aqua_aquaterm/work/aquaterm/AQTView.m:152: warning: no '-processEvent:' method found
** BUILD FAILED **

Error: Status 1 encountered during processing.

Change History (7)

comment:1 Changed 12 years ago by jmroot (Joshua Root)

Cc: davidm@… added
Milestone: Port Bugs

Cc maintainer. Looks like your Xcode precompiled header cache might be corrupt. Maybe you just need to clean it out.

comment:2 Changed 12 years ago by spamygaby@…

jmr, I cleaned ... Or what do you want to say by XCode precompiled header ? How can I clean that if it's not what I've done ?

comment:3 Changed 12 years ago by MarcusCalhoun-Lopez (Marcus Calhoun-Lopez)

Owner: changed from macports-tickets@… to mcalhoun@…

I am not sure that the maintainer of aquaterm responds to these message.
Is there still a problem?

If not, I will close this ticket.

comment:4 Changed 12 years ago by MarcusCalhoun-Lopez (Marcus Calhoun-Lopez)

Resolution: worksforme
Status: newclosed

Since there has been no activity on this ticket, assume that it has been resolved on way or another.

comment:5 Changed 12 years ago by jmroot (Joshua Root)

The problem appeared to be broken files in /Library/Caches/com.apple.Xcode.0/. The "Empty Caches..." menu item in XCode should clean them out.

comment:6 Changed 11 years ago by (none)

Milestone: Port Bugs

Milestone Port Bugs deleted

comment:7 Changed 5 years ago by jp2011213242@…

Cc: jp2011213242@… added

Cc Me!

Note: See TracTickets for help on using tickets.