Opened 12 years ago

Closed 12 years ago

Last modified 11 years ago

#17360 closed defect (fixed)

gtk2: error: 'RRNotify' undeclared (first use in this function)

Reported by: debitage@… Owned by: nox@…
Priority: Normal Milestone:
Component: ports Version: 1.6.0
Keywords: gimp leopard MacOS 10.5 Cc: emile.cantin.2446@…, nospam3162@…, ksze (Kal Sze), gsiciliano@…, ryandesign (Ryan Schmidt)
Port: gtk2

Description (last modified by ryandesign (Ryan Schmidt))

Attempting to install gimp 2.6.2 using 'sudo port -d install gimp' on OS X Leopard, and the install fails. Without prior experience compiling software on *nix systems, the debug and error messages are more or less Greek to me. Error message:

DEBUG: Found port in file:///opt/local/var/macports/sources/rsync.macports.org/release/ports/archivers/zlib
DEBUG: Searching for dependency: zlib
DEBUG: Found Dependency: receipt exists for zlib
DEBUG: Skipping completed org.macports.main (gtk2)
DEBUG: Skipping completed org.macports.fetch (gtk2)
DEBUG: Skipping completed org.macports.checksum (gtk2)
DEBUG: setting option extract.cmd to /usr/bin/bzip2
DEBUG: Skipping completed org.macports.extract (gtk2)
DEBUG: Skipping completed org.macports.patch (gtk2)
DEBUG: Skipping completed org.macports.configure (gtk2)
--->  Building gtk2 with target all
DEBUG: Executing org.macports.build (gtk2)
DEBUG: Environment: 
DEBUG: port allows a parallel build
DEBUG: port allows a parallel build
DEBUG: Assembled command: 'cd "/opt/local/var/macports/build/_opt_local_var_macports_sources_rsync.macports.org_release_ports_x11_gtk2/work/gtk+-2.14.4" && make all'
make  all-recursive
Making all in po
make[2]: Nothing to be done for `all'.
Making all in po-properties
make[2]: Nothing to be done for `all'.
Making all in gdk-pixbuf
make  all-recursive
Making all in pixops
make[4]: Nothing to be done for `all'.
Making all in gdk
make  all-recursive
Making all in x11
if /bin/sh ../../libtool --mode=compile /usr/bin/gcc-4.0 -DHAVE_CONFIG_H -I. -I. -I../.. -DG_LOG_DOMAIN=\"Gdk\" -DGDK_COMPILATION -I../.. -I../../gdk -I../../gdk -DG_DISABLE_CAST_CHECKS -D_REENTRANT -I/opt/local/include/glib-2.0 -I/opt/local/lib/glib-2.0/include -I/opt/local/include -I/opt/local/include/pango-1.0 -I/opt/local/include/cairo -I/opt/local/include/pixman-1 -I/opt/local/include/freetype2 -I/opt/local/include/libpng12 -I/usr/X11/include      -I/opt/local/include -no-cpp-precomp -DX_LOCALE -I/usr/X11R6/include -DG_DISABLE_SINGLE_INCLUDES -DATK_DISABLE_SINGLE_INCLUDES -DGDK_PIXBUF_DISABLE_SINGLE_INCLUDES -DGTK_DISABLE_SINGLE_INCLUDES -I/opt/local/include -I/usr/X11/include    -DGDK_PIXBUF_DISABLE_DEPRECATED -O2 -funroll-loops -fstrict-aliasing -Wall -MT gdkevents-x11.lo -MD -MP -MF ".deps/gdkevents-x11.Tpo" \
          -c -o gdkevents-x11.lo `test -f 'gdkevents-x11.c' || echo './'`gdkevents-x11.c; \
        then mv -f ".deps/gdkevents-x11.Tpo" ".deps/gdkevents-x11.Plo"; \
        else rm -f ".deps/gdkevents-x11.Tpo"; exit 1; \
        fi
 /usr/bin/gcc-4.0 -DHAVE_CONFIG_H -I. -I. -I../.. -DG_LOG_DOMAIN=\"Gdk\" -DGDK_COMPILATION -I../.. -I../../gdk -I../../gdk -DG_DISABLE_CAST_CHECKS -D_REENTRANT -I/opt/local/include/glib-2.0 -I/opt/local/lib/glib-2.0/include -I/opt/local/include -I/opt/local/include/pango-1.0 -I/opt/local/include/cairo -I/opt/local/include/pixman-1 -I/opt/local/include/freetype2 -I/opt/local/include/libpng12 -I/usr/X11/include -I/opt/local/include -no-cpp-precomp -DX_LOCALE -I/usr/X11R6/include -DG_DISABLE_SINGLE_INCLUDES -DATK_DISABLE_SINGLE_INCLUDES -DGDK_PIXBUF_DISABLE_SINGLE_INCLUDES -DGTK_DISABLE_SINGLE_INCLUDES -I/opt/local/include -I/usr/X11/include -DGDK_PIXBUF_DISABLE_DEPRECATED -O2 -funroll-loops -fstrict-aliasing -Wall -MT gdkevents-x11.lo -MD -MP -MF .deps/gdkevents-x11.Tpo -c gdkevents-x11.c  -fno-common -DPIC -o .libs/gdkevents-x11.o
gdkevents-x11.c: In function 'gdk_event_translate':
gdkevents-x11.c:2110: error: 'RRNotify' undeclared (first use in this function)
gdkevents-x11.c:2110: error: (Each undeclared identifier is reported only once
gdkevents-x11.c:2110: error: for each function it appears in.)
gdkevents-x11.c:2112: error: 'XRRNotifyEvent' undeclared (first use in this function)
gdkevents-x11.c:2112: error: 'notify' undeclared (first use in this function)
gdkevents-x11.c:2112: error: syntax error before ')' token
gdkevents-x11.c: In function 'gdk_x11_screen_get_window_manager_name':
gdkevents-x11.c:2721: warning: dereferencing type-punned pointer will break strict-aliasing rules
gdkevents-x11.c: In function 'gdk_x11_screen_supports_net_wm_hint':




gdkevents-x11.c:2821: warning: dereferencing type-punned pointer will break strict-aliasing rules
make[4]: *** [gdkevents-x11.lo] Error 1
make[3]: *** [all-recursive] Error 1
make[2]: *** [all] Error 2
make[1]: *** [all-recursive] Error 1
make: *** [all] Error 2
Error: Target org.macports.build returned: shell command " cd "/opt/local/var/macports/build/_opt_local_var_macports_sources_rsync.macports.org_release_ports_x11_gtk2/work/gtk+-2.14.4" && make all " returned error 2
Command output: make[2]: Nothing to be done for `all'.
Making all in gdk-pixbuf
make  all-recursive
Making all in pixops
make[4]: Nothing to be done for `all'.
Making all in gdk
make  all-recursive
Making all in x11
if /bin/sh ../../libtool --mode=compile /usr/bin/gcc-4.0 -DHAVE_CONFIG_H -I. -I. -I../.. -DG_LOG_DOMAIN=\"Gdk\" -DGDK_COMPILATION -I../.. -I../../gdk -I../../gdk -DG_DISABLE_CAST_CHECKS -D_REENTRANT -I/opt/local/include/glib-2.0 -I/opt/local/lib/glib-2.0/include -I/opt/local/include -I/opt/local/include/pango-1.0 -I/opt/local/include/cairo -I/opt/local/include/pixman-1 -I/opt/local/include/freetype2 -I/opt/local/include/libpng12 -I/usr/X11/include      -I/opt/local/include -no-cpp-precomp -DX_LOCALE -I/usr/X11R6/include -DG_DISABLE_SINGLE_INCLUDES -DATK_DISABLE_SINGLE_INCLUDES -DGDK_PIXBUF_DISABLE_SINGLE_INCLUDES -DGTK_DISABLE_SINGLE_INCLUDES -I/opt/local/include -I/usr/X11/include    -DGDK_PIXBUF_DISABLE_DEPRECATED -O2 -funroll-loops -fstrict-aliasing -Wall -MT gdkevents-x11.lo -MD -MP -MF ".deps/gdkevents-x11.Tpo" \
          -c -o gdkevents-x11.lo `test -f 'gdkevents-x11.c' || echo './'`gdkevents-x11.c; \
        then mv -f ".deps/gdkevents-x11.Tpo" ".deps/gdkevents-x11.Plo"; \
        else rm -f ".deps/gdkevents-x11.Tpo"; exit 1; \
        fi
 /usr/bin/gcc-4.0 -DHAVE_CONFIG_H -I. -I. -I../.. -DG_LOG_DOMAIN=\"Gdk\" -DGDK_COMPILATION -I../.. -I../../gdk -I../../gdk -DG_DISABLE_CAST_CHECKS -D_REENTRANT -I/opt/local/include/glib-2.0 -I/opt/local/lib/glib-2.0/include -I/opt/local/include -I/opt/local/include/pango-1.0 -I/opt/local/include/cairo -I/opt/local/include/pixman-1 -I/opt/local/include/freetype2 -I/opt/local/include/libpng12 -I/usr/X11/include -I/opt/local/include -no-cpp-precomp -DX_LOCALE -I/usr/X11R6/include -DG_DISABLE_SINGLE_INCLUDES -DATK_DISABLE_SINGLE_INCLUDES -DGDK_PIXBUF_DISABLE_SINGLE_INCLUDES -DGTK_DISABLE_SINGLE_INCLUDES -I/opt/local/include -I/usr/X11/include -DGDK_PIXBUF_DISABLE_DEPRECATED -O2 -funroll-loops -fstrict-aliasing -Wall -MT gdkevents-x11.lo -MD -MP -MF .deps/gdkevents-x11.Tpo -c gdkevents-x11.c  -fno-common -DPIC -o .libs/gdkevents-x11.o
gdkevents-x11.c: In function 'gdk_event_translate':
gdkevents-x11.c:2110: error: 'RRNotify' undeclared (first use in this function)
gdkevents-x11.c:2110: error: (Each undeclared identifier is reported only once
gdkevents-x11.c:2110: error: for each function it appears in.)
gdkevents-x11.c:2112: error: 'XRRNotifyEvent' undeclared (first use in this function)
gdkevents-x11.c:2112: error: 'notify' undeclared (first use in this function)
gdkevents-x11.c:2112: error: syntax error before ')' token
gdkevents-x11.c: In function 'gdk_x11_screen_get_window_manager_name':
gdkevents-x11.c:2721: warning: dereferencing type-punned pointer will break strict-aliasing rules
gdkevents-x11.c: In function 'gdk_x11_screen_supports_net_wm_hint':
gdkevents-x11.c:2821: warning: dereferencing type-punned pointer will break strict-aliasing rules
make[4]: *** [gdkevents-x11.lo] Error 1
make[3]: *** [all-recursive] Error 1
make[2]: *** [all] Error 2
make[1]: *** [all-recursive] Error 1
make: *** [all] Error 2

Warning: the following items did not execute (for gtk2): org.macports.activate org.macports.build org.macports.destroot org.macports.install
Error: The following dependencies failed to build: gimp-app gimp2 gegl gtk2 libopenraw boost boost-jam librsvg libart_lgpl libcroco libgsf bzip2 dbus dbus-glib gnome-vfs desktop-file-utils popt gconf orbit2 libidl gnome-mime-data openssl libbonobo libsdl lua readline openexr ilmbase libtool automake autoconf help2man p5-locale-gettext m4 libexif libgnomeui gnome-icon-theme hicolor-icon-theme icon-naming-utils p5-xml-simple p5-xml-namespacesupport p5-xml-sax gnome-keyring libgcrypt libgpg-error libtasn1 libbonoboui libglade2 libgnome esound audiofile libgnomecanvas libmng lcms libwmf poppler openjpeg poppler-data py25-gtk py25-cairo py25-numpy fftw-3 py25-hashlib python25 py25-nose py25-setuptools py25-zlib py25-gobject libxslt gimp-jp2 gimp-lqr-plugin liblqr gtk-nodoka-engine coreutils gutenprint icns-gimp macclipboard-gimp macfile-gimp ufraw exiv2 xsane sane-backends libusb
Error: Status 1 encountered during processing.

That's it. I've tried a few variants, attempted install from both the MacOS X terminal window and an xterm window (does this make any difference?) - no dice. Any suggestions would be greatly appreciated.

AC

Change History (21)

comment:1 Changed 12 years ago by mf2k (Frank Schima)

Description: modified (diff)
Owner: changed from macports-tickets@… to nox@…
Port: gtk2 added; gimp removed
Priority: HighNormal
Summary: gimp 2.6.2 install failure on Leopard (10.5)gtk2 install failure while building gimp 2.6.2 on Leopard (10.5)

This is really a gtk2 build issue. Assigning to maintainer.

comment:2 Changed 12 years ago by blb@…

What version of Xcode do you have installed?

comment:3 in reply to:  2 Changed 12 years ago by debitage@…

Replying to blb@…:

What version of Xcode do you have installed?

Xcode v3.0

comment:4 Changed 12 years ago by blb@…

This may be one of the issues solved by either upgrading to Xcode 3.1 (which updates the X11SDK) or installing Xquartz.

comment:5 in reply to:  4 ; Changed 12 years ago by debitage@…

Replying to blb@…:

This may be one of the issues solved by either upgrading to Xcode 3.1 (which updates the X11SDK) or installing Xquartz.

Thanks - while upgrading to Xcode 3.1 didn't seem to help, upgrading Xquartz got me a lot further. Now it's hanging up right after the Python 2.5 install. The latest error trap:

DEBUG: Executing org.macports.patch (py25-hashlib)
DEBUG: Executing org.macports.configure (py25-hashlib)
DEBUG: Executing org.macports.build (py25-hashlib)
DEBUG: Environment: 
DEBUG: Assembled command: 'cd "/opt/local/var/macports/build/_opt_local_var_macports_sources_rsync.macports.org_release_ports_python_py25-hashlib/work/Python-2.5.2/Modules" && /opt/local/bin/python2.5 setup.py build'
Error: Target org.macports.build returned: shell command " cd "/opt/local/var/macports/build/_opt_local_var_macports_sources_rsync.macports.org_release_ports_python_py25-hashlib/work/Python-2.5.2/Modules" && /opt/local/bin/python2.5 setup.py build " returned error 1
Command output: running build
running build_ext
building '_hashlib' extension
creating build
creating build/temp.macosx-10.3-i386-2.5
-DNDEBUG -g -fwrapv -O3 -Wall -Wstrict-prototypes -I/opt/local/include -I/opt/local/Library/Frameworks/Python.framework/Versions/2.5/include/python2.5 -c _hashopenssl.c -o build/temp.macosx-10.3-i386-2.5/_hashopenssl.o
unable to execute -DNDEBUG: No such file or directory
error: command '-DNDEBUG' failed with exit status 1

Error: The following dependencies failed to build: gimp-app gimp2 py25-gtk py25-cairo py25-numpy py25-hashlib py25-nose py25-setuptools py25-zlib py25-gobject libxslt gimp-jp2 gimp-lqr-plugin liblqr gtk-nodoka-engine coreutils gutenprint icns-gimp macclipboard-gimp macfile-gimp ufraw exiv2 xsane sane-backends libusb
Error: Status 1 encountered during processing.

comment:6 in reply to:  5 Changed 12 years ago by blb@…

Replying to debitage@…:

Thanks - while upgrading to Xcode 3.1 didn't seem to help, upgrading Xquartz got me a lot further. Now it's hanging up right after the Python 2.5 install. The latest error trap:
...
unable to execute -DNDEBUG: No such file or directory

That's the Tcl env bug (#13930); run sudo port clean --work py25-hashlib then try your install again.

comment:7 Changed 12 years ago by debitage@…

Success!!! Thanks for your help, all.

comment:8 Changed 12 years ago by mf2k (Frank Schima)

Resolution: worksforme
Status: newclosed

comment:9 Changed 12 years ago by jeremyhu (Jeremy Huddleston Sequoia)

Description: modified (diff)
Resolution: worksforme
Status: closedreopened

It looks like gtk2 should probably have:

depends_lib lib:libXrandr.2:xorg-libXrandr

(I'll add the xorg-libXrandr now...)

comment:10 Changed 12 years ago by steven@…

I got the same error. Installing "xorg-libXrandr" and then gtk2 worked for me too.

comment:11 Changed 12 years ago by blb@…

Cc: emile.cantin.2446@… added

Cc reporter of dup #17675.

comment:12 Changed 12 years ago by dbevans (David B. Evans)

Cc: nospam3162@… added
Description: modified (diff)

CC reporter of dup #18014

comment:13 Changed 12 years ago by ryandesign (Ryan Schmidt)

Cc: swordangel@… added
Description: modified (diff)

CC reporter of dup #17491.

comment:14 Changed 12 years ago by ryandesign (Ryan Schmidt)

Description: modified (diff)

comment:15 Changed 12 years ago by ryandesign (Ryan Schmidt)

Cc: gsiciliano@… ryandesign@… added
Summary: gtk2 install failure while building gimp 2.6.2 on Leopard (10.5)gtk2: RRNotify' undeclared (first use in this function)

CC reporter of dup #17886.

comment:16 in reply to:  9 Changed 12 years ago by ryandesign (Ryan Schmidt)

Replying to jeremyhu@…:

It looks like gtk2 should probably have:

depends_lib lib:libXrandr.2:xorg-libXrandr

(I'll add the xorg-libXrandr now...)

Jeremy added the libXrandr dependency in r43834.

comment:17 in reply to:  4 ; Changed 12 years ago by ryandesign (Ryan Schmidt)

Summary: gtk2: RRNotify' undeclared (first use in this function)gtk2: error: 'RRNotify' undeclared (first use in this function)

Replying to blb@…:

This may be one of the issues solved by either upgrading to Xcode 3.1 (which updates the X11SDK) or installing Xquartz.

I have Leopard with Xcode 3.1.1 and without Xquartz, and gtk2 builds fine (modulo #17356). I will now try to downgrade to Xcode 3.0 and see if I can produce the failure. If so, I will have the port require Xcode 3.1 or greater, as suggested in #17720.

comment:18 in reply to:  17 Changed 12 years ago by ryandesign (Ryan Schmidt)

Resolution: fixed
Status: reopenedclosed

Replying to ryandesign@…:

Replying to blb@…:

This may be one of the issues solved by either upgrading to Xcode 3.1 (which updates the X11SDK) or installing Xquartz.

I have Leopard with Xcode 3.1.1 and without Xquartz, and gtk2 builds fine (modulo #17356). I will now try to downgrade to Xcode 3.0 and see if I can produce the failure. If so, I will have the port require Xcode 3.1 or greater, as suggested in #17720.

I uninstalled Xcode 3.1.1 using

cd /Developer/Library
sudo ./uninstall-devtools

Then I installed Xcode 3.0 from xcode_3.0.dmg. Then I forced a rebuild of gtk2 @2.14.7_1+x11 with

port -nf upgrade gtk2

It worked fine, so I don't think older Xcode is implicated. And I still don't have Xquartz installed, so that's not necessary for the solution either.

The bug report was originally for gtk2 @2.14.4. Maybe it was the gtk2 version bump or the X11 work Jeremy has been putting in, but whatever the reason I think this is fixed so I'll close the ticket. Please re-open if you still see the problem after sudo port sync

comment:19 Changed 12 years ago by (none)

Milestone: Port Bugs

Milestone Port Bugs deleted

comment:20 in reply to:  19 Changed 11 years ago by mike_keller0@…

I am still having this issue. PPC (PowerMac G5 Dual Core 2.0GHz) Tiger (10.4.11), MacPorts 1.8.0, Xcode 2.4.1. I have installed Xquartz from ports, I have run selfupdate, I have run sync, I have installed xorg-libXrandr, I have even removed all ports and reinstalled them. This is a recently reloaded system (hard drive failure) and I am trying to install Wireshark. I had it installed before, so it used to work at one time. Please help.

sudo port install gtk2
--->  Computing dependencies for gtk2
--->  Fetching gtk2
--->  Attempting to fetch gtk+-2.16.6.tar.bz2 from ftp://ftp.gtk.org/pub/gtk/2.16/
--->  Verifying checksum(s) for gtk2
--->  Extracting gtk2
--->  Applying patches to gtk2
--->  Configuring gtk2
--->  Building gtk2
Error: Target org.macports.build returned: shell command " cd "/opt/local/var/macports/build/_opt_local_var_macports_sources_rsync.macports.org_release_ports_x11_gtk2/work/gtk+-2.16.6" && /usr/bin/make -j2 all " returned error 2
Command output:    && rm -f text-x-generic.png					\
   && ln -s gtk-file.png text-x-generic.png			\
) done								\
&& touch stamp-icons
echo "#ifndef GTK_DISABLE_DEPRECATED" > xgen-gmh					\
        && glib-genmarshal --prefix=gtk_marshal ./gtkmarshal.list --header >> xgen-gmh \
&& echo "#endif /* GTK_DISABLE_DEPRECATED */" >> xgen-gmh \
&& (cmp -s xgen-gmh gtkmarshal.h || cp xgen-gmh gtkmarshal.h) \
&& rm -f xgen-gmh \
&& echo timestamp > stamp-gtkmarshal.h
( cd . && glib-mkenums --template gtktypebuiltins.h.template \
	gtk.h gtkaboutdialog.h gtkaccelgroup.h gtkaccellabel.h gtkaccelmap.h gtkaccessible.h gtkaction.h gtkactiongroup.h gtkactivatable.h gtkadjustment.h gtkalignment.h gtkarrow.h gtkaspectframe.h gtkassistant.h gtkbbox.h gtkbin.h gtkbindings.h gtkbox.h gtkbuilder.h gtkbuildable.h gtkbutton.h gtkcalendar.h gtkcelleditable.h gtkcelllayout.h gtkcellrenderer.h gtkcellrendereraccel.h gtkcellrenderercombo.h gtkcellrendererpixbuf.h gtkcellrendererprogress.h gtkcellrendererspin.h gtkcellrenderertext.h gtkcellrenderertoggle.h gtkcellview.h gtkcheckbutton.h gtkcheckmenuitem.h gtkclipboard.h gtkcolorbutton.h gtkcolorsel.h gtkcolorseldialog.h gtkcombobox.h gtkcomboboxentry.h gtkcontainer.h gtkcurve.h gtkdebug.h gtkdialog.h gtkdnd.h gtkdrawingarea.h gtkeditable.h gtkentry.h gtkentrycompletion.h gtkenums.h gtkeventbox.h gtkexpander.h gtkfilechooser.h gtkfilechooserbutton.h gtkfilechooserdialog.h gtkfilechooserwidget.h gtkfilefilter.h gtkfixed.h gtkfontbutton.h gtkfontsel.h gtkframe.h gtkgamma.h gtkgc.h gtkhandlebox.h gtkhbbox.h gtkhbox.h gtkhpaned.h gtkhruler.h gtkhscale.h gtkhscrollbar.h gtkhseparator.h gtkhsv.h gtkiconfactory.h gtkicontheme.h gtkiconview.h gtkimage.h gtkimagemenuitem.h gtkimcontext.h gtkimcontextsimple.h gtkimmodule.h gtkimmulticontext.h gtkinputdialog.h gtkinvisible.h gtkitem.h gtklabel.h gtklayout.h gtklinkbutton.h gtkliststore.h gtkmain.h gtkmenu.h gtkmenubar.h gtkmenuitem.h gtkmenushell.h gtkmenutoolbutton.h gtkmessagedialog.h gtkmisc.h gtkmodules.h gtkmountoperation.h gtknotebook.h gtkobject.h gtkorientable.h gtkpagesetup.h gtkpaned.h gtkpapersize.h gtkplug.h gtkprintcontext.h gtkprintoperation.h gtkprintoperationpreview.h gtkprintsettings.h gtkprivate.h gtkprogressbar.h gtkradioaction.h gtkradiobutton.h gtkradiomenuitem.h gtkradiotoolbutton.h gtkrange.h gtkrc.h gtkrecentaction.h gtkrecentchooser.h gtkrecentchooserdialog.h gtkrecentchoosermenu.h gtkrecentchooserwidget.h gtkrecentfilter.h gtkrecentmanager.h gtkruler.h gtkscale.h gtkscalebutton.h gtkscrollbar.h gtkscrolledwindow.h gtkselection.h gtkseparator.h gtkseparatormenuitem.h gtkseparatortoolitem.h gtkshow.h gtksettings.h gtksizegroup.h gtksocket.h gtkspinbutton.h gtkstatusbar.h gtkstatusicon.h gtkstock.h gtkstyle.h gtktable.h gtktearoffmenuitem.h gtktestutils.h gtktextbuffer.h gtktextbufferrichtext.h gtktextchild.h gtktextdisplay.h gtktextiter.h gtktextmark.h gtktexttag.h gtktexttagtable.h gtktextview.h gtktoggleaction.h gtktogglebutton.h gtktoggletoolbutton.h gtktoolbar.h gtktoolbutton.h gtktoolitem.h gtktoolshell.h gtktooltip.h gtktreednd.h gtktreemodel.h gtktreemodelfilter.h gtktreemodelsort.h gtktreeselection.h gtktreesortable.h gtktreestore.h gtktreeview.h gtktreeviewcolumn.h gtktypeutils.h gtkuimanager.h gtkvbbox.h gtkvbox.h gtkviewport.h gtkvolumebutton.h gtkvpaned.h gtkvruler.h gtkvscale.h gtkvscrollbar.h gtkvseparator.h gtkwidget.h gtkwindow.h gtktext.h gtktree.h gtktreeitem.h gtkclist.h gtkcombo.h gtkctree.h gtkfilesel.h gtkitemfactory.h gtklist.h gtklistitem.h gtkoldeditable.h gtkoptionmenu.h gtkpixmap.h gtkpreview.h gtkprogress.h gtksignal.h gtktipsquery.h gtktooltips.h ) >> xgen-gtbh \
&& (cmp -s xgen-gtbh gtktypebuiltins.h || cp xgen-gtbh gtktypebuiltins.h ) \
&& rm -f xgen-gtbh \
&& echo timestamp > stamp-gtktypebuiltins.h
/usr/bin/make  gtk-update-icon-cache
if /usr/bin/gcc-4.0 -DHAVE_CONFIG_H -I. -I. -I.. -DG_LOG_DOMAIN=\"Gtk\" -DGTK_LIBDIR=\"/opt/local/lib\" -DGTK_DATADIR=\"/opt/local/share\" -DGTK_DATA_PREFIX=\"/opt/local\" -DGTK_SYSCONFDIR=\"/opt/local/etc\" -DGTK_VERSION=\"2.16.6\" -DGTK_BINARY_VERSION=\"2.10.0\" -DGTK_HOST=\"powerpc-apple-darwin8.11.0\" -DGTK_COMPILATION -DGTK_PRINT_BACKENDS=\"file,lpr\" -DGTK_PRINT_PREVIEW_COMMAND=\""evince --unlink-tempfile --preview --print-settings %s %f"\" -I.. -I../gtk -I.. -I../gdk -I../gdk -I../gdk-pixbuf -I../gdk-pixbuf -DGDK_DISABLE_DEPRECATED -DGTK_DISABLE_DEPRECATED -DGTK_FILE_SYSTEM_ENABLE_UNSUPPORTED -DGTK_PRINT_BACKEND_ENABLE_UNSUPPORTED -DG_DISABLE_CAST_CHECKS -D_REENTRANT -I/opt/local/include/glib-2.0 -I/opt/local/lib/glib-2.0/include -I/opt/local/include -I/opt/local/include/pango-1.0 -I/opt/local/include/cairo -I/opt/local/include/pixman-1 -I/opt/local/include/freetype2 -I/opt/local/include/libpng12 -I/opt/local/include/atk-1.0         -I/opt/local/include -DX_LOCALE -DG_DISABLE_SINGLE_INCLUDES -DATK_DISABLE_SINGLE_INCLUDES -DGDK_PIXBUF_DISABLE_SINGLE_INCLUDES -DGTK_DISABLE_SINGLE_INCLUDES -I/opt/local/include    -DGDK_PIXBUF_DISABLE_DEPRECATED -O2 -fstrict-aliasing -arch ppc -Wall -MT updateiconcache.o -MD -MP -MF ".deps/updateiconcache.Tpo" \
  -c -o updateiconcache.o `test -f 'updateiconcache.c' || echo './'`updateiconcache.c; \
then mv -f ".deps/updateiconcache.Tpo" ".deps/updateiconcache.Po"; \
else rm -f ".deps/updateiconcache.Tpo"; exit 1; \
fi
/bin/sh ../libtool --mode=link /usr/bin/gcc-4.0  -DGDK_PIXBUF_DISABLE_DEPRECATED -O2 -fstrict-aliasing -arch ppc -Wall  -L/opt/local/lib -o gtk-update-icon-cache  updateiconcache.o ../gdk-pixbuf/libgdk_pixbuf-2.0.la 
libtool: link: /usr/bin/gcc-4.0 -DGDK_PIXBUF_DISABLE_DEPRECATED -O2 -fstrict-aliasing -arch ppc -Wall -o .libs/gtk-update-icon-cache updateiconcache.o  -L/opt/local/lib ../gdk-pixbuf/.libs/libgdk_pixbuf-2.0.dylib /opt/local/lib/libgio-2.0.dylib /opt/local/lib/libgobject-2.0.dylib /opt/local/lib/libgmodule-2.0.dylib /opt/local/lib/libglib-2.0.dylib /opt/local/lib/libintl.dylib -lc /opt/local/lib/libiconv.dylib -lm -framework Carbon
GDK_PIXBUF_MODULE_FILE=../gdk-pixbuf/gdk-pixbuf.loaders ./gtk-update-icon-cache --force --ignore-theme-index		\
   --source builtin_icons stock-icons > gtkbuiltincache.h.tmp &&        \
mv gtkbuiltincache.h.tmp gtkbuiltincache.h
gtk-update-icon-cache: The generated cache was invalid.
make[2]: *** [gtkbuiltincache.h] Error 1
make[1]: *** [all-recursive] Error 1
make: *** [all] Error 2

Error: Status 1 encountered during processing.

comment:21 Changed 11 years ago by ryandesign (Ryan Schmidt)

Please see #20372 where this bug is now being tracked.

Note: See TracTickets for help on using tickets.