Opened 12 years ago

Closed 12 years ago

Last modified 12 years ago

#18568 closed defect (fixed)

macsword-1.1.3 FindControl.m error - build failure

Reported by: Ink_Blot2001@… Owned by: macports-tickets@…
Priority: Normal Milestone:
Component: ports Version: 1.7.0
Keywords: macsword build failure Cc: jmroot (Joshua Root)
Port: macsword

Description

/opt/local/var/macports/build/_opt_local_var_macports_sources_rsync.macports.org_release_ports_aqua_macsword/work/macsword/FindControl.m -o /opt/local/var/macports/build/_opt_local_var_macports_sources_rsync.macports.org_release_ports_aqua_macsword/work/macsword/build/MacSword.build/Deployment/MacSword.build/Objects-normal/ppc/FindControl.o
/opt/local/var/macports/build/_opt_local_var_macports_sources_rsync.macports.org_release_ports_aqua_macsword/work/macsword/FindControl.m:20:28: error: AGRegex/AGRegex.h: No such file or directory
/opt/local/var/macports/build/_opt_local_var_macports_sources_rsync.macports.org_release_ports_aqua_macsword/work/macsword/FindControl.m: In function '-[FindControl hiliteResults]':
/opt/local/var/macports/build/_opt_local_var_macports_sources_rsync.macports.org_release_ports_aqua_macsword/work/macsword/FindControl.m:225: error: 'AGRegex' undeclared (first use in this function)
/opt/local/var/macports/build/_opt_local_var_macports_sources_rsync.macports.org_release_ports_aqua_macsword/work/macsword/FindControl.m:225: error: (Each undeclared identifier is reported only once
/opt/local/var/macports/build/_opt_local_var_macports_sources_rsync.macports.org_release_ports_aqua_macsword/work/macsword/FindControl.m:225: error: for each function it appears in.)
/opt/local/var/macports/build/_opt_local_var_macports_sources_rsync.macports.org_release_ports_aqua_macsword/work/macsword/FindControl.m:225: error: 'agregex' undeclared (first use in this function)
/opt/local/var/macports/build/_opt_local_var_macports_sources_rsync.macports.org_release_ports_aqua_macsword/work/macsword/FindControl.m:231: error: 'AGRegexCaseInsensitive' undeclared (first use in this function)
/opt/local/var/macports/build/_opt_local_var_macports_sources_rsync.macports.org_release_ports_aqua_macsword/work/macsword/FindControl.m:260: error: 'AGRegexMatch' undeclared (first use in this function)
/opt/local/var/macports/build/_opt_local_var_macports_sources_rsync.macports.org_release_ports_aqua_macsword/work/macsword/FindControl.m:260: error: 'match' undeclared (first use in this function)

CompileC build/MacSword.build/Deployment/MacSword.build/Objects-normal/ppc/ModuleList.o /opt/local/var/macports/build/_opt_local_var_macports_sources_rsync.macports.org_release_ports_aqua_macsword/work/macsword/ModuleList.m normal ppc objective-c com.apple.compilers.gcc.4_0
    cd /opt/local/var/macports/build/_opt_local_var_macports_sources_rsync.macports.org_release_ports_aqua_macsword/work/macsword
    /Developer/usr/bin/gcc-4.0 -x objective-c -arch ppc -pipe -Wno-trigraphs -fpascal-strings -fasm-blocks -Os -fmessage-length=0 -mtune=G4 -fvisibility=hidden -mmacosx-version-min=10.2 -I/opt/local/var/macports/build/_opt_local_var_macports_sources_rsync.macports.org_release_ports_aqua_macsword/work/macsword/build/MacSword.build/Deployment/MacSword.build/MacSword.hmap -w -mdynamic-no-pic -F/opt/local/var/macports/build/_opt_local_var_macports_sources_rsync.macports.org_release_ports_aqua_macsword/work/macsword/build/Deployment -F/Library/Frameworks -F/System/Library/Frameworks -I/opt/local/var/macports/build/_opt_local_var_macports_sources_rsync.macports.org_release_ports_aqua_macsword/work/macsword/build/Deployment/include -I/opt/local/include/sword -I/opt/local/var/macports/build/_opt_local_var_macports_sources_rsync.macports.org_release_ports_aqua_macsword/work/macsword/build/MacSword.build/Deployment/MacSword.build/DerivedSources -include /Library/Caches/com.apple.Xcode.0/SharedPrecompiledHeaders/MacSword_Prefix-gtvodnvtyjwwllbrhqpkndabvtvz/MacSword_Prefix.pch -c /opt/local/var/macports/build/_opt_local_var_macports_sources_rsync.macports.org_release_ports_aqua_macsword/work/macsword/ModuleList.m -o /opt/local/var/macports/build/_opt_local_var_macports_sources_rsync.macports.org_release_ports_aqua_macsword/work/macsword/build/MacSword.build/Deployment/MacSword.build/Objects-normal/ppc/ModuleList.o
** BUILD FAILED **

Change History (2)

comment:1 Changed 12 years ago by jmroot (Joshua Root)

Cc: jmr@… added
Resolution: fixed
Status: newclosed

Fixed by r47069.

comment:2 Changed 12 years ago by (none)

Milestone: Port Bugs

Milestone Port Bugs deleted

Note: See TracTickets for help on using tickets.