Opened 11 years ago

Closed 11 years ago

Last modified 11 years ago

#18714 closed defect (fixed)

libxfce4menu 4.6.0 build error

Reported by: mf2k (Frank Schima) Owned by: afb@…
Priority: Normal Milestone:
Component: ports Version: 1.7.0
Keywords: Cc:
Port: libxfce4menu

Description (last modified by mf2k (Frank Schima))

Mac OS X 10.5.6 Intel. Xcode 3.1.2.

$ sudo port install libxfce4menu
--->  Fetching libxfce4menu
--->  Attempting to fetch libxfce4menu-4.6.0.tar.bz2 from http://distfiles.macports.org/libxfce4menu
--->  Verifying checksum(s) for libxfce4menu
--->  Extracting libxfce4menu
--->  Configuring libxfce4menu
--->  Building libxfce4menu
Error: Target org.macports.build returned: shell command " cd "/opt/local/var/macports/build/_opt_mports_trunk_dports_xfce_libxfce4menu/work/libxfce4menu-4.6.0" && make all " returned error 2
Command output: ../tdb/tdb.h:116: error: syntax error before '}' token
../tdb/tdb.h:116: warning: data definition has no type or storage class
../tdb/tdb.h:118: error: syntax error before '*' token
../tdb/tdb.h:119: error: syntax error before '*' token
../tdb/tdb.h:122: error: syntax error before '*' token
../tdb/tdb.h:123: warning: data definition has no type or storage class
../tdb/tdb.h:124: error: syntax error before '*' token
../tdb/tdb.h:127: warning: data definition has no type or storage class
../tdb/tdb.h:129: error: syntax error before '*' token
../tdb/tdb.h:131: error: syntax error before '*' token
../tdb/tdb.h:132: error: syntax error before '*' token
../tdb/tdb.h:133: error: syntax error before '*' token
../tdb/tdb.h:134: error: syntax error before '*' token
../tdb/tdb.h:135: error: syntax error before '*' token
../tdb/tdb.h:136: error: syntax error before '*' token
../tdb/tdb.h:137: error: syntax error before '*' token
../tdb/tdb.h:138: error: syntax error before '*' token
../tdb/tdb.h:139: error: syntax error before '*' token
../tdb/tdb.h:140: error: syntax error before '*' token
../tdb/tdb.h:141: error: syntax error before '*' token
../tdb/tdb.h:142: error: syntax error before '*' token
../tdb/tdb.h:143: error: syntax error before '*' token
../tdb/tdb.h:144: error: syntax error before '*' token
../tdb/tdb.h:148: error: syntax error before '*' token
../tdb/tdb.h:149: error: syntax error before '*' token
../tdb/tdb.h:152: error: syntax error before '*' token
../tdb/tdb.h:153: error: syntax error before '*' token
make[2]: *** [libxfce4menu_0_1_la-xfce-menu-item-cache.lo] Error 1
make[1]: *** [all-recursive] Error 1
make: *** [all] Error 2

Error: Status 1 encountered during processing.

Change History (7)

comment:1 Changed 11 years ago by mf2k (Frank Schima)

Description: modified (diff)

comment:2 Changed 11 years ago by afb@…

Sounds similar to #15179, hard to tell without the build log...

comment:3 Changed 11 years ago by afb@…

Testing the same patch in r47613, might be it here too ?

comment:4 Changed 11 years ago by afb@…

Status: newassigned

comment:5 Changed 11 years ago by mf2k (Frank Schima)

It installs now. Thanks!

comment:6 Changed 11 years ago by afb@…

Resolution: fixed
Status: assignedclosed

comment:7 Changed 11 years ago by (none)

Milestone: Port Bugs

Milestone Port Bugs deleted

Note: See TracTickets for help on using tickets.