Opened 11 years ago

Closed 11 years ago

#20513 closed defect (fixed)

kdelibs3 3.5.10 incompatible with autoconf 2.64

Reported by: thedoobs@… Owned by: macports-tickets@…
Priority: Normal Milestone:
Component: ports Version:
Keywords: kde Cc: watership@…, ryandesign (Ryan Schmidt)
Port: kdelibs3, autoconf

Description

Running

sudo port install kde

results in the following error:

--->  Building kdelibs3
Error: Target org.macports.build returned: shell command "cd /opt/local/var/macports/build/_opt_local_var_macports_sources_rsync.macports.org_release_ports_kde_kdelibs3/work/kdelibs-3.5.10 && MAKEFLAGS="-j 1" ./CompileScript.sh" returned error 1
Command output: configure.in:37: warning: AC_REQUIRE: `AC_EXEEXT' was expanded before it was required
configure.in:37: warning: AC_CACHE_VAL(lt_prog_compiler_pic_works, ...): suspicious cache-id, must contain _cv_ to be cached
../../lib/autoconf/general.m4:2039: AC_CACHE_CHECK is expanded from...
acinclude.m4:6612: AC_LIBTOOL_COMPILER_OPTION is expanded from...
acinclude.m4:10812: AC_LIBTOOL_PROG_COMPILER_PIC is expanded from...
acinclude.m4:8648: _LT_AC_LANG_C_CONFIG is expanded from...
acinclude.m4:8647: AC_LIBTOOL_LANG_C_CONFIG is expanded from...
configure.in:37: warning: AC_CACHE_VAL(lt_prog_compiler_static_works, ...): suspicious cache-id, must contain _cv_ to be cached
acinclude.m4:6657: AC_LIBTOOL_LINKER_OPTION is expanded from...
configure.in:37: warning: AC_CACHE_VAL(lt_prog_compiler_pic_works_CXX, ...): suspicious cache-id, must contain _cv_ to be cached
acinclude.m4:8729: _LT_AC_LANG_CXX_CONFIG is expanded from...
acinclude.m4:8728: AC_LIBTOOL_LANG_CXX_CONFIG is expanded from...
acinclude.m4:7784: _LT_AC_TAGCONFIG is expanded from...
configure.in:37: warning: AC_CACHE_VAL(lt_prog_compiler_static_works_CXX, ...): suspicious cache-id, must contain _cv_ to be cached
configure.in:37: warning: AC_CACHE_VAL(lt_prog_compiler_pic_works_F77, ...): suspicious cache-id, must contain _cv_ to be cached
acinclude.m4:9896: _LT_AC_LANG_F77_CONFIG is expanded from...
acinclude.m4:9895: AC_LIBTOOL_LANG_F77_CONFIG is expanded from...
configure.in:37: warning: AC_CACHE_VAL(lt_prog_compiler_static_works_F77, ...): suspicious cache-id, must contain _cv_ to be cached
configure.in:37: warning: AC_CACHE_VAL(lt_prog_compiler_pic_works_GCJ, ...): suspicious cache-id, must contain _cv_ to be cached
acinclude.m4:9998: _LT_AC_LANG_GCJ_CONFIG is expanded from...
acinclude.m4:9997: AC_LIBTOOL_LANG_GCJ_CONFIG is expanded from...
configure.in:37: warning: AC_CACHE_VAL(lt_prog_compiler_static_works_GCJ, ...): suspicious cache-id, must contain _cv_ to be cached
configure.in:1473: warning: AC_CACHE_VAL(kde_link_libthai, ...): suspicious cache-id, must contain _cv_ to be cached
configure.in:1421: KDE_CHECK_LIBTHAI is expanded from...
configure.in:1473: the top level
configure:30968: error: possibly undefined macro: AH_CHECK_HEADERS
      If this token and others are legitimate, please use m4_pattern_allow.
      See the Autoconf documentation.
make: *** [cvs] Error 1
kdelibs3-3.5.10-1 cvs failed!

Error: The following dependencies failed to build: kdebase3 kdelibs3 xorg-libXxf86misc xorg-xf86miscproto xorg-libxkbfile kdenetwork3 openslp kdepim3 kdeaccessibility3 opensync py25-numeric swig gsed php5 apache2 apr apr-util autoconf213 mhash kdeutils3
Error: Status 1 encountered during processing.

Change History (9)

comment:1 Changed 11 years ago by mf2k (Frank Schima)

Port: kdelibs3 added; kde removed
Summary: kdelibs 3.5.10 build errorkdelibs3 3.5.10 build error

comment:2 Changed 11 years ago by tobypeterson

looks related to a change in autoconf 2.64

comment:3 in reply to:  2 Changed 11 years ago by thedoobs@…

Anybody have information about this? I am still unable to install kdelibs3. I do not have any previous version of any kde port installed. Here is the debug output for sudo port -d install kdelibs3:

DEBUG: Found port in file:///opt/local/var/macports/sources/rsync.macports.org/release/ports/kde/kdelibs3
DEBUG: Changing to port directory: /opt/local/var/macports/sources/rsync.macports.org/release/ports/kde/kdelibs3
DEBUG: setting option os.universal_supported to yes
DEBUG: org.macports.load registered provides 'load', a pre-existing procedure. Target override will not be provided
DEBUG: org.macports.distfiles registered provides 'distfiles', a pre-existing procedure. Target override will not be provided
DEBUG: 'universal_variant no' specified, so not adding the default universal variant
DEBUG: Requested variant darwin is not provided by port kdelibs3.
DEBUG: Requested variant i386 is not provided by port kdelibs3.
DEBUG: Requested variant macosx is not provided by port kdelibs3.
DEBUG: Executing variant darwin_9 provides darwin_9
DEBUG: Found port in file:///opt/local/var/macports/sources/rsync.macports.org/release/ports/devel/poll-emulator
DEBUG: Changing to port directory: /opt/local/var/macports/sources/rsync.macports.org/release/ports/devel/poll-emulator
DEBUG: setting option os.universal_supported to yes
DEBUG: org.macports.load registered provides 'load', a pre-existing procedure. Target override will not be provided
DEBUG: org.macports.distfiles registered provides 'distfiles', a pre-existing procedure. Target override will not be provided
DEBUG: adding the default universal variant
DEBUG: Requested variant darwin is not provided by port poll-emulator.
DEBUG: Requested variant i386 is not provided by port poll-emulator.
DEBUG: Requested variant macosx is not provided by port poll-emulator.
DEBUG: Searching for dependency: poll-emulator
DEBUG: Didn't find receipt, going to depspec regex for: poll-emulator
DEBUG: Found Dependency: path: /usr/lib filename: libpoll.dylib regex: ^libpoll\.dylib$
DEBUG: Found port in file:///opt/local/var/macports/sources/rsync.macports.org/release/ports/x11/mesa
DEBUG: Changing to port directory: /opt/local/var/macports/sources/rsync.macports.org/release/ports/x11/mesa
DEBUG: setting option os.universal_supported to yes
DEBUG: org.macports.load registered provides 'load', a pre-existing procedure. Target override will not be provided
DEBUG: org.macports.distfiles registered provides 'distfiles', a pre-existing procedure. Target override will not be provided
DEBUG: universal variant already exists, so not adding the default one
DEBUG: Requested variant darwin is not provided by port mesa.
DEBUG: Requested variant i386 is not provided by port mesa.
DEBUG: Requested variant macosx is not provided by port mesa.
DEBUG: Executing variant hw_render provides hw_render
DEBUG: Searching for dependency: mesa
DEBUG: Found Dependency: receipt exists for mesa
DEBUG: Found port in file:///opt/local/var/macports/sources/rsync.macports.org/release/ports/textproc/aspell
DEBUG: Changing to port directory: /opt/local/var/macports/sources/rsync.macports.org/release/ports/textproc/aspell
DEBUG: setting option os.universal_supported to yes
DEBUG: org.macports.load registered provides 'load', a pre-existing procedure. Target override will not be provided
DEBUG: org.macports.distfiles registered provides 'distfiles', a pre-existing procedure. Target override will not be provided
DEBUG: adding the default universal variant
DEBUG: Requested variant darwin is not provided by port aspell.
DEBUG: Requested variant i386 is not provided by port aspell.
DEBUG: Executing variant macosx provides macosx
DEBUG: Searching for dependency: aspell
DEBUG: Found Dependency: receipt exists for aspell
DEBUG: Found port in file:///opt/local/var/macports/sources/rsync.macports.org/release/ports/archivers/bzip2
DEBUG: Changing to port directory: /opt/local/var/macports/sources/rsync.macports.org/release/ports/archivers/bzip2
DEBUG: setting option os.universal_supported to yes
DEBUG: org.macports.load registered provides 'load', a pre-existing procedure. Target override will not be provided
DEBUG: org.macports.distfiles registered provides 'distfiles', a pre-existing procedure. Target override will not be provided
DEBUG: universal variant already exists, so not adding the default one
DEBUG: Requested variant i386 is not provided by port bzip2.
DEBUG: Requested variant macosx is not provided by port bzip2.
DEBUG: Executing variant darwin provides darwin
DEBUG: Searching for dependency: bzip2
DEBUG: Found Dependency: receipt exists for bzip2
DEBUG: Found port in file:///opt/local/var/macports/sources/rsync.macports.org/release/ports/textproc/expat
DEBUG: Changing to port directory: /opt/local/var/macports/sources/rsync.macports.org/release/ports/textproc/expat
DEBUG: setting option os.universal_supported to yes
DEBUG: org.macports.load registered provides 'load', a pre-existing procedure. Target override will not be provided
DEBUG: org.macports.distfiles registered provides 'distfiles', a pre-existing procedure. Target override will not be provided
DEBUG: adding the default universal variant
DEBUG: Requested variant darwin is not provided by port expat.
DEBUG: Requested variant i386 is not provided by port expat.
DEBUG: Requested variant macosx is not provided by port expat.
DEBUG: Searching for dependency: expat
DEBUG: Found Dependency: receipt exists for expat
DEBUG: Found port in file:///opt/local/var/macports/sources/rsync.macports.org/release/ports/devel/flex
DEBUG: Changing to port directory: /opt/local/var/macports/sources/rsync.macports.org/release/ports/devel/flex
DEBUG: setting option os.universal_supported to yes
DEBUG: org.macports.load registered provides 'load', a pre-existing procedure. Target override will not be provided
DEBUG: org.macports.distfiles registered provides 'distfiles', a pre-existing procedure. Target override will not be provided
DEBUG: adding the default universal variant
DEBUG: Requested variant darwin is not provided by port flex.
DEBUG: Requested variant i386 is not provided by port flex.
DEBUG: Requested variant macosx is not provided by port flex.
DEBUG: Searching for dependency: flex
DEBUG: Found Dependency: receipt exists for flex
DEBUG: Found port in file:///opt/local/var/macports/sources/rsync.macports.org/release/ports/devel/gettext
DEBUG: Changing to port directory: /opt/local/var/macports/sources/rsync.macports.org/release/ports/devel/gettext
DEBUG: setting option os.universal_supported to yes
DEBUG: org.macports.load registered provides 'load', a pre-existing procedure. Target override will not be provided
DEBUG: org.macports.distfiles registered provides 'distfiles', a pre-existing procedure. Target override will not be provided
DEBUG: Using group file /opt/local/var/macports/sources/rsync.macports.org/release/ports/_resources/port1.0/group/muniversal-1.0.tcl
DEBUG: universal variant already exists, so not adding the default one
DEBUG: Requested variant darwin is not provided by port gettext.
DEBUG: Requested variant i386 is not provided by port gettext.
DEBUG: Requested variant macosx is not provided by port gettext.
DEBUG: Searching for dependency: gettext
DEBUG: Found Dependency: receipt exists for gettext
DEBUG: Found port in file:///opt/local/var/macports/sources/rsync.macports.org/release/ports/devel/glib2
DEBUG: Changing to port directory: /opt/local/var/macports/sources/rsync.macports.org/release/ports/devel/glib2
DEBUG: setting option os.universal_supported to yes
DEBUG: org.macports.load registered provides 'load', a pre-existing procedure. Target override will not be provided
DEBUG: org.macports.distfiles registered provides 'distfiles', a pre-existing procedure. Target override will not be provided
DEBUG: Using group file /opt/local/var/macports/sources/rsync.macports.org/release/ports/_resources/port1.0/group/muniversal-1.0.tcl
DEBUG: universal variant already exists, so not adding the default one
DEBUG: Requested variant i386 is not provided by port glib2.
DEBUG: Requested variant macosx is not provided by port glib2.
DEBUG: Executing variant darwin provides darwin
DEBUG: Searching for dependency: glib2
DEBUG: Found Dependency: receipt exists for glib2
DEBUG: Found port in file:///opt/local/var/macports/sources/rsync.macports.org/release/ports/gnome/hicolor-icon-theme
DEBUG: Changing to port directory: /opt/local/var/macports/sources/rsync.macports.org/release/ports/gnome/hicolor-icon-theme
DEBUG: setting option os.universal_supported to yes
DEBUG: org.macports.load registered provides 'load', a pre-existing procedure. Target override will not be provided
DEBUG: org.macports.distfiles registered provides 'distfiles', a pre-existing procedure. Target override will not be provided
DEBUG: 'universal_variant no' specified, so not adding the default universal variant
DEBUG: Requested variant darwin is not provided by port hicolor-icon-theme.
DEBUG: Requested variant i386 is not provided by port hicolor-icon-theme.
DEBUG: Requested variant macosx is not provided by port hicolor-icon-theme.
DEBUG: Searching for dependency: hicolor-icon-theme
DEBUG: Found Dependency: receipt exists for hicolor-icon-theme
DEBUG: Found port in file:///opt/local/var/macports/sources/rsync.macports.org/release/ports/graphics/jasper
DEBUG: Changing to port directory: /opt/local/var/macports/sources/rsync.macports.org/release/ports/graphics/jasper
DEBUG: setting option os.universal_supported to yes
DEBUG: org.macports.load registered provides 'load', a pre-existing procedure. Target override will not be provided
DEBUG: org.macports.distfiles registered provides 'distfiles', a pre-existing procedure. Target override will not be provided
DEBUG: Using group file /opt/local/var/macports/sources/rsync.macports.org/release/ports/_resources/port1.0/group/muniversal-1.0.tcl
DEBUG: universal variant already exists, so not adding the default one
DEBUG: Requested variant darwin is not provided by port jasper.
DEBUG: Requested variant i386 is not provided by port jasper.
DEBUG: Requested variant macosx is not provided by port jasper.
DEBUG: Searching for dependency: jasper
DEBUG: Found Dependency: receipt exists for jasper
DEBUG: Found port in file:///opt/local/var/macports/sources/rsync.macports.org/release/ports/graphics/jpeg
DEBUG: Changing to port directory: /opt/local/var/macports/sources/rsync.macports.org/release/ports/graphics/jpeg
DEBUG: setting option os.universal_supported to yes
DEBUG: org.macports.load registered provides 'load', a pre-existing procedure. Target override will not be provided
DEBUG: org.macports.distfiles registered provides 'distfiles', a pre-existing procedure. Target override will not be provided
DEBUG: adding the default universal variant
DEBUG: Requested variant darwin is not provided by port jpeg.
DEBUG: Requested variant i386 is not provided by port jpeg.
DEBUG: Requested variant macosx is not provided by port jpeg.
DEBUG: Searching for dependency: jpeg
DEBUG: Found Dependency: receipt exists for jpeg
DEBUG: Found port in file:///opt/local/var/macports/sources/rsync.macports.org/release/ports/graphics/libart_lgpl
DEBUG: Changing to port directory: /opt/local/var/macports/sources/rsync.macports.org/release/ports/graphics/libart_lgpl
DEBUG: setting option os.universal_supported to yes
DEBUG: org.macports.load registered provides 'load', a pre-existing procedure. Target override will not be provided
DEBUG: org.macports.distfiles registered provides 'distfiles', a pre-existing procedure. Target override will not be provided
DEBUG: adding the default universal variant
DEBUG: Requested variant darwin is not provided by port libart_lgpl.
DEBUG: Requested variant i386 is not provided by port libart_lgpl.
DEBUG: Requested variant macosx is not provided by port libart_lgpl.
DEBUG: Searching for dependency: libart_lgpl
DEBUG: Found Dependency: receipt exists for libart_lgpl
DEBUG: Found port in file:///opt/local/var/macports/sources/rsync.macports.org/release/ports/mail/libidn
DEBUG: Changing to port directory: /opt/local/var/macports/sources/rsync.macports.org/release/ports/mail/libidn
DEBUG: setting option os.universal_supported to yes
DEBUG: org.macports.load registered provides 'load', a pre-existing procedure. Target override will not be provided
DEBUG: org.macports.distfiles registered provides 'distfiles', a pre-existing procedure. Target override will not be provided
DEBUG: adding the default universal variant
DEBUG: Requested variant darwin is not provided by port libidn.
DEBUG: Requested variant i386 is not provided by port libidn.
DEBUG: Requested variant macosx is not provided by port libidn.
DEBUG: Searching for dependency: libidn
DEBUG: Found Dependency: receipt exists for libidn
DEBUG: Found port in file:///opt/local/var/macports/sources/rsync.macports.org/release/ports/textproc/libiconv
DEBUG: Changing to port directory: /opt/local/var/macports/sources/rsync.macports.org/release/ports/textproc/libiconv
DEBUG: setting option os.universal_supported to yes
DEBUG: org.macports.load registered provides 'load', a pre-existing procedure. Target override will not be provided
DEBUG: org.macports.distfiles registered provides 'distfiles', a pre-existing procedure. Target override will not be provided
DEBUG: Using group file /opt/local/var/macports/sources/rsync.macports.org/release/ports/_resources/port1.0/group/muniversal-1.0.tcl
DEBUG: universal variant already exists, so not adding the default one
DEBUG: Requested variant darwin is not provided by port libiconv.
DEBUG: Requested variant i386 is not provided by port libiconv.
DEBUG: Requested variant macosx is not provided by port libiconv.
DEBUG: Searching for dependency: libiconv
DEBUG: Found Dependency: receipt exists for libiconv
DEBUG: Found port in file:///opt/local/var/macports/sources/rsync.macports.org/release/ports/graphics/libpng
DEBUG: Changing to port directory: /opt/local/var/macports/sources/rsync.macports.org/release/ports/graphics/libpng
DEBUG: setting option os.universal_supported to yes
DEBUG: org.macports.load registered provides 'load', a pre-existing procedure. Target override will not be provided
DEBUG: org.macports.distfiles registered provides 'distfiles', a pre-existing procedure. Target override will not be provided
DEBUG: Using group file /opt/local/var/macports/sources/rsync.macports.org/release/ports/_resources/port1.0/group/muniversal-1.0.tcl
DEBUG: universal variant already exists, so not adding the default one
DEBUG: Requested variant darwin is not provided by port libpng.
DEBUG: Requested variant i386 is not provided by port libpng.
DEBUG: Requested variant macosx is not provided by port libpng.
DEBUG: Searching for dependency: libpng
DEBUG: Found Dependency: receipt exists for libpng
DEBUG: Found port in file:///opt/local/var/macports/sources/rsync.macports.org/release/ports/textproc/libxml2
DEBUG: Changing to port directory: /opt/local/var/macports/sources/rsync.macports.org/release/ports/textproc/libxml2
DEBUG: setting option os.universal_supported to yes
DEBUG: org.macports.load registered provides 'load', a pre-existing procedure. Target override will not be provided
DEBUG: org.macports.distfiles registered provides 'distfiles', a pre-existing procedure. Target override will not be provided
DEBUG: Using group file /opt/local/var/macports/sources/rsync.macports.org/release/ports/_resources/port1.0/group/muniversal-1.0.tcl
DEBUG: universal variant already exists, so not adding the default one
DEBUG: Requested variant darwin is not provided by port libxml2.
DEBUG: Requested variant i386 is not provided by port libxml2.
DEBUG: Requested variant macosx is not provided by port libxml2.
DEBUG: Searching for dependency: libxml2
DEBUG: Found Dependency: receipt exists for libxml2
DEBUG: Found port in file:///opt/local/var/macports/sources/rsync.macports.org/release/ports/textproc/libxslt
DEBUG: Changing to port directory: /opt/local/var/macports/sources/rsync.macports.org/release/ports/textproc/libxslt
DEBUG: setting option os.universal_supported to yes
DEBUG: org.macports.load registered provides 'load', a pre-existing procedure. Target override will not be provided
DEBUG: org.macports.distfiles registered provides 'distfiles', a pre-existing procedure. Target override will not be provided
DEBUG: Using group file /opt/local/var/macports/sources/rsync.macports.org/release/ports/_resources/port1.0/group/muniversal-1.0.tcl
DEBUG: universal variant already exists, so not adding the default one
DEBUG: Requested variant darwin is not provided by port libxslt.
DEBUG: Requested variant i386 is not provided by port libxslt.
DEBUG: Requested variant macosx is not provided by port libxslt.
DEBUG: Searching for dependency: libxslt
DEBUG: Found Dependency: receipt exists for libxslt
DEBUG: Found port in file:///opt/local/var/macports/sources/rsync.macports.org/release/ports/devel/pcre
DEBUG: Changing to port directory: /opt/local/var/macports/sources/rsync.macports.org/release/ports/devel/pcre
DEBUG: setting option os.universal_supported to yes
DEBUG: org.macports.load registered provides 'load', a pre-existing procedure. Target override will not be provided
DEBUG: org.macports.distfiles registered provides 'distfiles', a pre-existing procedure. Target override will not be provided
DEBUG: Using group file /opt/local/var/macports/sources/rsync.macports.org/release/ports/_resources/port1.0/group/muniversal-1.0.tcl
DEBUG: universal variant already exists, so not adding the default one
DEBUG: Requested variant darwin is not provided by port pcre.
DEBUG: Requested variant i386 is not provided by port pcre.
DEBUG: Requested variant macosx is not provided by port pcre.
DEBUG: Searching for dependency: pcre
DEBUG: Found Dependency: receipt exists for pcre
DEBUG: Found port in file:///opt/local/var/macports/sources/rsync.macports.org/release/ports/graphics/tiff
DEBUG: Changing to port directory: /opt/local/var/macports/sources/rsync.macports.org/release/ports/graphics/tiff
DEBUG: setting option os.universal_supported to yes
DEBUG: org.macports.load registered provides 'load', a pre-existing procedure. Target override will not be provided
DEBUG: org.macports.distfiles registered provides 'distfiles', a pre-existing procedure. Target override will not be provided
DEBUG: Using group file /opt/local/var/macports/sources/rsync.macports.org/release/ports/_resources/port1.0/group/muniversal-1.0.tcl
DEBUG: universal variant already exists, so not adding the default one
DEBUG: Requested variant darwin is not provided by port tiff.
DEBUG: Requested variant i386 is not provided by port tiff.
DEBUG: Executing variant macosx provides macosx
DEBUG: Searching for dependency: tiff
DEBUG: Found Dependency: receipt exists for tiff
DEBUG: Found port in file:///opt/local/var/macports/sources/rsync.macports.org/release/ports/graphics/openexr
DEBUG: Changing to port directory: /opt/local/var/macports/sources/rsync.macports.org/release/ports/graphics/openexr
DEBUG: setting option os.universal_supported to yes
DEBUG: org.macports.load registered provides 'load', a pre-existing procedure. Target override will not be provided
DEBUG: org.macports.distfiles registered provides 'distfiles', a pre-existing procedure. Target override will not be provided
DEBUG: adding the default universal variant
DEBUG: Requested variant darwin is not provided by port openexr.
DEBUG: Requested variant i386 is not provided by port openexr.
DEBUG: Requested variant macosx is not provided by port openexr.
DEBUG: Searching for dependency: openexr
DEBUG: Found Dependency: receipt exists for openexr
DEBUG: Found port in file:///opt/local/var/macports/sources/rsync.macports.org/release/ports/devel/openssl
DEBUG: Changing to port directory: /opt/local/var/macports/sources/rsync.macports.org/release/ports/devel/openssl
DEBUG: setting option os.universal_supported to yes
DEBUG: org.macports.load registered provides 'load', a pre-existing procedure. Target override will not be provided
DEBUG: org.macports.distfiles registered provides 'distfiles', a pre-existing procedure. Target override will not be provided
DEBUG: Using group file /opt/local/var/macports/sources/rsync.macports.org/release/ports/_resources/port1.0/group/muniversal-1.0.tcl
DEBUG: universal variant already exists, so not adding the default one
DEBUG: Requested variant i386 is not provided by port openssl.
DEBUG: Requested variant macosx is not provided by port openssl.
DEBUG: Executing variant darwin provides darwin
DEBUG: Searching for dependency: openssl
DEBUG: Found Dependency: receipt exists for openssl
DEBUG: Found port in file:///opt/local/var/macports/sources/rsync.macports.org/release/ports/lang/perl5
DEBUG: Changing to port directory: /opt/local/var/macports/sources/rsync.macports.org/release/ports/lang/perl5
DEBUG: setting option os.universal_supported to yes
DEBUG: org.macports.load registered provides 'load', a pre-existing procedure. Target override will not be provided
DEBUG: org.macports.distfiles registered provides 'distfiles', a pre-existing procedure. Target override will not be provided
DEBUG: 'universal_variant no' specified, so not adding the default universal variant
DEBUG: Requested variant darwin is not provided by port perl5.
DEBUG: Requested variant i386 is not provided by port perl5.
DEBUG: Requested variant macosx is not provided by port perl5.
DEBUG: Searching for dependency: perl5
DEBUG: Found Dependency: receipt exists for perl5
DEBUG: Found port in file:///opt/local/var/macports/sources/rsync.macports.org/release/ports/x11/qt3
DEBUG: Changing to port directory: /opt/local/var/macports/sources/rsync.macports.org/release/ports/x11/qt3
DEBUG: setting option os.universal_supported to yes
DEBUG: org.macports.load registered provides 'load', a pre-existing procedure. Target override will not be provided
DEBUG: org.macports.distfiles registered provides 'distfiles', a pre-existing procedure. Target override will not be provided
DEBUG: 'universal_variant no' specified, so not adding the default universal variant
DEBUG: Requested variant darwin is not provided by port qt3.
DEBUG: Requested variant i386 is not provided by port qt3.
DEBUG: Requested variant macosx is not provided by port qt3.
DEBUG: Executing variant darwin_9 provides darwin_9
DEBUG: Searching for dependency: qt3
DEBUG: Found Dependency: receipt exists for qt3
DEBUG: Found port in file:///opt/local/var/macports/sources/rsync.macports.org/release/ports/archivers/zlib
DEBUG: Changing to port directory: /opt/local/var/macports/sources/rsync.macports.org/release/ports/archivers/zlib
DEBUG: setting option os.universal_supported to yes
DEBUG: org.macports.load registered provides 'load', a pre-existing procedure. Target override will not be provided
DEBUG: org.macports.distfiles registered provides 'distfiles', a pre-existing procedure. Target override will not be provided
DEBUG: adding the default universal variant
DEBUG: Requested variant darwin is not provided by port zlib.
DEBUG: Requested variant i386 is not provided by port zlib.
DEBUG: Requested variant macosx is not provided by port zlib.
DEBUG: Searching for dependency: zlib
DEBUG: Found Dependency: receipt exists for zlib
DEBUG: Found port in file:///opt/local/var/macports/sources/rsync.macports.org/release/ports/devel/autoconf
DEBUG: Changing to port directory: /opt/local/var/macports/sources/rsync.macports.org/release/ports/devel/autoconf
DEBUG: setting option os.universal_supported to yes
DEBUG: org.macports.load registered provides 'load', a pre-existing procedure. Target override will not be provided
DEBUG: org.macports.distfiles registered provides 'distfiles', a pre-existing procedure. Target override will not be provided
DEBUG: adding the default universal variant
DEBUG: Requested variant darwin is not provided by port autoconf.
DEBUG: Requested variant i386 is not provided by port autoconf.
DEBUG: Requested variant macosx is not provided by port autoconf.
DEBUG: Searching for dependency: autoconf
DEBUG: Found Dependency: receipt exists for autoconf
DEBUG: Found port in file:///opt/local/var/macports/sources/rsync.macports.org/release/ports/devel/pkgconfig
DEBUG: Changing to port directory: /opt/local/var/macports/sources/rsync.macports.org/release/ports/devel/pkgconfig
DEBUG: setting option os.universal_supported to yes
DEBUG: org.macports.load registered provides 'load', a pre-existing procedure. Target override will not be provided
DEBUG: org.macports.distfiles registered provides 'distfiles', a pre-existing procedure. Target override will not be provided
DEBUG: adding the default universal variant
DEBUG: Requested variant darwin is not provided by port pkgconfig.
DEBUG: Requested variant i386 is not provided by port pkgconfig.
DEBUG: Requested variant macosx is not provided by port pkgconfig.
DEBUG: Searching for dependency: pkgconfig
DEBUG: Found Dependency: receipt exists for pkgconfig
DEBUG: Found port in file:///opt/local/var/macports/sources/rsync.macports.org/release/ports/devel/unsermake
DEBUG: Changing to port directory: /opt/local/var/macports/sources/rsync.macports.org/release/ports/devel/unsermake
DEBUG: setting option os.universal_supported to yes
DEBUG: org.macports.load registered provides 'load', a pre-existing procedure. Target override will not be provided
DEBUG: org.macports.distfiles registered provides 'distfiles', a pre-existing procedure. Target override will not be provided
DEBUG: adding the default universal variant
DEBUG: Requested variant darwin is not provided by port unsermake.
DEBUG: Requested variant i386 is not provided by port unsermake.
DEBUG: Requested variant macosx is not provided by port unsermake.
DEBUG: Searching for dependency: unsermake
DEBUG: Found Dependency: receipt exists for unsermake
DEBUG: Found port in file:///opt/local/var/macports/sources/rsync.macports.org/release/ports/x11/dejavu-fonts
DEBUG: Changing to port directory: /opt/local/var/macports/sources/rsync.macports.org/release/ports/x11/dejavu-fonts
DEBUG: setting option os.universal_supported to yes
DEBUG: org.macports.load registered provides 'load', a pre-existing procedure. Target override will not be provided
DEBUG: org.macports.distfiles registered provides 'distfiles', a pre-existing procedure. Target override will not be provided
DEBUG: 'universal_variant no' specified, so not adding the default universal variant
DEBUG: Requested variant darwin is not provided by port dejavu-fonts.
DEBUG: Requested variant i386 is not provided by port dejavu-fonts.
DEBUG: Requested variant macosx is not provided by port dejavu-fonts.
DEBUG: Searching for dependency: dejavu-fonts
DEBUG: Found Dependency: receipt exists for dejavu-fonts
DEBUG: Executing org.macports.main (kdelibs3)
DEBUG: Skipping completed org.macports.fetch (kdelibs3)
DEBUG: Skipping completed org.macports.checksum (kdelibs3)
DEBUG: setting option extract.cmd to /opt/local/bin/bzip2
DEBUG: Skipping completed org.macports.extract (kdelibs3)
DEBUG: Skipping completed org.macports.patch (kdelibs3)
DEBUG: Skipping completed org.macports.configure (kdelibs3)
--->  Building kdelibs3
DEBUG: Executing org.macports.build (kdelibs3)
#!/bin/sh -ev

	export PREFIX="/opt/local" USE_UNSERMAKE=1
	. ./environment-helper.sh
#!/bin/sh

[ -n "$EH_PREFIX" ] && export PREFIX="$EH_PREFIX"
if [ -z "$PREFIX" ]; then
	echo "ERROR: set \$PREFIX before sourcing this script!"
	exit 1
fi

export LDFLAGS=""

# set some basic OS stuff
SW_VERSION=`sw_vers -productVersion | cut -d. -f1-2`
sw_vers -productVersion | cut -d. -f1-2
case $SW_VERSION in
	10.[01])
		echo "unsupported OS version: $SW_VERSION"
		exit 1
		;;
	10.2)
		export MACOSX_DEPLOYMENT_TARGET=10.2
		FREETYPE_CONFIG=$PREFIX/bin/freetype-config
		;;
	10.3)
		export MACOSX_DEPLOYMENT_TARGET="$SW_VERSION"
		export LD_TWOLEVEL_NAMESPACE=true
		FREETYPE_CONFIG=$PREFIX/bin/freetype-config
		;;
	10.4)
		export MACOSX_DEPLOYMENT_TARGET="$SW_VERSION"
		export LD_TWOLEVEL_NAMESPACE=true
		FREETYPE_CONFIG=$PREFIX/bin/freetype-config

		GCCCMD="gcc"
		[ -n "$CC" ] && GCCCMD="$CC"

		if [ `$GCCCMD --version 2>&1 | grep -c ' 4.0.0 '` -gt 0 ]; then
			cat <<END
=== ERROR === ERROR === ERROR === ERROR === ERROR === ERROR ===

You are using GCC 4.0.0, which is known to compile KDE, but
produce bad code.  Please update to XCode 2.2 or higher.

=== ERROR === ERROR === ERROR === ERROR === ERROR === ERROR ===
END
			exit 1
		fi
		;;
	10.5)
		export MACOSX_DEPLOYMENT_TARGET="$SW_VERSION"
		export LD_TWOLEVEL_NAMESPACE=true
		export LDFLAGS="-Wl,-dylib_file,/System/Library/Frameworks/OpenGL.framework/Versions/A/Libraries/libGL.dylib:/System/Library/Frameworks/OpenGL.framework/Versions/A/Libraries/libGL.dylib -Wl,-dead_strip_dylibs"
		FREETYPE_CONFIG=$PREFIX/bin/freetype-config
		;;
	*)
		export MACOSX_DEPLOYMENT_TARGET="$SW_VERSION"
		export LD_TWOLEVEL_NAMESPACE=true
		export LDFLAGS="-Wl,-dead_strip_dylibs"
		FREETYPE_CONFIG=$PREFIX/bin/freetype-config
		;;
esac

if [ -n "$USE_UNSERMAKE" ] && [ "$USE_UNSERMAKE" -gt 0 ]; then
	UNSERMAKEFLAGS=`perl -e '$ENV{MAKEFLAGS} =~ s/^.*?-j(\d+).*?$/-j1 --compile-jobs=$1/; print $ENV{MAKEFLAGS}'`
	UNSERMAKEFLAGS="$UNSERMAKEFLAGS -p"
	MAKEFLAGS=""
fi
perl -e '$ENV{MAKEFLAGS} =~ s/^.*?-j(\d+).*?$/-j1 --compile-jobs=$1/; print $ENV{MAKEFLAGS}'


SEARCHDIRS="$PREFIX/lib/system-openssl $PREFIX $PREFIX/lib/flex $PREFIX/lib/doxygen1.3"

for dir in $SEARCHDIRS; do
	if [ -d "$dir" ]; then
		for incdir in "$dir/include/freetype2" "$dir/include"; do
			if [ -d "$incdir" ]; then
				export CPPFLAGS="$CPPFLAGS -I$incdir"
			fi
		done
		[ -d "$dir/lib" ]           && export LDFLAGS="-L$dir/lib $LDFLAGS"
		[ -d "$dir/bin" ]           && export PATH="$dir/bin:$PATH"
		[ -d "$dir/lib/pkgconfig" ] && export PKG_CONFIG_PATH="$dir/lib/pkgconfig:$PKG_CONFIG_PATH"
	fi
done

# -fast, minus the unsafe bits
if [ -d "libltdl" ]; then
	export ACLOCALFLAGS="$ACLOCALFLAGS -I libltdl"
fi
export CFLAGS="-Os -fPIC"
export CXXFLAGS="$CFLAGS"
export CPPFLAGS="$CPPFLAGS -fno-common -no-cpp-precomp -DMACOSX -DARTS_NO_ALARM -I$PREFIX/include"
export FREETYPE_CONFIG
export LIBS="$LIBS -L$PREFIX/lib"
export SED="sed"
export CONFIGURE_PARAMS="--includedir=$PREFIX/include --libdir=$PREFIX/lib --prefix=$PREFIX --with-extra-libs=$PREFIX/lib --with-extra-includes=$PREFIX/include --enable-mt --with-pic --enable-rpath --enable-shared=yes --enable-static=no --mandir=$PREFIX/share/man --with-xinerama --with-pam --disable-final --with-ssl-dir=$PREFIX --with-ssl --disable-dependency-tracking --enable-gcc-hidden-visibility"

export ac_cv_have_x="have_x=yes ac_x_includes=$PREFIX/include ac_x_libraries=$PREFIX/lib"
export kde_cv_have_x="have_x=yes kde_x_includes=$PREFIX/include kde_x_libraries=$PREFIX/lib"
export x_includes="$PREFIX/include" x_libraries="$PREFIX/lib"
export XMKMF="$PREFIX/bin/xmkmf" IMAKE="$PREFIX/bin/imake"

# miscellaneous stuff that packages use
export lt_cv_sys_max_cmd_len=65536
export HOME=/opt/local/var/macports/build/_opt_local_var_macports_sources_rsync.macports.org_release_ports_kde_kdelibs3/work
export QTDOCDIR="$PREFIX/share/doc/qt3/html"
[ -x "$PREFIX/lib/flex/bin/flex" ] && export LEX="$PREFIX/lib/flex/bin/flex"

if [ -e "$PREFIX/lib/qt3/include" ]; then
	CONFIGURE_PARAMS="$CONFIGURE_PARAMS --with-qt-dir=$PREFIX/lib/qt3"
else
	CONFIGURE_PARAMS="$CONFIGURE_PARAMS --with-qt-dir=$PREFIX --with-qt-includes=$PREFIX/include/qt"
fi

PATH=`echo $PATH | perl -p -e 'for my $entry (split(/:/, $_)) { next if ($entry =~ m,^/usr/local,); push(@path, $entry) }; $_ = join(":", @path)'`
echo $PATH | perl -p -e 'for my $entry (split(/:/, $_)) { next if ($entry =~ m,^/usr/local,); push(@path, $entry) }; $_ = join(":", @path)'

if [ -x "$PREFIX/lib/xmkmf/bin" ]; then
	export PATH="$PREFIX/lib/xmkmf/bin:$PATH"
	export IMAKEINCLUDE="-I$PREFIX/lib/X11/config"
fi

if [ `grep -r /usr/X11R6 admin 2>/dev/null | wc -l` -gt 0 ]; then
	echo "*** replacing /usr/X11R6 with $PREFIX in the admin/ directory ***"
	find admin -type f | xargs perl -pi -e "s,/usr/X11R6,$PREFIX,g"
fi
grep -r /usr/X11R6 admin 2>/dev/null | wc -l

if [ -x "/usr/bin/gcc-4.2" ]; then
	if [ -x "$PREFIX/bin/ccache" ]; then
		mkdir -p gcc-root
		[ ! -e gcc-root/gcc-4.2 ] && ln -s $PREFIX/bin/ccache gcc-root/gcc-4.2
		[ ! -e gcc-root/g++-4.2 ] && ln -s $PREFIX/bin/ccache gcc-root/g++-4.2
		export PATH=`pwd`/gcc-root:"$PATH"
		export CC="gcc-4.2"
		export CXX="g++-4.2"
	else
		export CC="/usr/bin/gcc-4.2"
		export CXX="/usr/bin/g++-4.2"
	fi
else
	export CC="gcc"
	export CXX="g++"
fi

export ALL_LIBRARIES="$LDFLAGS $LIBS"

cat <<END
the following environment is being used:

  ACLOCALFLAGS:             $ACLOCALFLAGS
  CFLAGS:                   $CFLAGS
  CPPFLAGS:                 $CPPFLAGS
  CXXFLAGS:                 $CXXFLAGS
  CC:                       $CC
  CXX:                      $CXX
  FREETYPE_CONFIG:          $FREETYPE_CONFIG
  LDFLAGS:                  $LDFLAGS
  LIBS:                     $LIBS
  MACOSX_DEPLOYMENT_TARGET: $MACOSX_DEPLOYMENT_TARGET
  PATH:                     $PATH
  PKG_CONFIG_PATH:          $PKG_CONFIG_PATH
  CONFIGURE_PARAMS:         $CONFIGURE_PARAMS
  UNSERMAKEFLAGS:           $UNSERMAKEFLAGS
  MAKEFLAGS:                $MAKEFLAGS

END
the following environment is being used:

  ACLOCALFLAGS:              -I libltdl
  CFLAGS:                   -Os -fPIC
  CPPFLAGS:                  -I/opt/local/include/freetype2 -I/opt/local/include -fno-common -no-cpp-precomp -DMACOSX -DARTS_NO_ALARM -I/opt/local/include
  CXXFLAGS:                 -Os -fPIC
  CC:                       /usr/bin/gcc-4.2
  CXX:                      /usr/bin/g++-4.2
  FREETYPE_CONFIG:          /opt/local/bin/freetype-config
  LDFLAGS:                  -L/opt/local/lib -Wl,-dylib_file,/System/Library/Frameworks/OpenGL.framework/Versions/A/Libraries/libGL.dylib:/System/Library/Frameworks/OpenGL.framework/Versions/A/Libraries/libGL.dylib -Wl,-dead_strip_dylibs
  LIBS:                      -L/opt/local/lib
  MACOSX_DEPLOYMENT_TARGET: 10.5
  PATH:                     /opt/local/bin:/opt/local/bin:/opt/local/sbin:/bin:/sbin:/usr/bin:/usr/sbin:/usr/X11/bin
  PKG_CONFIG_PATH:          /opt/local/lib/pkgconfig:
  CONFIGURE_PARAMS:         --includedir=/opt/local/include --libdir=/opt/local/lib --prefix=/opt/local --with-extra-libs=/opt/local/lib --with-extra-includes=/opt/local/include --enable-mt --with-pic --enable-rpath --enable-shared=yes --enable-static=no --mandir=/opt/local/share/man --with-xinerama --with-pam --disable-final --with-ssl-dir=/opt/local --with-ssl --disable-dependency-tracking --enable-gcc-hidden-visibility --with-qt-dir=/opt/local/lib/qt3
  UNSERMAKEFLAGS:           -j 1 -p
  MAKEFLAGS:                


	case $SW_VERSION in 
		6*|7*)
			export CPPFLAGS="$CPPFLAGS -DHAVE_SYS_EXEC_H=1"
			;; 
	esac

	export CPPFLAGS="-I/usr/include/gssapi $CPPFLAGS"

	./build-helper.sh cvs       kdelibs3 3.5.10 1 make -f admin/Makefile.common cvs
*** YOU'RE USING UNSERMAKE.
*** GOOD LUCK!! :)
*** Creating acinclude.m4
make[1]: Nothing to be done for `acinclude.m4'.
*** Creating list of subdirectories
*** Creating Makefile.am
*** Creating configure.files
*** Creating configure.in
*** Creating aclocal.m4
acinclude.m4:3724: the serial number must appear before any macro definition
acinclude.m4:3769: the serial number must appear before any macro definition
acinclude.m4:3814: the serial number must appear before any macro definition
acinclude.m4:6007: the serial number must appear before any macro definition
acinclude.m4:12474: the serial number must appear before any macro definition
configure.in:32: warning: AC_REQUIRE: `AC_PROG_CC' was expanded before it was required
../../lib/autoconf/c.m4:433: AC_LANG_COMPILER(C) is expanded from...
../../lib/autoconf/lang.m4:315: AC_LANG_COMPILER_REQUIRE is expanded from...
../../lib/autoconf/general.m4:2593: AC_COMPILE_IFELSE is expanded from...
../../lib/autoconf/general.m4:2601: AC_TRY_COMPILE is expanded from...
acinclude.m4:3003: KDE_CHECK_FOR_BAD_COMPILER is expanded from...
acinclude.m4:3084: AC_CHECK_COMPILERS is expanded from...
configure.in:32: the top level
configure.in:32: warning: AC_REQUIRE: `AC_PROG_CXX' was expanded before it was required
../../lib/autoconf/c.m4:671: AC_LANG_COMPILER(C++) is expanded from...
../../lib/autoconf/general.m4:2665: AC_LINK_IFELSE is expanded from...
../../lib/autoconf/general.m4:2674: AC_TRY_LINK is expanded from...
../../lib/m4sugar/m4sh.m4:620: AS_IF is expanded from...
../../lib/autoconf/general.m4:2018: AC_CACHE_VAL is expanded from...
acinclude.m4:2928: KDE_CHECK_COMPILER_FLAG is expanded from...
configure.in:37: warning: AC_REQUIRE: `AC_OBJEXT' was expanded before it was required
acinclude.m4:6077: AC_LIBTOOL_SETUP is expanded from...
acinclude.m4:6057: _AC_PROG_LIBTOOL is expanded from...
acinclude.m4:6022: AC_PROG_LIBTOOL is expanded from...
acinclude.m4:12312: AM_PROG_LIBTOOL is expanded from...
acinclude.m4:3497: KDE_PROG_LIBTOOL is expanded from...
configure.in:37: the top level
configure.in:37: warning: AC_REQUIRE: `AC_EXEEXT' was expanded before it was required
configure.in:37: warning: AC_CACHE_VAL(lt_prog_compiler_pic_works, ...): suspicious cache-id, must contain _cv_ to be cached
../../lib/autoconf/general.m4:2039: AC_CACHE_CHECK is expanded from...
acinclude.m4:6612: AC_LIBTOOL_COMPILER_OPTION is expanded from...
acinclude.m4:10812: AC_LIBTOOL_PROG_COMPILER_PIC is expanded from...
acinclude.m4:8648: _LT_AC_LANG_C_CONFIG is expanded from...
acinclude.m4:8647: AC_LIBTOOL_LANG_C_CONFIG is expanded from...
configure.in:37: warning: AC_CACHE_VAL(lt_prog_compiler_static_works, ...): suspicious cache-id, must contain _cv_ to be cached
acinclude.m4:6657: AC_LIBTOOL_LINKER_OPTION is expanded from...
configure.in:37: warning: AC_CACHE_VAL(lt_prog_compiler_pic_works_CXX, ...): suspicious cache-id, must contain _cv_ to be cached
acinclude.m4:8729: _LT_AC_LANG_CXX_CONFIG is expanded from...
acinclude.m4:8728: AC_LIBTOOL_LANG_CXX_CONFIG is expanded from...
acinclude.m4:7784: _LT_AC_TAGCONFIG is expanded from...
configure.in:37: warning: AC_CACHE_VAL(lt_prog_compiler_static_works_CXX, ...): suspicious cache-id, must contain _cv_ to be cached
configure.in:37: warning: AC_CACHE_VAL(lt_prog_compiler_pic_works_F77, ...): suspicious cache-id, must contain _cv_ to be cached
acinclude.m4:9896: _LT_AC_LANG_F77_CONFIG is expanded from...
acinclude.m4:9895: AC_LIBTOOL_LANG_F77_CONFIG is expanded from...
configure.in:37: warning: AC_CACHE_VAL(lt_prog_compiler_static_works_F77, ...): suspicious cache-id, must contain _cv_ to be cached
configure.in:37: warning: AC_CACHE_VAL(lt_prog_compiler_pic_works_GCJ, ...): suspicious cache-id, must contain _cv_ to be cached
acinclude.m4:9998: _LT_AC_LANG_GCJ_CONFIG is expanded from...
acinclude.m4:9997: AC_LIBTOOL_LANG_GCJ_CONFIG is expanded from...
configure.in:37: warning: AC_CACHE_VAL(lt_prog_compiler_static_works_GCJ, ...): suspicious cache-id, must contain _cv_ to be cached
configure.in:1473: warning: AC_CACHE_VAL(kde_link_libthai, ...): suspicious cache-id, must contain _cv_ to be cached
configure.in:1421: KDE_CHECK_LIBTHAI is expanded from...
configure.in:1473: the top level
*** Creating configure
configure.in:32: warning: AC_REQUIRE: `AC_PROG_CC' was expanded before it was required
../../lib/autoconf/c.m4:433: AC_LANG_COMPILER(C) is expanded from...
../../lib/autoconf/lang.m4:315: AC_LANG_COMPILER_REQUIRE is expanded from...
../../lib/autoconf/general.m4:2593: AC_COMPILE_IFELSE is expanded from...
../../lib/autoconf/general.m4:2601: AC_TRY_COMPILE is expanded from...
acinclude.m4:3003: KDE_CHECK_FOR_BAD_COMPILER is expanded from...
acinclude.m4:3084: AC_CHECK_COMPILERS is expanded from...
configure.in:32: the top level
configure.in:32: warning: AC_REQUIRE: `AC_PROG_CXX' was expanded before it was required
../../lib/autoconf/c.m4:671: AC_LANG_COMPILER(C++) is expanded from...
../../lib/autoconf/general.m4:2665: AC_LINK_IFELSE is expanded from...
../../lib/autoconf/general.m4:2674: AC_TRY_LINK is expanded from...
../../lib/m4sugar/m4sh.m4:620: AS_IF is expanded from...
../../lib/autoconf/general.m4:2018: AC_CACHE_VAL is expanded from...
acinclude.m4:2928: KDE_CHECK_COMPILER_FLAG is expanded from...
configure.in:37: warning: AC_REQUIRE: `AC_OBJEXT' was expanded before it was required
acinclude.m4:6077: AC_LIBTOOL_SETUP is expanded from...
acinclude.m4:6057: _AC_PROG_LIBTOOL is expanded from...
acinclude.m4:6022: AC_PROG_LIBTOOL is expanded from...
acinclude.m4:12312: AM_PROG_LIBTOOL is expanded from...
acinclude.m4:3497: KDE_PROG_LIBTOOL is expanded from...
configure.in:37: the top level
configure.in:37: warning: AC_REQUIRE: `AC_EXEEXT' was expanded before it was required
configure.in:37: warning: AC_CACHE_VAL(lt_prog_compiler_pic_works, ...): suspicious cache-id, must contain _cv_ to be cached
../../lib/autoconf/general.m4:2039: AC_CACHE_CHECK is expanded from...
acinclude.m4:6612: AC_LIBTOOL_COMPILER_OPTION is expanded from...
acinclude.m4:10812: AC_LIBTOOL_PROG_COMPILER_PIC is expanded from...
acinclude.m4:8648: _LT_AC_LANG_C_CONFIG is expanded from...
acinclude.m4:8647: AC_LIBTOOL_LANG_C_CONFIG is expanded from...
configure.in:37: warning: AC_CACHE_VAL(lt_prog_compiler_static_works, ...): suspicious cache-id, must contain _cv_ to be cached
acinclude.m4:6657: AC_LIBTOOL_LINKER_OPTION is expanded from...
configure.in:37: warning: AC_CACHE_VAL(lt_prog_compiler_pic_works_CXX, ...): suspicious cache-id, must contain _cv_ to be cached
acinclude.m4:8729: _LT_AC_LANG_CXX_CONFIG is expanded from...
acinclude.m4:8728: AC_LIBTOOL_LANG_CXX_CONFIG is expanded from...
acinclude.m4:7784: _LT_AC_TAGCONFIG is expanded from...
configure.in:37: warning: AC_CACHE_VAL(lt_prog_compiler_static_works_CXX, ...): suspicious cache-id, must contain _cv_ to be cached
configure.in:37: warning: AC_CACHE_VAL(lt_prog_compiler_pic_works_F77, ...): suspicious cache-id, must contain _cv_ to be cached
acinclude.m4:9896: _LT_AC_LANG_F77_CONFIG is expanded from...
acinclude.m4:9895: AC_LIBTOOL_LANG_F77_CONFIG is expanded from...
configure.in:37: warning: AC_CACHE_VAL(lt_prog_compiler_static_works_F77, ...): suspicious cache-id, must contain _cv_ to be cached
configure.in:37: warning: AC_CACHE_VAL(lt_prog_compiler_pic_works_GCJ, ...): suspicious cache-id, must contain _cv_ to be cached
acinclude.m4:9998: _LT_AC_LANG_GCJ_CONFIG is expanded from...
acinclude.m4:9997: AC_LIBTOOL_LANG_GCJ_CONFIG is expanded from...
configure.in:37: warning: AC_CACHE_VAL(lt_prog_compiler_static_works_GCJ, ...): suspicious cache-id, must contain _cv_ to be cached
configure.in:1473: warning: AC_CACHE_VAL(kde_link_libthai, ...): suspicious cache-id, must contain _cv_ to be cached
configure.in:1421: KDE_CHECK_LIBTHAI is expanded from...
configure.in:1473: the top level
configure:30968: error: possibly undefined macro: AH_CHECK_HEADERS
      If this token and others are legitimate, please use m4_pattern_allow.
      See the Autoconf documentation.
make: *** [cvs] Error 1
kdelibs3-3.5.10-1 cvs failed!
Error: Target org.macports.build returned: shell command "cd /opt/local/var/macports/build/_opt_local_var_macports_sources_rsync.macports.org_release_ports_kde_kdelibs3/work/kdelibs-3.5.10 && MAKEFLAGS="-j 1" ./CompileScript.sh" returned error 1
Command output: configure.in:37: warning: AC_REQUIRE: `AC_EXEEXT' was expanded before it was required
configure.in:37: warning: AC_CACHE_VAL(lt_prog_compiler_pic_works, ...): suspicious cache-id, must contain _cv_ to be cached
../../lib/autoconf/general.m4:2039: AC_CACHE_CHECK is expanded from...
acinclude.m4:6612: AC_LIBTOOL_COMPILER_OPTION is expanded from...
acinclude.m4:10812: AC_LIBTOOL_PROG_COMPILER_PIC is expanded from...
acinclude.m4:8648: _LT_AC_LANG_C_CONFIG is expanded from...
acinclude.m4:8647: AC_LIBTOOL_LANG_C_CONFIG is expanded from...
configure.in:37: warning: AC_CACHE_VAL(lt_prog_compiler_static_works, ...): suspicious cache-id, must contain _cv_ to be cached
acinclude.m4:6657: AC_LIBTOOL_LINKER_OPTION is expanded from...
configure.in:37: warning: AC_CACHE_VAL(lt_prog_compiler_pic_works_CXX, ...): suspicious cache-id, must contain _cv_ to be cached
acinclude.m4:8729: _LT_AC_LANG_CXX_CONFIG is expanded from...
acinclude.m4:8728: AC_LIBTOOL_LANG_CXX_CONFIG is expanded from...
acinclude.m4:7784: _LT_AC_TAGCONFIG is expanded from...
configure.in:37: warning: AC_CACHE_VAL(lt_prog_compiler_static_works_CXX, ...): suspicious cache-id, must contain _cv_ to be cached
configure.in:37: warning: AC_CACHE_VAL(lt_prog_compiler_pic_works_F77, ...): suspicious cache-id, must contain _cv_ to be cached
acinclude.m4:9896: _LT_AC_LANG_F77_CONFIG is expanded from...
acinclude.m4:9895: AC_LIBTOOL_LANG_F77_CONFIG is expanded from...
configure.in:37: warning: AC_CACHE_VAL(lt_prog_compiler_static_works_F77, ...): suspicious cache-id, must contain _cv_ to be cached
configure.in:37: warning: AC_CACHE_VAL(lt_prog_compiler_pic_works_GCJ, ...): suspicious cache-id, must contain _cv_ to be cached
acinclude.m4:9998: _LT_AC_LANG_GCJ_CONFIG is expanded from...
acinclude.m4:9997: AC_LIBTOOL_LANG_GCJ_CONFIG is expanded from...
configure.in:37: warning: AC_CACHE_VAL(lt_prog_compiler_static_works_GCJ, ...): suspicious cache-id, must contain _cv_ to be cached
configure.in:1473: warning: AC_CACHE_VAL(kde_link_libthai, ...): suspicious cache-id, must contain _cv_ to be cached
configure.in:1421: KDE_CHECK_LIBTHAI is expanded from...
configure.in:1473: the top level
configure:30968: error: possibly undefined macro: AH_CHECK_HEADERS
      If this token and others are legitimate, please use m4_pattern_allow.
      See the Autoconf documentation.
make: *** [cvs] Error 1
kdelibs3-3.5.10-1 cvs failed!

Warning: the following items did not execute (for kdelibs3): org.macports.activate org.macports.build org.macports.destroot org.macports.install
Error: Status 1 encountered during processing.

comment:4 Changed 11 years ago by tobypeterson

Cc: watership@… added
Version: 1.7.1

comment:5 Changed 11 years ago by shelfari@…

i was able to get around this by installing autoconf 2.63, deactivating 2.64, and activing 2.63.

you can check which autoconf you have active by executing

sudo port installed autoconf

if 2.64 is active then deactivate with

sudo port deactivate autoconf @2.64

if you have 2.63 installed, activate it with

sudo port activate autoconf @2.63

reverse the deactivate/activate procedure to get back to the latest autoconf.

if you don't have 2.63 installed, then follow the instructions here on installing an older version of a port.
you'll want the autoconf version here.

after you install, activate as I previously mentioned.

comment:6 Changed 11 years ago by watership@…

Great! That was it!

Thanks for the solution...

comment:7 Changed 11 years ago by ryandesign (Ryan Schmidt)

Cc: ryandesign@… added
Port: autoconf added
Summary: kdelibs3 3.5.10 build errorkdelibs3 3.5.10 incompatible with autoconf 2.64

comment:8 Changed 11 years ago by ryandesign (Ryan Schmidt)

For now, I cannot figure out how to make kdelibs3 compile with autoconf 2.64, so I have added a better error message to the port in r55843.

comment:9 Changed 11 years ago by ryandesign (Ryan Schmidt)

Resolution: fixed
Status: newclosed

Takanori added a new autoconf263 port in r55849 and made all the kde3 ports use it in r55865.

Note: See TracTickets for help on using tickets.