New Ticket     Tickets     Wiki     Browse Source     Timeline     Roadmap     Ticket Reports     Search

Ticket #20586 (closed defect: worksforme)

Opened 5 years ago

Last modified 3 years ago

tk 8.5.6: X11/Xlib.h: No such file or directory

Reported by: rictic@… Owned by: mww@…
Priority: Normal Milestone:
Component: ports Version:
Keywords: Cc: akaukone@…, ryandesign@…
Port: tk

Description

loki:~/ peter$ port -v
MacPorts 1.710
loki:~/ peter$ sudo /opt/local/bin/port clean --all -f tk
--->  Cleaning tk
loki:~/ peter$ sudo port install tk
--->  Fetching tk
--->  Attempting to fetch tk8.5.6-src.tar.gz from http://voxel.dl.sourceforge.net/tcl
--->  Attempting to fetch tcl8.5.6-src.tar.gz from http://voxel.dl.sourceforge.net/tcl
--->  Verifying checksum(s) for tk
--->  Extracting tk
--->  Configuring tk
--->  Building tk
Error: Target org.macports.build returned: shell command " cd "/opt/local/var/macports/build/_opt_local_var_macports_sources_rsync.macports.org_release_ports_x11_tk/work/tk8.5.6/unix" && make all " returned error 2
Command output: /opt/local/var/macports/build/_opt_local_var_macports_sources_rsync.macports.org_release_ports_x11_tk/work/tk8.5.6/unix/../generic/tk3d.c: At top level:
/opt/local/var/macports/build/_opt_local_var_macports_sources_rsync.macports.org_release_ports_x11_tk/work/tk8.5.6/unix/../generic/tk3d.c:1167: error: syntax error before '*' token
/opt/local/var/macports/build/_opt_local_var_macports_sources_rsync.macports.org_release_ports_x11_tk/work/tk8.5.6/unix/../generic/tk3d.c: In function 'Intersect':
/opt/local/var/macports/build/_opt_local_var_macports_sources_rsync.macports.org_release_ports_x11_tk/work/tk8.5.6/unix/../generic/tk3d.c:1181: error: 'a2Ptr' undeclared (first use in this function)
/opt/local/var/macports/build/_opt_local_var_macports_sources_rsync.macports.org_release_ports_x11_tk/work/tk8.5.6/unix/../generic/tk3d.c:1181: error: 'a1Ptr' undeclared (first use in this function)
/opt/local/var/macports/build/_opt_local_var_macports_sources_rsync.macports.org_release_ports_x11_tk/work/tk8.5.6/unix/../generic/tk3d.c:1181: error: 'b2Ptr' undeclared (first use in this function)
/opt/local/var/macports/build/_opt_local_var_macports_sources_rsync.macports.org_release_ports_x11_tk/work/tk8.5.6/unix/../generic/tk3d.c:1181: error: 'b1Ptr' undeclared (first use in this function)
/opt/local/var/macports/build/_opt_local_var_macports_sources_rsync.macports.org_release_ports_x11_tk/work/tk8.5.6/unix/../generic/tk3d.c:1196: error: 'iPtr' undeclared (first use in this function)
/opt/local/var/macports/build/_opt_local_var_macports_sources_rsync.macports.org_release_ports_x11_tk/work/tk8.5.6/unix/../generic/tk3d.c: In function 'Tk_Get3DBorderFromObj':
/opt/local/var/macports/build/_opt_local_var_macports_sources_rsync.macports.org_release_ports_x11_tk/work/tk8.5.6/unix/../generic/tk3d.c:1240: error: 'borderPtr' undeclared (first use in this function)
/opt/local/var/macports/build/_opt_local_var_macports_sources_rsync.macports.org_release_ports_x11_tk/work/tk8.5.6/unix/../generic/tk3d.c:1242: error: invalid operands to binary *
/opt/local/var/macports/build/_opt_local_var_macports_sources_rsync.macports.org_release_ports_x11_tk/work/tk8.5.6/unix/../generic/tk3d.c:1242: error: syntax error before ')' token
/opt/local/var/macports/build/_opt_local_var_macports_sources_rsync.macports.org_release_ports_x11_tk/work/tk8.5.6/unix/../generic/tk3d.c:1254: error: syntax error before ')' token
/opt/local/var/macports/build/_opt_local_var_macports_sources_rsync.macports.org_release_ports_x11_tk/work/tk8.5.6/unix/../generic/tk3d.c:1257: error: syntax error before ')' token
/opt/local/var/macports/build/_opt_local_var_macports_sources_rsync.macports.org_release_ports_x11_tk/work/tk8.5.6/unix/../generic/tk3d.c:1257: error: syntax error before ')' token
/opt/local/var/macports/build/_opt_local_var_macports_sources_rsync.macports.org_release_ports_x11_tk/work/tk8.5.6/unix/../generic/tk3d.c:1258: error: syntax error before ')' token
/opt/local/var/macports/build/_opt_local_var_macports_sources_rsync.macports.org_release_ports_x11_tk/work/tk8.5.6/unix/../generic/tk3d.c:1278: error: request for member 'borderTable' in something not a structure or union
/opt/local/var/macports/build/_opt_local_var_macports_sources_rsync.macports.org_release_ports_x11_tk/work/tk8.5.6/unix/../generic/tk3d.c:1278: error: request for member 'borderTable' in something not a structure or union
/opt/local/var/macports/build/_opt_local_var_macports_sources_rsync.macports.org_release_ports_x11_tk/work/tk8.5.6/unix/../generic/tk3d.c:1282: error: syntax error before ')' token
/opt/local/var/macports/build/_opt_local_var_macports_sources_rsync.macports.org_release_ports_x11_tk/work/tk8.5.6/unix/../generic/tk3d.c:1284: error: syntax error before ')' token
/opt/local/var/macports/build/_opt_local_var_macports_sources_rsync.macports.org_release_ports_x11_tk/work/tk8.5.6/unix/../generic/tk3d.c:1284: error: syntax error before ')' token
/opt/local/var/macports/build/_opt_local_var_macports_sources_rsync.macports.org_release_ports_x11_tk/work/tk8.5.6/unix/../generic/tk3d.c:1285: error: syntax error before ')' token
/opt/local/var/macports/build/_opt_local_var_macports_sources_rsync.macports.org_release_ports_x11_tk/work/tk8.5.6/unix/../generic/tk3d.c: In function 'TkDebugBorder':
/opt/local/var/macports/build/_opt_local_var_macports_sources_rsync.macports.org_release_ports_x11_tk/work/tk8.5.6/unix/../generic/tk3d.c:1365: error: 'borderPtr' undeclared (first use in this function)
/opt/local/var/macports/build/_opt_local_var_macports_sources_rsync.macports.org_release_ports_x11_tk/work/tk8.5.6/unix/../generic/tk3d.c:1368: error: invalid operands to binary *
/opt/local/var/macports/build/_opt_local_var_macports_sources_rsync.macports.org_release_ports_x11_tk/work/tk8.5.6/unix/../generic/tk3d.c:1368: error: syntax error before ')' token
/opt/local/var/macports/build/_opt_local_var_macports_sources_rsync.macports.org_release_ports_x11_tk/work/tk8.5.6/unix/../generic/tk3d.c:1371: error: request for member 'borderTable' in something not a structure or union
/opt/local/var/macports/build/_opt_local_var_macports_sources_rsync.macports.org_release_ports_x11_tk/work/tk8.5.6/unix/../generic/tk3d.c:1371: error: request for member 'borderTable' in something not a structure or union
/opt/local/var/macports/build/_opt_local_var_macports_sources_rsync.macports.org_release_ports_x11_tk/work/tk8.5.6/unix/../generic/tk3d.c:1373: error: syntax error before ')' token
make: *** [tk3d.o] Error 1

Error: Status 1 encountered during processing.

Change History

comment:1 Changed 5 years ago by rictic@…

  • Cc rictic@… added

Cc Me!

comment:2 Changed 5 years ago by toby@…

  • Cc rictic@… removed
  • Version 1.7.1 deleted

What OS release? What Xcode version? Also, please provide debug log:

sudo port clean tk
sudo port -d install tk

comment:3 Changed 5 years ago by rictic@…

Thanks for getting back so quick, here's the info:

OS 10.5.7 XCode 3.1.2

loki:~ peter$ sudo port clean tk
--->  Cleaning tk
loki:~ peter$ sudo port -d install tk
DEBUG: Found port in file:///opt/local/var/macports/sources/rsync.macports.org/release/ports/x11/tk
DEBUG: Changing to port directory: /opt/local/var/macports/sources/rsync.macports.org/release/ports/x11/tk
DEBUG: setting option os.universal_supported to yes
DEBUG: org.macports.load registered provides 'load', a pre-existing procedure. Target override will not be provided
DEBUG: org.macports.distfiles registered provides 'distfiles', a pre-existing procedure. Target override will not be provided
DEBUG: adding the default universal variant
DEBUG: Requested variant i386 is not provided by port tk.
DEBUG: Requested variant macosx is not provided by port tk.
DEBUG: Executing variant darwin provides darwin
DEBUG: Found port in file:///opt/local/var/macports/sources/rsync.macports.org/release/ports/lang/tcl
DEBUG: Changing to port directory: /opt/local/var/macports/sources/rsync.macports.org/release/ports/lang/tcl
DEBUG: setting option os.universal_supported to yes
DEBUG: org.macports.load registered provides 'load', a pre-existing procedure. Target override will not be provided
DEBUG: org.macports.distfiles registered provides 'distfiles', a pre-existing procedure. Target override will not be provided
DEBUG: adding the default universal variant
DEBUG: Requested variant i386 is not provided by port tcl.
DEBUG: Requested variant macosx is not provided by port tcl.
DEBUG: Executing variant darwin provides darwin
DEBUG: Searching for dependency: tcl
DEBUG: Found Dependency: receipt exists for tcl
DEBUG: Found port in file:///opt/local/var/macports/sources/rsync.macports.org/release/ports/x11/Xft2
DEBUG: Changing to port directory: /opt/local/var/macports/sources/rsync.macports.org/release/ports/x11/Xft2
DEBUG: setting option os.universal_supported to yes
DEBUG: org.macports.load registered provides 'load', a pre-existing procedure. Target override will not be provided
DEBUG: org.macports.distfiles registered provides 'distfiles', a pre-existing procedure. Target override will not be provided
DEBUG: adding the default universal variant
DEBUG: Requested variant darwin is not provided by port Xft2.
DEBUG: Requested variant i386 is not provided by port Xft2.
DEBUG: Requested variant macosx is not provided by port Xft2.
DEBUG: Searching for dependency: Xft2
DEBUG: Found Dependency: receipt exists for Xft2
DEBUG: Found port in file:///opt/local/var/macports/sources/rsync.macports.org/release/ports/x11/xorg-libXScrnSaver
DEBUG: Changing to port directory: /opt/local/var/macports/sources/rsync.macports.org/release/ports/x11/xorg-libXScrnSaver
DEBUG: setting option os.universal_supported to yes
DEBUG: org.macports.load registered provides 'load', a pre-existing procedure. Target override will not be provided
DEBUG: org.macports.distfiles registered provides 'distfiles', a pre-existing procedure. Target override will not be provided
DEBUG: adding the default universal variant
DEBUG: Requested variant darwin is not provided by port xorg-libXScrnSaver.
DEBUG: Requested variant i386 is not provided by port xorg-libXScrnSaver.
DEBUG: Requested variant macosx is not provided by port xorg-libXScrnSaver.
DEBUG: Searching for dependency: xorg-libXScrnSaver
DEBUG: Found Dependency: receipt exists for xorg-libXScrnSaver
DEBUG: Executing org.macports.main (tk)
--->  Fetching tk
DEBUG: Executing org.macports.fetch (tk)
--->  Verifying checksum(s) for tk
DEBUG: Executing org.macports.checksum (tk)
--->  Checksumming tk8.5.6-src.tar.gz
DEBUG: Correct (md5) checksum for tk8.5.6-src.tar.gz
DEBUG: Correct (sha1) checksum for tk8.5.6-src.tar.gz
DEBUG: Correct (rmd160) checksum for tk8.5.6-src.tar.gz
--->  Checksumming tcl8.5.6-src.tar.gz
DEBUG: Correct (md5) checksum for tcl8.5.6-src.tar.gz
DEBUG: Correct (sha1) checksum for tcl8.5.6-src.tar.gz
DEBUG: Correct (rmd160) checksum for tcl8.5.6-src.tar.gz
--->  Extracting tk
DEBUG: Executing org.macports.extract (tk)
--->  Extracting tk8.5.6-src.tar.gz
DEBUG: setting option extract.args to /opt/local/var/macports/distfiles/tcltk/tk8.5.6-src.tar.gz
DEBUG: Environment: MACOSX_DEPLOYMENT_TARGET='10.5'
DEBUG: Assembled command: 'cd "/opt/local/var/macports/build/_opt_local_var_macports_sources_rsync.macports.org_release_ports_x11_tk/work" && gzip -dc /opt/local/var/macports/distfiles/tcltk/tk8.5.6-src.tar.gz | /usr/bin/gnutar --no-same-owner -xf -'
--->  Extracting tcl8.5.6-src.tar.gz
DEBUG: setting option extract.args to /opt/local/var/macports/distfiles/tcltk/tcl8.5.6-src.tar.gz
DEBUG: Environment: MACOSX_DEPLOYMENT_TARGET='10.5'
DEBUG: Assembled command: 'cd "/opt/local/var/macports/build/_opt_local_var_macports_sources_rsync.macports.org_release_ports_x11_tk/work" && gzip -dc /opt/local/var/macports/distfiles/tcltk/tcl8.5.6-src.tar.gz | /usr/bin/gnutar --no-same-owner -xf -'
DEBUG: Executing org.macports.patch (tk)
DEBUG: Executing proc-post-org.macports.patch-patch-0
--->  Configuring tk
DEBUG: Using compiler 'Mac OS X gcc 4.0'
DEBUG: Executing org.macports.configure (tk)
DEBUG: Environment: CFLAGS='-O2' CPPFLAGS='-I/opt/local/var/macports/build/_opt_local_var_macports_sources_rsync.macports.org_release_ports_x11_tk/work/tcl8.5.6/generic' CXXFLAGS='-O2' MACOSX_DEPLOYMENT_TARGET='10.5' CPP='/usr/bin/cpp-4.0' CXX='/usr/bin/g++-4.0' F90FLAGS='-O2' LDFLAGS='-L/opt/local/lib' FCFLAGS='-O2' OBJC='/usr/bin/gcc-4.0' INSTALL='/usr/bin/install -c' OBJCFLAGS='-O2' FFLAGS='-O2' CC='/usr/bin/gcc-4.0'
DEBUG: Assembled command: 'cd "/opt/local/var/macports/build/_opt_local_var_macports_sources_rsync.macports.org_release_ports_x11_tk/work/tk8.5.6/unix" && ./configure --prefix=/opt/local --mandir=/opt/local/share/man --with-tcl=/opt/local/lib tcl_cv_type_64bit="long long"'
checking for Tcl configuration... found /opt/local/lib/tclConfig.sh
checking for existence of /opt/local/lib/tclConfig.sh... loading
checking for tclsh... /opt/local/bin/tclsh8.5
checking for tclsh in Tcl build directory... /opt/local/lib/tclsh
checking whether to use symlinks for manpages... no
checking whether to compress the manpages... no
checking whether to add a package name suffix for the manpages... no
checking for gcc... /usr/bin/gcc-4.0
checking for C compiler default output file name... a.out
checking whether the C compiler works... yes
checking whether we are cross compiling... no
checking for suffix of executables... 
checking for suffix of object files... o
checking whether we are using the GNU C compiler... yes
checking whether /usr/bin/gcc-4.0 accepts -g... yes
checking for /usr/bin/gcc-4.0 option to accept ANSI C... none needed
checking how to run the C preprocessor... /usr/bin/cpp-4.0
checking for egrep... grep -E
checking for ANSI C header files... yes
checking for sys/types.h... yes
checking for sys/stat.h... yes
checking for stdlib.h... yes
checking for string.h... yes
checking for memory.h... yes
checking for strings.h... yes
checking for inttypes.h... yes
checking for stdint.h... yes
checking for unistd.h... yes
checking limits.h usability... yes
checking limits.h presence... yes
checking for limits.h... yes
checking for stdlib.h... (cached) yes
checking if the compiler understands -pipe... yes
checking for building with threads... no (default)
checking how to build libraries... shared
checking for ranlib... ranlib
checking if 64bit support is requested... no
checking if 64bit Sparc VIS support is requested... no
checking if compiler supports visibility "hidden"... yes
checking if rpath support is requested... yes
checking system version... Darwin-9.7.1
checking for dlopen in -ldl... yes
checking for ar... ar
checking if ld accepts -single_module flag... yes
checking if ld accepts -search_paths_first flag... yes
checking whether to use CoreFoundation... yes
checking for CoreFoundation.framework... yes
checking for build with symbols... no
checking for required early compiler flags... none
checking for 64-bit integer type... (cached) long long
checking for struct dirent64... no
checking for struct stat64... yes
checking for open64... no
checking for lseek64... no
checking for off64_t... no
checking whether byte ordering is bigendian... no
checking for fd_set in sys/types... yes
checking sys/time.h usability... yes
checking sys/time.h presence... yes
checking for sys/time.h... yes
checking whether time.h and sys/time.h may both be included... yes
checking for strtod... yes
checking for Solaris2.4/Tru64 strtod bugs... ok
checking for mode_t... yes
checking for pid_t... yes
checking for size_t... yes
checking for uid_t in sys/types.h... yes
checking for intptr_t... yes
checking for uintptr_t... yes
checking pw_gecos in struct pwd... yes
checking whether to use Aqua... no
checking if ld accepts -weak-l flag... yes
checking for X... no
checking for X11 header files... checking for X11 libraries... checking for XCreateWindow in -lXwindow... no
could not find any!  Using -lX11.
checking for main in -lXbsd... no
checking for X11/extensions/scrnsaver.h... no
checking for XScreenSaverQueryInfo... no
checking for XScreenSaverQueryInfo in -lXext... no
checking for XScreenSaverQueryInfo in -lXss... yes
checking whether to use xft... yes
checking for X11/Xft/Xft.h... yes
checking for FT_New_Face in -lXft... yes
checking whether char is unsigned... no
checking how to package libraries... shared library
configure: creating ./config.status
config.status: creating Tk-Info.plist
config.status: creating Wish-Info.plist
config.status: creating Makefile
config.status: creating tkConfig.sh
--->  Building tk
DEBUG: Executing org.macports.build (tk)
DEBUG: Environment: MACOSX_DEPLOYMENT_TARGET='10.5'
DEBUG: Assembled command: 'cd "/opt/local/var/macports/build/_opt_local_var_macports_sources_rsync.macports.org_release_ports_x11_tk/work/tk8.5.6/unix" && make all'
/usr/bin/gcc-4.0 -c -Os -O2 -pipe  -I/opt/local/var/macports/build/_opt_local_var_macports_sources_rsync.macports.org_release_ports_x11_tk/work/tcl8.5.6/generic  -Wall -Wno-implicit-int -fno-common -I/opt/local/var/macports/build/_opt_local_var_macports_sources_rsync.macports.org_release_ports_x11_tk/work/tk8.5.6/unix/../unix -I/opt/local/var/macports/build/_opt_local_var_macports_sources_rsync.macports.org_release_ports_x11_tk/work/tk8.5.6/unix/../generic -I/opt/local/var/macports/build/_opt_local_var_macports_sources_rsync.macports.org_release_ports_x11_tk/work/tk8.5.6/unix/../bitmaps -I/opt/local/var/macports/build/_opt_local_var_macports_sources_rsync.macports.org_release_ports_x11_tk/work/tk8.5.6/unix/../../tcl8.5.6//generic -I/opt/local/var/macports/build/_opt_local_var_macports_sources_rsync.macports.org_release_ports_x11_tk/work/tk8.5.6/unix/../../tcl8.5.6//unix  -DPACKAGE_NAME=\"tk\" -DPACKAGE_TARNAME=\"tk\" -DPACKAGE_VERSION=\"8.5\" -DPACKAGE_STRING=\"tk\ 8.5\" -DPACKAGE_BUGREPORT=\"\" -DSTDC_HEADERS=1 -DHAVE_SYS_TYPES_H=1 -DHAVE_SYS_STAT_H=1 -DHAVE_STDLIB_H=1 -DHAVE_STRING_H=1 -DHAVE_MEMORY_H=1 -DHAVE_STRINGS_H=1 -DHAVE_INTTYPES_H=1 -DHAVE_STDINT_H=1 -DHAVE_UNISTD_H=1 -DHAVE_LIMITS_H=1 -DMODULE_SCOPE=extern\ __attribute__\(\(__visibility__\(\"hidden\"\)\)\) -DMAC_OSX_TCL=1 -DHAVE_COREFOUNDATION=1 -DTCL_SHLIB_EXT=\".dylib\" -DTCL_CFG_OPTIMIZED=1 -DTCL_CFG_DEBUG=1 -DTCL_WIDE_INT_TYPE=long\ long -DHAVE_STRUCT_STAT64=1 -DHAVE_SYS_TIME_H=1 -DTIME_WITH_SYS_TIME=1 -DHAVE_INTPTR_T=1 -DHAVE_UINTPTR_T=1 -DHAVE_PW_GECOS=1 -DHAVE_LIBXFT=1 -DHAVE_XFT=1      -DTCL_NO_DEPRECATED  -DUSE_TCL_STUBS  /opt/local/var/macports/build/_opt_local_var_macports_sources_rsync.macports.org_release_ports_x11_tk/work/tk8.5.6/unix/../generic/tk3d.c
In file included from /opt/local/var/macports/build/_opt_local_var_macports_sources_rsync.macports.org_release_ports_x11_tk/work/tk8.5.6/unix/../generic/tkInt.h:21,
                 from /opt/local/var/macports/build/_opt_local_var_macports_sources_rsync.macports.org_release_ports_x11_tk/work/tk8.5.6/unix/../generic/tk3d.c:16:
/opt/local/var/macports/build/_opt_local_var_macports_sources_rsync.macports.org_release_ports_x11_tk/work/tk8.5.6/unix/../generic/tk.h:78:23: error: X11/Xlib.h: No such file or directory
In file included from /opt/local/var/macports/build/_opt_local_var_macports_sources_rsync.macports.org_release_ports_x11_tk/work/tk8.5.6/unix/../generic/tkInt.h:21,
                 from /opt/local/var/macports/build/_opt_local_var_macports_sources_rsync.macports.org_release_ports_x11_tk/work/tk8.5.6/unix/../generic/tk3d.c:16:
/opt/local/var/macports/build/_opt_local_var_macports_sources_rsync.macports.org_release_ports_x11_tk/work/tk8.5.6/unix/../generic/tk.h:549: error: syntax error before 'Window'
/opt/local/var/macports/build/_opt_local_var_macports_sources_rsync.macports.org_release_ports_x11_tk/work/tk8.5.6/unix/../generic/tk.h:549: error: 'Window' declared as function returning a function
/opt/local/var/macports/build/_opt_local_var_macports_sources_rsync.macports.org_release_ports_x11_tk/work/tk8.5.6/unix/../generic/tk.h:549: warning: parameter names (without types) in function declaration
/opt/local/var/macports/build/_opt_local_var_macports_sources_rsync.macports.org_release_ports_x11_tk/work/tk8.5.6/unix/../generic/tk.h:552: error: syntax error before 'XEvent'
/opt/local/var/macports/build/_opt_local_var_macports_sources_rsync.macports.org_release_ports_x11_tk/work/tk8.5.6/unix/../generic/tk.h:561: error: syntax error before 'Tk_ClassCreateProc'
/opt/local/var/macports/build/_opt_local_var_macports_sources_rsync.macports.org_release_ports_x11_tk/work/tk8.5.6/unix/../generic/tk.h:561: warning: no semicolon at end of struct or union
/opt/local/var/macports/build/_opt_local_var_macports_sources_rsync.macports.org_release_ports_x11_tk/work/tk8.5.6/unix/../generic/tk.h:568: error: syntax error before '}' token
/opt/local/var/macports/build/_opt_local_var_macports_sources_rsync.macports.org_release_ports_x11_tk/work/tk8.5.6/unix/../generic/tk.h:568: warning: data definition has no type or storage class
/opt/local/var/macports/build/_opt_local_var_macports_sources_rsync.macports.org_release_ports_x11_tk/work/tk8.5.6/unix/../generic/tk.h:655: error: syntax error before 'Bool'
/opt/local/var/macports/build/_opt_local_var_macports_sources_rsync.macports.org_release_ports_x11_tk/work/tk8.5.6/unix/../generic/tk.h:655: warning: no semicolon at end of struct or union
/opt/local/var/macports/build/_opt_local_var_macports_sources_rsync.macports.org_release_ports_x11_tk/work/tk8.5.6/unix/../generic/tk.h:657: warning: data definition has no type or storage class
/opt/local/var/macports/build/_opt_local_var_macports_sources_rsync.macports.org_release_ports_x11_tk/work/tk8.5.6/unix/../generic/tk.h:661: error: syntax error before 'time'
/opt/local/var/macports/build/_opt_local_var_macports_sources_rsync.macports.org_release_ports_x11_tk/work/tk8.5.6/unix/../generic/tk.h:661: warning: data definition has no type or storage class
/opt/local/var/macports/build/_opt_local_var_macports_sources_rsync.macports.org_release_ports_x11_tk/work/tk8.5.6/unix/../generic/tk.h:667: error: syntax error before 'same_screen'
/opt/local/var/macports/build/_opt_local_var_macports_sources_rsync.macports.org_release_ports_x11_tk/work/tk8.5.6/unix/../generic/tk.h:667: warning: data definition has no type or storage class
/opt/local/var/macports/build/_opt_local_var_macports_sources_rsync.macports.org_release_ports_x11_tk/work/tk8.5.6/unix/../generic/tk.h:672: error: syntax error before '}' token
/opt/local/var/macports/build/_opt_local_var_macports_sources_rsync.macports.org_release_ports_x11_tk/work/tk8.5.6/unix/../generic/tk.h:672: warning: data definition has no type or storage class
/opt/local/var/macports/build/_opt_local_var_macports_sources_rsync.macports.org_release_ports_x11_tk/work/tk8.5.6/unix/../generic/tk.h:677: error: syntax error before 'Bool'
/opt/local/var/macports/build/_opt_local_var_macports_sources_rsync.macports.org_release_ports_x11_tk/work/tk8.5.6/unix/../generic/tk.h:677: warning: no semicolon at end of struct or union
/opt/local/var/macports/build/_opt_local_var_macports_sources_rsync.macports.org_release_ports_x11_tk/work/tk8.5.6/unix/../generic/tk.h:679: warning: data definition has no type or storage class
/opt/local/var/macports/build/_opt_local_var_macports_sources_rsync.macports.org_release_ports_x11_tk/work/tk8.5.6/unix/../generic/tk.h:681: error: syntax error before '}' token
/opt/local/var/macports/build/_opt_local_var_macports_sources_rsync.macports.org_release_ports_x11_tk/work/tk8.5.6/unix/../generic/tk.h:681: warning: data definition has no type or storage class
/opt/local/var/macports/build/_opt_local_var_macports_sources_rsync.macports.org_release_ports_x11_tk/work/tk8.5.6/unix/../generic/tk.h:682: error: syntax error before 'XActivateEvent'
/opt/local/var/macports/build/_opt_local_var_macports_sources_rsync.macports.org_release_ports_x11_tk/work/tk8.5.6/unix/../generic/tk.h:682: warning: data definition has no type or storage class
/opt/local/var/macports/build/_opt_local_var_macports_sources_rsync.macports.org_release_ports_x11_tk/work/tk8.5.6/unix/../generic/tk.h:683: error: syntax error before 'XDeactivateEvent'
/opt/local/var/macports/build/_opt_local_var_macports_sources_rsync.macports.org_release_ports_x11_tk/work/tk8.5.6/unix/../generic/tk.h:683: warning: data definition has no type or storage class
/opt/local/var/macports/build/_opt_local_var_macports_sources_rsync.macports.org_release_ports_x11_tk/work/tk8.5.6/unix/../generic/tk.h:756: error: syntax error before 'Display'
/opt/local/var/macports/build/_opt_local_var_macports_sources_rsync.macports.org_release_ports_x11_tk/work/tk8.5.6/unix/../generic/tk.h:756: warning: no semicolon at end of struct or union
/opt/local/var/macports/build/_opt_local_var_macports_sources_rsync.macports.org_release_ports_x11_tk/work/tk8.5.6/unix/../generic/tk.h:759: error: syntax error before '*' token
/opt/local/var/macports/build/_opt_local_var_macports_sources_rsync.macports.org_release_ports_x11_tk/work/tk8.5.6/unix/../generic/tk.h:759: warning: data definition has no type or storage class
/opt/local/var/macports/build/_opt_local_var_macports_sources_rsync.macports.org_release_ports_x11_tk/work/tk8.5.6/unix/../generic/tk.h:770: error: syntax error before 'changes'
/opt/local/var/macports/build/_opt_local_var_macports_sources_rsync.macports.org_release_ports_x11_tk/work/tk8.5.6/unix/../generic/tk.h:770: warning: data definition has no type or storage class
/opt/local/var/macports/build/_opt_local_var_macports_sources_rsync.macports.org_release_ports_x11_tk/work/tk8.5.6/unix/../generic/tk.h:772: error: syntax error before 'atts'
/opt/local/var/macports/build/_opt_local_var_macports_sources_rsync.macports.org_release_ports_x11_tk/work/tk8.5.6/unix/../generic/tk.h:772: warning: data definition has no type or storage class
/opt/local/var/macports/build/_opt_local_var_macports_sources_rsync.macports.org_release_ports_x11_tk/work/tk8.5.6/unix/../generic/tk.h:796: error: syntax error before '}' token
/opt/local/var/macports/build/_opt_local_var_macports_sources_rsync.macports.org_release_ports_x11_tk/work/tk8.5.6/unix/../generic/tk.h:796: warning: data definition has no type or storage class
/opt/local/var/macports/build/_opt_local_var_macports_sources_rsync.macports.org_release_ports_x11_tk/work/tk8.5.6/unix/../generic/tk.h:902: error: syntax error before 'XPoint'
/opt/local/var/macports/build/_opt_local_var_macports_sources_rsync.macports.org_release_ports_x11_tk/work/tk8.5.6/unix/../generic/tk.h:996: error: syntax error before 'Display'
/opt/local/var/macports/build/_opt_local_var_macports_sources_rsync.macports.org_release_ports_x11_tk/work/tk8.5.6/unix/../generic/tk.h:998: error: syntax error before 'Display'
/opt/local/var/macports/build/_opt_local_var_macports_sources_rsync.macports.org_release_ports_x11_tk/work/tk8.5.6/unix/../generic/tk.h:1099: error: syntax error before 'XColor'
/opt/local/var/macports/build/_opt_local_var_macports_sources_rsync.macports.org_release_ports_x11_tk/work/tk8.5.6/unix/../generic/tk.h:1099: warning: no semicolon at end of struct or union
/opt/local/var/macports/build/_opt_local_var_macports_sources_rsync.macports.org_release_ports_x11_tk/work/tk8.5.6/unix/../generic/tk.h:1128: error: syntax error before '}' token
/opt/local/var/macports/build/_opt_local_var_macports_sources_rsync.macports.org_release_ports_x11_tk/work/tk8.5.6/unix/../generic/tk.h:1128: warning: data definition has no type or storage class
/opt/local/var/macports/build/_opt_local_var_macports_sources_rsync.macports.org_release_ports_x11_tk/work/tk8.5.6/unix/../generic/tk.h:1162: error: syntax error before 'GC'
/opt/local/var/macports/build/_opt_local_var_macports_sources_rsync.macports.org_release_ports_x11_tk/work/tk8.5.6/unix/../generic/tk.h:1162: warning: no semicolon at end of struct or union
/opt/local/var/macports/build/_opt_local_var_macports_sources_rsync.macports.org_release_ports_x11_tk/work/tk8.5.6/unix/../generic/tk.h:1174: error: syntax error before '*' token
/opt/local/var/macports/build/_opt_local_var_macports_sources_rsync.macports.org_release_ports_x11_tk/work/tk8.5.6/unix/../generic/tk.h:1174: warning: data definition has no type or storage class
/opt/local/var/macports/build/_opt_local_var_macports_sources_rsync.macports.org_release_ports_x11_tk/work/tk8.5.6/unix/../generic/tk.h:1175: error: syntax error before '*' token
/opt/local/var/macports/build/_opt_local_var_macports_sources_rsync.macports.org_release_ports_x11_tk/work/tk8.5.6/unix/../generic/tk.h:1175: warning: data definition has no type or storage class
/opt/local/var/macports/build/_opt_local_var_macports_sources_rsync.macports.org_release_ports_x11_tk/work/tk8.5.6/unix/../generic/tk.h:1176: error: syntax error before '*' token
/opt/local/var/macports/build/_opt_local_var_macports_sources_rsync.macports.org_release_ports_x11_tk/work/tk8.5.6/unix/../generic/tk.h:1176: warning: data definition has no type or storage class
/opt/local/var/macports/build/_opt_local_var_macports_sources_rsync.macports.org_release_ports_x11_tk/work/tk8.5.6/unix/../generic/tk.h:1177: error: syntax error before 'stipple'
/opt/local/var/macports/build/_opt_local_var_macports_sources_rsync.macports.org_release_ports_x11_tk/work/tk8.5.6/unix/../generic/tk.h:1177: warning: data definition has no type or storage class
/opt/local/var/macports/build/_opt_local_var_macports_sources_rsync.macports.org_release_ports_x11_tk/work/tk8.5.6/unix/../generic/tk.h:1178: error: syntax error before 'activeStipple'
/opt/local/var/macports/build/_opt_local_var_macports_sources_rsync.macports.org_release_ports_x11_tk/work/tk8.5.6/unix/../generic/tk.h:1178: warning: data definition has no type or storage class
/opt/local/var/macports/build/_opt_local_var_macports_sources_rsync.macports.org_release_ports_x11_tk/work/tk8.5.6/unix/../generic/tk.h:1180: error: syntax error before 'disabledStipple'
/opt/local/var/macports/build/_opt_local_var_macports_sources_rsync.macports.org_release_ports_x11_tk/work/tk8.5.6/unix/../generic/tk.h:1180: warning: data definition has no type or storage class
/opt/local/var/macports/build/_opt_local_var_macports_sources_rsync.macports.org_release_ports_x11_tk/work/tk8.5.6/unix/../generic/tk.h:1182: warning: data definition has no type or storage class
/opt/local/var/macports/build/_opt_local_var_macports_sources_rsync.macports.org_release_ports_x11_tk/work/tk8.5.6/unix/../generic/tk.h:1204: error: syntax error before 'Display'
/opt/local/var/macports/build/_opt_local_var_macports_sources_rsync.macports.org_release_ports_x11_tk/work/tk8.5.6/unix/../generic/tk.h:1207: error: syntax error before 'Display'
/opt/local/var/macports/build/_opt_local_var_macports_sources_rsync.macports.org_release_ports_x11_tk/work/tk8.5.6/unix/../generic/tk.h:1403: error: syntax error before 'Drawable'
/opt/local/var/macports/build/_opt_local_var_macports_sources_rsync.macports.org_release_ports_x11_tk/work/tk8.5.6/unix/../generic/tk.h:1513: error: syntax error before 'XErrorEvent'
/opt/local/var/macports/build/_opt_local_var_macports_sources_rsync.macports.org_release_ports_x11_tk/work/tk8.5.6/unix/../generic/tk.h:1515: error: syntax error before 'XEvent'
/opt/local/var/macports/build/_opt_local_var_macports_sources_rsync.macports.org_release_ports_x11_tk/work/tk8.5.6/unix/../generic/tk.h:1517: error: syntax error before 'XEvent'
/opt/local/var/macports/build/_opt_local_var_macports_sources_rsync.macports.org_release_ports_x11_tk/work/tk8.5.6/unix/../generic/tk.h:1519: error: syntax error before 'XEvent'
/opt/local/var/macports/build/_opt_local_var_macports_sources_rsync.macports.org_release_ports_x11_tk/work/tk8.5.6/unix/../generic/tk.h:1524: error: syntax error before 'XEvent'
In file included from /opt/local/var/macports/build/_opt_local_var_macports_sources_rsync.macports.org_release_ports_x11_tk/work/tk8.5.6/unix/../generic/tk.h:1537,
                 from /opt/local/var/macports/build/_opt_local_var_macports_sources_rsync.macports.org_release_ports_x11_tk/work/tk8.5.6/unix/../generic/tkInt.h:21,
                 from /opt/local/var/macports/build/_opt_local_var_macports_sources_rsync.macports.org_release_ports_x11_tk/work/tk8.5.6/unix/../generic/tk3d.c:16:
/opt/local/var/macports/build/_opt_local_var_macports_sources_rsync.macports.org_release_ports_x11_tk/work/tk8.5.6/unix/../generic/tkDecls.h:42: error: syntax error before '*' token
/opt/local/var/macports/build/_opt_local_var_macports_sources_rsync.macports.org_release_ports_x11_tk/work/tk8.5.6/unix/../generic/tkDecls.h:42: warning: data definition has no type or storage class
/opt/local/var/macports/build/_opt_local_var_macports_sources_rsync.macports.org_release_ports_x11_tk/work/tk8.5.6/unix/../generic/tkDecls.h:47: error: syntax error before 'Tk_3DBorderGC'
/opt/local/var/macports/build/_opt_local_var_macports_sources_rsync.macports.org_release_ports_x11_tk/work/tk8.5.6/unix/../generic/tkDecls.h:48: warning: data definition has no type or storage class
/opt/local/var/macports/build/_opt_local_var_macports_sources_rsync.macports.org_release_ports_x11_tk/work/tk8.5.6/unix/../generic/tkDecls.h:54: error: syntax error before 'Drawable'
/opt/local/var/macports/build/_opt_local_var_macports_sources_rsync.macports.org_release_ports_x11_tk/work/tk8.5.6/unix/../generic/tkDecls.h:62: error: syntax error before 'Drawable'
/opt/local/var/macports/build/_opt_local_var_macports_sources_rsync.macports.org_release_ports_x11_tk/work/tk8.5.6/unix/../generic/tkDecls.h:76: error: syntax error before 'XEvent'
/opt/local/var/macports/build/_opt_local_var_macports_sources_rsync.macports.org_release_ports_x11_tk/work/tk8.5.6/unix/../generic/tkDecls.h:102: error: syntax error before '*' token
/opt/local/var/macports/build/_opt_local_var_macports_sources_rsync.macports.org_release_ports_x11_tk/work/tk8.5.6/unix/../generic/tkDecls.h:102: warning: data definition has no type or storage class
/opt/local/var/macports/build/_opt_local_var_macports_sources_rsync.macports.org_release_ports_x11_tk/work/tk8.5.6/unix/../generic/tkDecls.h:108: error: syntax error before 'Pixmap'
/opt/local/var/macports/build/_opt_local_var_macports_sources_rsync.macports.org_release_ports_x11_tk/work/tk8.5.6/unix/../generic/tkDecls.h:115: error: syntax error before 'XColor'
/opt/local/var/macports/build/_opt_local_var_macports_sources_rsync.macports.org_release_ports_x11_tk/work/tk8.5.6/unix/../generic/tkDecls.h:134: error: syntax error before 'Pixmap'
/opt/local/var/macports/build/_opt_local_var_macports_sources_rsync.macports.org_release_ports_x11_tk/work/tk8.5.6/unix/../generic/tkDecls.h:144: error: syntax error before 'GC'
/opt/local/var/macports/build/_opt_local_var_macports_sources_rsync.macports.org_release_ports_x11_tk/work/tk8.5.6/unix/../generic/tkDecls.h:178: error: syntax error before 'XSetWindowAttributes'
/opt/local/var/macports/build/_opt_local_var_macports_sources_rsync.macports.org_release_ports_x11_tk/work/tk8.5.6/unix/../generic/tkDecls.h:190: error: syntax error before 'Atom'
/opt/local/var/macports/build/_opt_local_var_macports_sources_rsync.macports.org_release_ports_x11_tk/work/tk8.5.6/unix/../generic/tkDecls.h:196: error: syntax error before 'Atom'
/opt/local/var/macports/build/_opt_local_var_macports_sources_rsync.macports.org_release_ports_x11_tk/work/tk8.5.6/unix/../generic/tkDecls.h:234: error: syntax error before 'XWindowChanges'
/opt/local/var/macports/build/_opt_local_var_macports_sources_rsync.macports.org_release_ports_x11_tk/work/tk8.5.6/unix/../generic/tkDecls.h:266: error: syntax error before '*' token
/opt/local/var/macports/build/_opt_local_var_macports_sources_rsync.macports.org_release_ports_x11_tk/work/tk8.5.6/unix/../generic/tkDecls.h:303: error: syntax error before 'Atom'
/opt/local/var/macports/build/_opt_local_var_macports_sources_rsync.macports.org_release_ports_x11_tk/work/tk8.5.6/unix/../generic/tkDecls.h:378: error: syntax error before 'Atom'
/opt/local/var/macports/build/_opt_local_var_macports_sources_rsync.macports.org_release_ports_x11_tk/work/tk8.5.6/unix/../generic/tkDecls.h:400: error: syntax error before 'Drawable'
/opt/local/var/macports/build/_opt_local_var_macports_sources_rsync.macports.org_release_ports_x11_tk/work/tk8.5.6/unix/../generic/tkDecls.h:409: error: syntax error before 'Drawable'
/opt/local/var/macports/build/_opt_local_var_macports_sources_rsync.macports.org_release_ports_x11_tk/work/tk8.5.6/unix/../generic/tkDecls.h:416: error: syntax error before '*' token
/opt/local/var/macports/build/_opt_local_var_macports_sources_rsync.macports.org_release_ports_x11_tk/work/tk8.5.6/unix/../generic/tkDecls.h:423: error: syntax error before 'GC'
/opt/local/var/macports/build/_opt_local_var_macports_sources_rsync.macports.org_release_ports_x11_tk/work/tk8.5.6/unix/../generic/tkDecls.h:429: error: syntax error before '*' token
/opt/local/var/macports/build/_opt_local_var_macports_sources_rsync.macports.org_release_ports_x11_tk/work/tk8.5.6/unix/../generic/tkDecls.h:437: error: syntax error before 'Drawable'
/opt/local/var/macports/build/_opt_local_var_macports_sources_rsync.macports.org_release_ports_x11_tk/work/tk8.5.6/unix/../generic/tkDecls.h:446: error: syntax error before 'Drawable'
/opt/local/var/macports/build/_opt_local_var_macports_sources_rsync.macports.org_release_ports_x11_tk/work/tk8.5.6/unix/../generic/tkDecls.h:459: error: syntax error before 'Tk_FontId'
/opt/local/var/macports/build/_opt_local_var_macports_sources_rsync.macports.org_release_ports_x11_tk/work/tk8.5.6/unix/../generic/tkDecls.h:459: warning: data definition has no type or storage class
/opt/local/var/macports/build/_opt_local_var_macports_sources_rsync.macports.org_release_ports_x11_tk/work/tk8.5.6/unix/../generic/tkDecls.h:469: error: syntax error before '*' token
/opt/local/var/macports/build/_opt_local_var_macports_sources_rsync.macports.org_release_ports_x11_tk/work/tk8.5.6/unix/../generic/tkDecls.h:474: error: syntax error before '*' token
/opt/local/var/macports/build/_opt_local_var_macports_sources_rsync.macports.org_release_ports_x11_tk/work/tk8.5.6/unix/../generic/tkDecls.h:479: error: syntax error before '*' token
/opt/local/var/macports/build/_opt_local_var_macports_sources_rsync.macports.org_release_ports_x11_tk/work/tk8.5.6/unix/../generic/tkDecls.h:485: error: syntax error before '*' token
/opt/local/var/macports/build/_opt_local_var_macports_sources_rsync.macports.org_release_ports_x11_tk/work/tk8.5.6/unix/../generic/tkDecls.h:495: error: syntax error before '*' token
/opt/local/var/macports/build/_opt_local_var_macports_sources_rsync.macports.org_release_ports_x11_tk/work/tk8.5.6/unix/../generic/tkDecls.h:506: error: syntax error before 'Display'
/opt/local/var/macports/build/_opt_local_var_macports_sources_rsync.macports.org_release_ports_x11_tk/work/tk8.5.6/unix/../generic/tkDecls.h:512: error: syntax error before '*' token
/opt/local/var/macports/build/_opt_local_var_macports_sources_rsync.macports.org_release_ports_x11_tk/work/tk8.5.6/unix/../generic/tkDecls.h:522: error: syntax error before '*' token
/opt/local/var/macports/build/_opt_local_var_macports_sources_rsync.macports.org_release_ports_x11_tk/work/tk8.5.6/unix/../generic/tkDecls.h:527: error: syntax error before 'Tk_GCForColor'
/opt/local/var/macports/build/_opt_local_var_macports_sources_rsync.macports.org_release_ports_x11_tk/work/tk8.5.6/unix/../generic/tkDecls.h:527: error: syntax error before '*' token
/opt/local/var/macports/build/_opt_local_var_macports_sources_rsync.macports.org_release_ports_x11_tk/work/tk8.5.6/unix/../generic/tkDecls.h:527: warning: data definition has no type or storage class
/opt/local/var/macports/build/_opt_local_var_macports_sources_rsync.macports.org_release_ports_x11_tk/work/tk8.5.6/unix/../generic/tkDecls.h:557: error: syntax error before 'Atom'
/opt/local/var/macports/build/_opt_local_var_macports_sources_rsync.macports.org_release_ports_x11_tk/work/tk8.5.6/unix/../generic/tkDecls.h:569: error: syntax error before 'Tk_GetBitmap'
/opt/local/var/macports/build/_opt_local_var_macports_sources_rsync.macports.org_release_ports_x11_tk/work/tk8.5.6/unix/../generic/tkDecls.h:570: warning: data definition has no type or storage class
/opt/local/var/macports/build/_opt_local_var_macports_sources_rsync.macports.org_release_ports_x11_tk/work/tk8.5.6/unix/../generic/tkDecls.h:575: error: syntax error before 'Tk_GetBitmapFromData'
/opt/local/var/macports/build/_opt_local_var_macports_sources_rsync.macports.org_release_ports_x11_tk/work/tk8.5.6/unix/../generic/tkDecls.h:577: warning: data definition has no type or storage class
/opt/local/var/macports/build/_opt_local_var_macports_sources_rsync.macports.org_release_ports_x11_tk/work/tk8.5.6/unix/../generic/tkDecls.h:588: error: syntax error before '*' token
/opt/local/var/macports/build/_opt_local_var_macports_sources_rsync.macports.org_release_ports_x11_tk/work/tk8.5.6/unix/../generic/tkDecls.h:589: warning: data definition has no type or storage class
/opt/local/var/macports/build/_opt_local_var_macports_sources_rsync.macports.org_release_ports_x11_tk/work/tk8.5.6/unix/../generic/tkDecls.h:594: error: syntax error before '*' token
/opt/local/var/macports/build/_opt_local_var_macports_sources_rsync.macports.org_release_ports_x11_tk/work/tk8.5.6/unix/../generic/tkDecls.h:595: error: syntax error before 'XColor'
/opt/local/var/macports/build/_opt_local_var_macports_sources_rsync.macports.org_release_ports_x11_tk/work/tk8.5.6/unix/../generic/tkDecls.h:595: warning: data definition has no type or storage class
/opt/local/var/macports/build/_opt_local_var_macports_sources_rsync.macports.org_release_ports_x11_tk/work/tk8.5.6/unix/../generic/tkDecls.h:600: error: syntax error before 'Tk_GetColormap'
/opt/local/var/macports/build/_opt_local_var_macports_sources_rsync.macports.org_release_ports_x11_tk/work/tk8.5.6/unix/../generic/tkDecls.h:601: warning: data definition has no type or storage class
/opt/local/var/macports/build/_opt_local_var_macports_sources_rsync.macports.org_release_ports_x11_tk/work/tk8.5.6/unix/../generic/tkDecls.h:637: error: syntax error before 'Tk_GetGC'
/opt/local/var/macports/build/_opt_local_var_macports_sources_rsync.macports.org_release_ports_x11_tk/work/tk8.5.6/unix/../generic/tkDecls.h:638: error: syntax error before 'XGCValues'
/opt/local/var/macports/build/_opt_local_var_macports_sources_rsync.macports.org_release_ports_x11_tk/work/tk8.5.6/unix/../generic/tkDecls.h:638: warning: data definition has no type or storage class
/opt/local/var/macports/build/_opt_local_var_macports_sources_rsync.macports.org_release_ports_x11_tk/work/tk8.5.6/unix/../generic/tkDecls.h:692: error: syntax error before 'Tk_GetPixmap'
/opt/local/var/macports/build/_opt_local_var_macports_sources_rsync.macports.org_release_ports_x11_tk/work/tk8.5.6/unix/../generic/tkDecls.h:692: error: syntax error before '*' token
/opt/local/var/macports/build/_opt_local_var_macports_sources_rsync.macports.org_release_ports_x11_tk/work/tk8.5.6/unix/../generic/tkDecls.h:693: warning: data definition has no type or storage class
/opt/local/var/macports/build/_opt_local_var_macports_sources_rsync.macports.org_release_ports_x11_tk/work/tk8.5.6/unix/../generic/tkDecls.h:724: error: syntax error before 'Atom'
/opt/local/var/macports/build/_opt_local_var_macports_sources_rsync.macports.org_release_ports_x11_tk/work/tk8.5.6/unix/../generic/tkDecls.h:735: error: syntax error before '*' token
/opt/local/var/macports/build/_opt_local_var_macports_sources_rsync.macports.org_release_ports_x11_tk/work/tk8.5.6/unix/../generic/tkDecls.h:737: error: syntax error before 'Colormap'
/opt/local/var/macports/build/_opt_local_var_macports_sources_rsync.macports.org_release_ports_x11_tk/work/tk8.5.6/unix/../generic/tkDecls.h:737: warning: data definition has no type or storage class
/opt/local/var/macports/build/_opt_local_var_macports_sources_rsync.macports.org_release_ports_x11_tk/work/tk8.5.6/unix/../generic/tkDecls.h:754: error: syntax error before '*' token
/opt/local/var/macports/build/_opt_local_var_macports_sources_rsync.macports.org_release_ports_x11_tk/work/tk8.5.6/unix/../generic/tkDecls.h:759: error: syntax error before '*' token
/opt/local/var/macports/build/_opt_local_var_macports_sources_rsync.macports.org_release_ports_x11_tk/work/tk8.5.6/unix/../generic/tkDecls.h:776: error: syntax error before 'Tk_InternAtom'
/opt/local/var/macports/build/_opt_local_var_macports_sources_rsync.macports.org_release_ports_x11_tk/work/tk8.5.6/unix/../generic/tkDecls.h:776: warning: data definition has no type or storage class
/opt/local/var/macports/build/_opt_local_var_macports_sources_rsync.macports.org_release_ports_x11_tk/work/tk8.5.6/unix/../generic/tkDecls.h:849: error: syntax error before '*' token
/opt/local/var/macports/build/_opt_local_var_macports_sources_rsync.macports.org_release_ports_x11_tk/work/tk8.5.6/unix/../generic/tkDecls.h:860: error: syntax error before '*' token
/opt/local/var/macports/build/_opt_local_var_macports_sources_rsync.macports.org_release_ports_x11_tk/work/tk8.5.6/unix/../generic/tkDecls.h:865: error: syntax error before '*' token
/opt/local/var/macports/build/_opt_local_var_macports_sources_rsync.macports.org_release_ports_x11_tk/work/tk8.5.6/unix/../generic/tkDecls.h:902: error: syntax error before 'Atom'
/opt/local/var/macports/build/_opt_local_var_macports_sources_rsync.macports.org_release_ports_x11_tk/work/tk8.5.6/unix/../generic/tkDecls.h:971: error: syntax error before '*' token
/opt/local/var/macports/build/_opt_local_var_macports_sources_rsync.macports.org_release_ports_x11_tk/work/tk8.5.6/unix/../generic/tkDecls.h:977: error: syntax error before '*' token
/opt/local/var/macports/build/_opt_local_var_macports_sources_rsync.macports.org_release_ports_x11_tk/work/tk8.5.6/unix/../generic/tkDecls.h:985: error: syntax error before 'Drawable'
/opt/local/var/macports/build/_opt_local_var_macports_sources_rsync.macports.org_release_ports_x11_tk/work/tk8.5.6/unix/../generic/tkDecls.h:1048: error: syntax error before 'Pixmap'
/opt/local/var/macports/build/_opt_local_var_macports_sources_rsync.macports.org_release_ports_x11_tk/work/tk8.5.6/unix/../generic/tkDecls.h:1065: error: syntax error before 'Pixmap'
/opt/local/var/macports/build/_opt_local_var_macports_sources_rsync.macports.org_release_ports_x11_tk/work/tk8.5.6/unix/../generic/tkDecls.h:1071: error: syntax error before 'Colormap'
/opt/local/var/macports/build/_opt_local_var_macports_sources_rsync.macports.org_release_ports_x11_tk/work/tk8.5.6/unix/../generic/tkDecls.h:1076: error: syntax error before 'Visual'
/opt/local/var/macports/build/_opt_local_var_macports_sources_rsync.macports.org_release_ports_x11_tk/work/tk8.5.6/unix/../generic/tkDecls.h:1082: error: syntax error before '*' token
/opt/local/var/macports/build/_opt_local_var_macports_sources_rsync.macports.org_release_ports_x11_tk/work/tk8.5.6/unix/../generic/tkDecls.h:1116: error: syntax error before '*' token
/opt/local/var/macports/build/_opt_local_var_macports_sources_rsync.macports.org_release_ports_x11_tk/work/tk8.5.6/unix/../generic/tkDecls.h:1124: error: syntax error before '*' token
/opt/local/var/macports/build/_opt_local_var_macports_sources_rsync.macports.org_release_ports_x11_tk/work/tk8.5.6/unix/../generic/tkDecls.h:1159: error: syntax error before 'Tk_AllocBitmapFromObj'
/opt/local/var/macports/build/_opt_local_var_macports_sources_rsync.macports.org_release_ports_x11_tk/work/tk8.5.6/unix/../generic/tkDecls.h:1160: warning: data definition has no type or storage class
/opt/local/var/macports/build/_opt_local_var_macports_sources_rsync.macports.org_release_ports_x11_tk/work/tk8.5.6/unix/../generic/tkDecls.h:1171: error: syntax error before '*' token
/opt/local/var/macports/build/_opt_local_var_macports_sources_rsync.macports.org_release_ports_x11_tk/work/tk8.5.6/unix/../generic/tkDecls.h:1172: warning: data definition has no type or storage class
/opt/local/var/macports/build/_opt_local_var_macports_sources_rsync.macports.org_release_ports_x11_tk/work/tk8.5.6/unix/../generic/tkDecls.h:1253: error: syntax error before 'Tk_GetBitmapFromObj'
/opt/local/var/macports/build/_opt_local_var_macports_sources_rsync.macports.org_release_ports_x11_tk/work/tk8.5.6/unix/../generic/tkDecls.h:1254: warning: data definition has no type or storage class
/opt/local/var/macports/build/_opt_local_var_macports_sources_rsync.macports.org_release_ports_x11_tk/work/tk8.5.6/unix/../generic/tkDecls.h:1259: error: syntax error before '*' token
/opt/local/var/macports/build/_opt_local_var_macports_sources_rsync.macports.org_release_ports_x11_tk/work/tk8.5.6/unix/../generic/tkDecls.h:1260: warning: data definition has no type or storage class
/opt/local/var/macports/build/_opt_local_var_macports_sources_rsync.macports.org_release_ports_x11_tk/work/tk8.5.6/unix/../generic/tkDecls.h:1369: error: syntax error before '*' token
/opt/local/var/macports/build/_opt_local_var_macports_sources_rsync.macports.org_release_ports_x11_tk/work/tk8.5.6/unix/../generic/tkDecls.h:1374: error: syntax error before '*' token
/opt/local/var/macports/build/_opt_local_var_macports_sources_rsync.macports.org_release_ports_x11_tk/work/tk8.5.6/unix/../generic/tkDecls.h:1380: error: syntax error before '*' token
/opt/local/var/macports/build/_opt_local_var_macports_sources_rsync.macports.org_release_ports_x11_tk/work/tk8.5.6/unix/../generic/tkDecls.h:1388: error: syntax error before 'Tk_Outline'
/opt/local/var/macports/build/_opt_local_var_macports_sources_rsync.macports.org_release_ports_x11_tk/work/tk8.5.6/unix/../generic/tkDecls.h:1394: error: syntax error before 'Tk_Outline'
/opt/local/var/macports/build/_opt_local_var_macports_sources_rsync.macports.org_release_ports_x11_tk/work/tk8.5.6/unix/../generic/tkDecls.h:1400: error: syntax error before 'Tk_Outline'
/opt/local/var/macports/build/_opt_local_var_macports_sources_rsync.macports.org_release_ports_x11_tk/work/tk8.5.6/unix/../generic/tkDecls.h:1405: error: syntax error before 'GC'
/opt/local/var/macports/build/_opt_local_var_macports_sources_rsync.macports.org_release_ports_x11_tk/work/tk8.5.6/unix/../generic/tkDecls.h:1417: error: syntax error before 'GC'
/opt/local/var/macports/build/_opt_local_var_macports_sources_rsync.macports.org_release_ports_x11_tk/work/tk8.5.6/unix/../generic/tkDecls.h:1431: error: syntax error before 'Pixmap'
/opt/local/var/macports/build/_opt_local_var_macports_sources_rsync.macports.org_release_ports_x11_tk/work/tk8.5.6/unix/../generic/tkDecls.h:1438: error: syntax error before 'XColor'
/opt/local/var/macports/build/_opt_local_var_macports_sources_rsync.macports.org_release_ports_x11_tk/work/tk8.5.6/unix/../generic/tkDecls.h:1466: error: syntax error before 'Pixmap'
/opt/local/var/macports/build/_opt_local_var_macports_sources_rsync.macports.org_release_ports_x11_tk/work/tk8.5.6/unix/../generic/tkDecls.h:1503: error: syntax error before 'Tk_ClassProcs'
/opt/local/var/macports/build/_opt_local_var_macports_sources_rsync.macports.org_release_ports_x11_tk/work/tk8.5.6/unix/../generic/tkDecls.h:1542: error: syntax error before '*' token
/opt/local/var/macports/build/_opt_local_var_macports_sources_rsync.macports.org_release_ports_x11_tk/work/tk8.5.6/unix/../generic/tkDecls.h:1639: error: syntax error before 'Drawable'
/opt/local/var/macports/build/_opt_local_var_macports_sources_rsync.macports.org_release_ports_x11_tk/work/tk8.5.6/unix/../generic/tkDecls.h:1674: error: syntax error before '*' token
/opt/local/var/macports/build/_opt_local_var_macports_sources_rsync.macports.org_release_ports_x11_tk/work/tk8.5.6/unix/../generic/tkDecls.h:1679: error: syntax error before '*' token
/opt/local/var/macports/build/_opt_local_var_macports_sources_rsync.macports.org_release_ports_x11_tk/work/tk8.5.6/unix/../generic/tkDecls.h:1710: error: syntax error before 'XColor'
/opt/local/var/macports/build/_opt_local_var_macports_sources_rsync.macports.org_release_ports_x11_tk/work/tk8.5.6/unix/../generic/tkDecls.h:1710: warning: no semicolon at end of struct or union
/opt/local/var/macports/build/_opt_local_var_macports_sources_rsync.macports.org_release_ports_x11_tk/work/tk8.5.6/unix/../generic/tkDecls.h:1711: error: syntax error before '*' token
/opt/local/var/macports/build/_opt_local_var_macports_sources_rsync.macports.org_release_ports_x11_tk/work/tk8.5.6/unix/../generic/tkDecls.h:1711: error: 'GC' declared as function returning a function
/opt/local/var/macports/build/_opt_local_var_macports_sources_rsync.macports.org_release_ports_x11_tk/work/tk8.5.6/unix/../generic/tkDecls.h:1711: warning: data definition has no type or storage class
/opt/local/var/macports/build/_opt_local_var_macports_sources_rsync.macports.org_release_ports_x11_tk/work/tk8.5.6/unix/../generic/tkDecls.h:1712: error: syntax error before 'Drawable'
/opt/local/var/macports/build/_opt_local_var_macports_sources_rsync.macports.org_release_ports_x11_tk/work/tk8.5.6/unix/../generic/tkDecls.h:1713: error: syntax error before 'Drawable'
/opt/local/var/macports/build/_opt_local_var_macports_sources_rsync.macports.org_release_ports_x11_tk/work/tk8.5.6/unix/../generic/tkDecls.h:1715: error: syntax error before 'XEvent'
/opt/local/var/macports/build/_opt_local_var_macports_sources_rsync.macports.org_release_ports_x11_tk/work/tk8.5.6/unix/../generic/tkDecls.h:1719: error: syntax error before '*' token
/opt/local/var/macports/build/_opt_local_var_macports_sources_rsync.macports.org_release_ports_x11_tk/work/tk8.5.6/unix/../generic/tkDecls.h:1719: warning: data definition has no type or storage class
/opt/local/var/macports/build/_opt_local_var_macports_sources_rsync.macports.org_release_ports_x11_tk/work/tk8.5.6/unix/../generic/tkDecls.h:1720: error: syntax error before 'Pixmap'
/opt/local/var/macports/build/_opt_local_var_macports_sources_rsync.macports.org_release_ports_x11_tk/work/tk8.5.6/unix/../generic/tkDecls.h:1721: error: syntax error before 'XColor'
/opt/local/var/macports/build/_opt_local_var_macports_sources_rsync.macports.org_release_ports_x11_tk/work/tk8.5.6/unix/../generic/tkDecls.h:1724: error: syntax error before 'Pixmap'
/opt/local/var/macports/build/_opt_local_var_macports_sources_rsync.macports.org_release_ports_x11_tk/work/tk8.5.6/unix/../generic/tkDecls.h:1726: error: syntax error before 'GC'
/opt/local/var/macports/build/_opt_local_var_macports_sources_rsync.macports.org_release_ports_x11_tk/work/tk8.5.6/unix/../generic/tkDecls.h:1731: error: syntax error before 'XSetWindowAttributes'
/opt/local/var/macports/build/_opt_local_var_macports_sources_rsync.macports.org_release_ports_x11_tk/work/tk8.5.6/unix/../generic/tkDecls.h:1733: error: syntax error before 'Atom'
/opt/local/var/macports/build/_opt_local_var_macports_sources_rsync.macports.org_release_ports_x11_tk/work/tk8.5.6/unix/../generic/tkDecls.h:1734: error: syntax error before 'Atom'
/opt/local/var/macports/build/_opt_local_var_macports_sources_rsync.macports.org_release_ports_x11_tk/work/tk8.5.6/unix/../generic/tkDecls.h:1739: error: syntax error before 'XWindowChanges'
/opt/local/var/macports/build/_opt_local_var_macports_sources_rsync.macports.org_release_ports_x11_tk/work/tk8.5.6/unix/../generic/tkDecls.h:1744: error: syntax error before '*' token
/opt/local/var/macports/build/_opt_local_var_macports_sources_rsync.macports.org_release_ports_x11_tk/work/tk8.5.6/unix/../generic/tkDecls.h:1750: error: syntax error before 'Atom'
/opt/local/var/macports/build/_opt_local_var_macports_sources_rsync.macports.org_release_ports_x11_tk/work/tk8.5.6/unix/../generic/tkDecls.h:1762: error: syntax error before 'Atom'
/opt/local/var/macports/build/_opt_local_var_macports_sources_rsync.macports.org_release_ports_x11_tk/work/tk8.5.6/unix/../generic/tkDecls.h:1766: error: syntax error before 'Drawable'
/opt/local/var/macports/build/_opt_local_var_macports_sources_rsync.macports.org_release_ports_x11_tk/work/tk8.5.6/unix/../generic/tkDecls.h:1767: error: syntax error before 'Drawable'
/opt/local/var/macports/build/_opt_local_var_macports_sources_rsync.macports.org_release_ports_x11_tk/work/tk8.5.6/unix/../generic/tkDecls.h:1768: error: syntax error before '*' token
/opt/local/var/macports/build/_opt_local_var_macports_sources_rsync.macports.org_release_ports_x11_tk/work/tk8.5.6/unix/../generic/tkDecls.h:1769: error: syntax error before 'GC'
/opt/local/var/macports/build/_opt_local_var_macports_sources_rsync.macports.org_release_ports_x11_tk/work/tk8.5.6/unix/../generic/tkDecls.h:1770: error: syntax error before '*' token
/opt/local/var/macports/build/_opt_local_var_macports_sources_rsync.macports.org_release_ports_x11_tk/work/tk8.5.6/unix/../generic/tkDecls.h:1771: error: syntax error before 'Drawable'
/opt/local/var/macports/build/_opt_local_var_macports_sources_rsync.macports.org_release_ports_x11_tk/work/tk8.5.6/unix/../generic/tkDecls.h:1772: error: syntax error before 'Drawable'
/opt/local/var/macports/build/_opt_local_var_macports_sources_rsync.macports.org_release_ports_x11_tk/work/tk8.5.6/unix/../generic/tkDecls.h:1774: error: syntax error before '*' token
/opt/local/var/macports/build/_opt_local_var_macports_sources_rsync.macports.org_release_ports_x11_tk/work/tk8.5.6/unix/../generic/tkDecls.h:1774: error: 'Font' declared as function returning a function
/opt/local/var/macports/build/_opt_local_var_macports_sources_rsync.macports.org_release_ports_x11_tk/work/tk8.5.6/unix/../generic/tkDecls.h:1774: warning: data definition has no type or storage class
/opt/local/var/macports/build/_opt_local_var_macports_sources_rsync.macports.org_release_ports_x11_tk/work/tk8.5.6/unix/../generic/tkDecls.h:1776: error: syntax error before '*' token
/opt/local/var/macports/build/_opt_local_var_macports_sources_rsync.macports.org_release_ports_x11_tk/work/tk8.5.6/unix/../generic/tkDecls.h:1777: error: syntax error before '*' token
/opt/local/var/macports/build/_opt_local_var_macports_sources_rsync.macports.org_release_ports_x11_tk/work/tk8.5.6/unix/../generic/tkDecls.h:1778: error: syntax error before '*' token
/opt/local/var/macports/build/_opt_local_var_macports_sources_rsync.macports.org_release_ports_x11_tk/work/tk8.5.6/unix/../generic/tkDecls.h:1779: error: syntax error before '*' token
/opt/local/var/macports/build/_opt_local_var_macports_sources_rsync.macports.org_release_ports_x11_tk/work/tk8.5.6/unix/../generic/tkDecls.h:1781: error: syntax error before '*' token
/opt/local/var/macports/build/_opt_local_var_macports_sources_rsync.macports.org_release_ports_x11_tk/work/tk8.5.6/unix/../generic/tkDecls.h:1783: error: syntax error before 'Display'
/opt/local/var/macports/build/_opt_local_var_macports_sources_rsync.macports.org_release_ports_x11_tk/work/tk8.5.6/unix/../generic/tkDecls.h:1784: error: syntax error before '*' token
/opt/local/var/macports/build/_opt_local_var_macports_sources_rsync.macports.org_release_ports_x11_tk/work/tk8.5.6/unix/../generic/tkDecls.h:1786: error: syntax error before '*' token
/opt/local/var/macports/build/_opt_local_var_macports_sources_rsync.macports.org_release_ports_x11_tk/work/tk8.5.6/unix/../generic/tkDecls.h:1787: error: syntax error before '*' token
/opt/local/var/macports/build/_opt_local_var_macports_sources_rsync.macports.org_release_ports_x11_tk/work/tk8.5.6/unix/../generic/tkDecls.h:1787: error: syntax error before '*' token
/opt/local/var/macports/build/_opt_local_var_macports_sources_rsync.macports.org_release_ports_x11_tk/work/tk8.5.6/unix/../generic/tkDecls.h:1787: error: 'GC' declared as function returning a function
/opt/local/var/macports/build/_opt_local_var_macports_sources_rsync.macports.org_release_ports_x11_tk/work/tk8.5.6/unix/../generic/tkDecls.h:1787: warning: data definition has no type or storage class
/opt/local/var/macports/build/_opt_local_var_macports_sources_rsync.macports.org_release_ports_x11_tk/work/tk8.5.6/unix/../generic/tkDecls.h:1792: error: syntax error before 'Atom'
/opt/local/var/macports/build/_opt_local_var_macports_sources_rsync.macports.org_release_ports_x11_tk/work/tk8.5.6/unix/../generic/tkDecls.h:1794: error: syntax error before '*' token
/opt/local/var/macports/build/_opt_local_var_macports_sources_rsync.macports.org_release_ports_x11_tk/work/tk8.5.6/unix/../generic/tkDecls.h:1794: error: 'Pixmap' declared as function returning a function
/opt/local/var/macports/build/_opt_local_var_macports_sources_rsync.macports.org_release_ports_x11_tk/work/tk8.5.6/unix/../generic/tkDecls.h:1794: warning: data definition has no type or storage class
/opt/local/var/macports/build/_opt_local_var_macports_sources_rsync.macports.org_release_ports_x11_tk/work/tk8.5.6/unix/../generic/tkDecls.h:1795: error: syntax error before '*' token
/opt/local/var/macports/build/_opt_local_var_macports_sources_rsync.macports.org_release_ports_x11_tk/work/tk8.5.6/unix/../generic/tkDecls.h:1795: error: 'Pixmap' declared as function returning a function
/opt/local/var/macports/build/_opt_local_var_macports_sources_rsync.macports.org_release_ports_x11_tk/work/tk8.5.6/unix/../generic/tkDecls.h:1795: warning: data definition has no type or storage class
/opt/local/var/macports/build/_opt_local_var_macports_sources_rsync.macports.org_release_ports_x11_tk/work/tk8.5.6/unix/../generic/tkDecls.h:1797: error: syntax error before '*' token
/opt/local/var/macports/build/_opt_local_var_macports_sources_rsync.macports.org_release_ports_x11_tk/work/tk8.5.6/unix/../generic/tkDecls.h:1797: warning: data definition has no type or storage class
/opt/local/var/macports/build/_opt_local_var_macports_sources_rsync.macports.org_release_ports_x11_tk/work/tk8.5.6/unix/../generic/tkDecls.h:1798: error: syntax error before '*' token
/opt/local/var/macports/build/_opt_local_var_macports_sources_rsync.macports.org_release_ports_x11_tk/work/tk8.5.6/unix/../generic/tkDecls.h:1798: error: syntax error before 'XColor'
/opt/local/var/macports/build/_opt_local_var_macports_sources_rsync.macports.org_release_ports_x11_tk/work/tk8.5.6/unix/../generic/tkDecls.h:1798: warning: data definition has no type or storage class
/opt/local/var/macports/build/_opt_local_var_macports_sources_rsync.macports.org_release_ports_x11_tk/work/tk8.5.6/unix/../generic/tkDecls.h:1799: error: syntax error before '*' token
/opt/local/var/macports/build/_opt_local_var_macports_sources_rsync.macports.org_release_ports_x11_tk/work/tk8.5.6/unix/../generic/tkDecls.h:1799: error: 'Colormap' declared as function returning a function
/opt/local/var/macports/build/_opt_local_var_macports_sources_rsync.macports.org_release_ports_x11_tk/work/tk8.5.6/unix/../generic/tkDecls.h:1799: warning: data definition has no type or storage class
/opt/local/var/macports/build/_opt_local_var_macports_sources_rsync.macports.org_release_ports_x11_tk/work/tk8.5.6/unix/../generic/tkDecls.h:1805: error: syntax error before '*' token
/opt/local/var/macports/build/_opt_local_var_macports_sources_rsync.macports.org_release_ports_x11_tk/work/tk8.5.6/unix/../generic/tkDecls.h:1805: error: syntax error before 'XGCValues'
/opt/local/var/macports/build/_opt_local_var_macports_sources_rsync.macports.org_release_ports_x11_tk/work/tk8.5.6/unix/../generic/tkDecls.h:1805: error: 'GC' declared as function returning a function
/opt/local/var/macports/build/_opt_local_var_macports_sources_rsync.macports.org_release_ports_x11_tk/work/tk8.5.6/unix/../generic/tkDecls.h:1805: warning: data definition has no type or storage class
/opt/local/var/macports/build/_opt_local_var_macports_sources_rsync.macports.org_release_ports_x11_tk/work/tk8.5.6/unix/../generic/tkDecls.h:1814: error: syntax error before '*' token
/opt/local/var/macports/build/_opt_local_var_macports_sources_rsync.macports.org_release_ports_x11_tk/work/tk8.5.6/unix/../generic/tkDecls.h:1814: error: syntax error before '*' token
/opt/local/var/macports/build/_opt_local_var_macports_sources_rsync.macports.org_release_ports_x11_tk/work/tk8.5.6/unix/../generic/tkDecls.h:1814: error: 'Pixmap' declared as function returning a function
/opt/local/var/macports/build/_opt_local_var_macports_sources_rsync.macports.org_release_ports_x11_tk/work/tk8.5.6/unix/../generic/tkDecls.h:1814: warning: data definition has no type or storage class
/opt/local/var/macports/build/_opt_local_var_macports_sources_rsync.macports.org_release_ports_x11_tk/work/tk8.5.6/unix/../generic/tkDecls.h:1819: error: syntax error before 'Atom'
/opt/local/var/macports/build/_opt_local_var_macports_sources_rsync.macports.org_release_ports_x11_tk/work/tk8.5.6/unix/../generic/tkDecls.h:1821: error: syntax error before '*' token
/opt/local/var/macports/build/_opt_local_var_macports_sources_rsync.macports.org_release_ports_x11_tk/work/tk8.5.6/unix/../generic/tkDecls.h:1821: error: syntax error before 'Colormap'
/opt/local/var/macports/build/_opt_local_var_macports_sources_rsync.macports.org_release_ports_x11_tk/work/tk8.5.6/unix/../generic/tkDecls.h:1821: warning: data definition has no type or storage class
/opt/local/var/macports/build/_opt_local_var_macports_sources_rsync.macports.org_release_ports_x11_tk/work/tk8.5.6/unix/../generic/tkDecls.h:1824: error: syntax error before '*' token
/opt/local/var/macports/build/_opt_local_var_macports_sources_rsync.macports.org_release_ports_x11_tk/work/tk8.5.6/unix/../generic/tkDecls.h:1825: error: syntax error before '*' token
/opt/local/var/macports/build/_opt_local_var_macports_sources_rsync.macports.org_release_ports_x11_tk/work/tk8.5.6/unix/../generic/tkDecls.h:1828: error: syntax error before '*' token
/opt/local/var/macports/build/_opt_local_var_macports_sources_rsync.macports.org_release_ports_x11_tk/work/tk8.5.6/unix/../generic/tkDecls.h:1828: error: 'Atom' declared as function returning a function
/opt/local/var/macports/build/_opt_local_var_macports_sources_rsync.macports.org_release_ports_x11_tk/work/tk8.5.6/unix/../generic/tkDecls.h:1828: warning: data definition has no type or storage class
/opt/local/var/macports/build/_opt_local_var_macports_sources_rsync.macports.org_release_ports_x11_tk/work/tk8.5.6/unix/../generic/tkDecls.h:1841: error: syntax error before '*' token
/opt/local/var/macports/build/_opt_local_var_macports_sources_rsync.macports.org_release_ports_x11_tk/work/tk8.5.6/unix/../generic/tkDecls.h:1843: error: syntax error before '*' token
/opt/local/var/macports/build/_opt_local_var_macports_sources_rsync.macports.org_release_ports_x11_tk/work/tk8.5.6/unix/../generic/tkDecls.h:1844: error: syntax error before '*' token
/opt/local/var/macports/build/_opt_local_var_macports_sources_rsync.macports.org_release_ports_x11_tk/work/tk8.5.6/unix/../generic/tkDecls.h:1851: error: syntax error before 'Atom'
/opt/local/var/macports/build/_opt_local_var_macports_sources_rsync.macports.org_release_ports_x11_tk/work/tk8.5.6/unix/../generic/tkDecls.h:1862: error: syntax error before '*' token
/opt/local/var/macports/build/_opt_local_var_macports_sources_rsync.macports.org_release_ports_x11_tk/work/tk8.5.6/unix/../generic/tkDecls.h:1863: error: syntax error before '*' token
/opt/local/var/macports/build/_opt_local_var_macports_sources_rsync.macports.org_release_ports_x11_tk/work/tk8.5.6/unix/../generic/tkDecls.h:1864: error: syntax error before 'Drawable'
/opt/local/var/macports/build/_opt_local_var_macports_sources_rsync.macports.org_release_ports_x11_tk/work/tk8.5.6/unix/../generic/tkDecls.h:1875: error: syntax error before 'Pixmap'
/opt/local/var/macports/build/_opt_local_var_macports_sources_rsync.macports.org_release_ports_x11_tk/work/tk8.5.6/unix/../generic/tkDecls.h:1878: error: syntax error before 'Pixmap'
/opt/local/var/macports/build/_opt_local_var_macports_sources_rsync.macports.org_release_ports_x11_tk/work/tk8.5.6/unix/../generic/tkDecls.h:1879: error: syntax error before 'Colormap'
/opt/local/var/macports/build/_opt_local_var_macports_sources_rsync.macports.org_release_ports_x11_tk/work/tk8.5.6/unix/../generic/tkDecls.h:1880: error: syntax error before 'Visual'
/opt/local/var/macports/build/_opt_local_var_macports_sources_rsync.macports.org_release_ports_x11_tk/work/tk8.5.6/unix/../generic/tkDecls.h:1881: error: syntax error before '*' token
/opt/local/var/macports/build/_opt_local_var_macports_sources_rsync.macports.org_release_ports_x11_tk/work/tk8.5.6/unix/../generic/tkDecls.h:1887: error: syntax error before '*' token
/opt/local/var/macports/build/_opt_local_var_macports_sources_rsync.macports.org_release_ports_x11_tk/work/tk8.5.6/unix/../generic/tkDecls.h:1888: error: syntax error before '*' token
/opt/local/var/macports/build/_opt_local_var_macports_sources_rsync.macports.org_release_ports_x11_tk/work/tk8.5.6/unix/../generic/tkDecls.h:1894: error: syntax error before '*' token
/opt/local/var/macports/build/_opt_local_var_macports_sources_rsync.macports.org_release_ports_x11_tk/work/tk8.5.6/unix/../generic/tkDecls.h:1894: error: 'Pixmap' declared as function returning a function
/opt/local/var/macports/build/_opt_local_var_macports_sources_rsync.macports.org_release_ports_x11_tk/work/tk8.5.6/unix/../generic/tkDecls.h:1894: warning: data definition has no type or storage class
/opt/local/var/macports/build/_opt_local_var_macports_sources_rsync.macports.org_release_ports_x11_tk/work/tk8.5.6/unix/../generic/tkDecls.h:1896: error: syntax error before '*' token
/opt/local/var/macports/build/_opt_local_var_macports_sources_rsync.macports.org_release_ports_x11_tk/work/tk8.5.6/unix/../generic/tkDecls.h:1896: warning: data definition has no type or storage class
/opt/local/var/macports/build/_opt_local_var_macports_sources_rsync.macports.org_release_ports_x11_tk/work/tk8.5.6/unix/../generic/tkDecls.h:1910: error: syntax error before '*' token
/opt/local/var/macports/build/_opt_local_var_macports_sources_rsync.macports.org_release_ports_x11_tk/work/tk8.5.6/unix/../generic/tkDecls.h:1910: error: 'Pixmap' declared as function returning a function
/opt/local/var/macports/build/_opt_local_var_macports_sources_rsync.macports.org_release_ports_x11_tk/work/tk8.5.6/unix/../generic/tkDecls.h:1910: warning: data definition has no type or storage class
/opt/local/var/macports/build/_opt_local_var_macports_sources_rsync.macports.org_release_ports_x11_tk/work/tk8.5.6/unix/../generic/tkDecls.h:1911: error: syntax error before '*' token
/opt/local/var/macports/build/_opt_local_var_macports_sources_rsync.macports.org_release_ports_x11_tk/work/tk8.5.6/unix/../generic/tkDecls.h:1911: warning: data definition has no type or storage class
/opt/local/var/macports/build/_opt_local_var_macports_sources_rsync.macports.org_release_ports_x11_tk/work/tk8.5.6/unix/../generic/tkDecls.h:1930: error: syntax error before '*' token
/opt/local/var/macports/build/_opt_local_var_macports_sources_rsync.macports.org_release_ports_x11_tk/work/tk8.5.6/unix/../generic/tkDecls.h:1931: error: syntax error before '*' token
/opt/local/var/macports/build/_opt_local_var_macports_sources_rsync.macports.org_release_ports_x11_tk/work/tk8.5.6/unix/../generic/tkDecls.h:1932: error: syntax error before '*' token
/opt/local/var/macports/build/_opt_local_var_macports_sources_rsync.macports.org_release_ports_x11_tk/work/tk8.5.6/unix/../generic/tkDecls.h:1933: error: syntax error before 'Tk_Outline'
/opt/local/var/macports/build/_opt_local_var_macports_sources_rsync.macports.org_release_ports_x11_tk/work/tk8.5.6/unix/../generic/tkDecls.h:1934: error: syntax error before 'Tk_Outline'
/opt/local/var/macports/build/_opt_local_var_macports_sources_rsync.macports.org_release_ports_x11_tk/work/tk8.5.6/unix/../generic/tkDecls.h:1935: error: syntax error before 'Tk_Outline'
/opt/local/var/macports/build/_opt_local_var_macports_sources_rsync.macports.org_release_ports_x11_tk/work/tk8.5.6/unix/../generic/tkDecls.h:1936: error: syntax error before 'GC'
/opt/local/var/macports/build/_opt_local_var_macports_sources_rsync.macports.org_release_ports_x11_tk/work/tk8.5.6/unix/../generic/tkDecls.h:1938: error: syntax error before 'GC'
/opt/local/var/macports/build/_opt_local_var_macports_sources_rsync.macports.org_release_ports_x11_tk/work/tk8.5.6/unix/../generic/tkDecls.h:1940: error: syntax error before 'Pixmap'
/opt/local/var/macports/build/_opt_local_var_macports_sources_rsync.macports.org_release_ports_x11_tk/work/tk8.5.6/unix/../generic/tkDecls.h:1941: error: syntax error before 'XColor'
/opt/local/var/macports/build/_opt_local_var_macports_sources_rsync.macports.org_release_ports_x11_tk/work/tk8.5.6/unix/../generic/tkDecls.h:1945: error: syntax error before 'Pixmap'
/opt/local/var/macports/build/_opt_local_var_macports_sources_rsync.macports.org_release_ports_x11_tk/work/tk8.5.6/unix/../generic/tkDecls.h:1951: error: syntax error before 'Tk_ClassProcs'
/opt/local/var/macports/build/_opt_local_var_macports_sources_rsync.macports.org_release_ports_x11_tk/work/tk8.5.6/unix/../generic/tkDecls.h:1957: error: syntax error before '*' token
/opt/local/var/macports/build/_opt_local_var_macports_sources_rsync.macports.org_release_ports_x11_tk/work/tk8.5.6/unix/../generic/tkDecls.h:1973: error: syntax error before 'Drawable'
/opt/local/var/macports/build/_opt_local_var_macports_sources_rsync.macports.org_release_ports_x11_tk/work/tk8.5.6/unix/../generic/tkDecls.h:1978: error: syntax error before '*' token
/opt/local/var/macports/build/_opt_local_var_macports_sources_rsync.macports.org_release_ports_x11_tk/work/tk8.5.6/unix/../generic/tkDecls.h:1979: error: syntax error before '*' token
/opt/local/var/macports/build/_opt_local_var_macports_sources_rsync.macports.org_release_ports_x11_tk/work/tk8.5.6/unix/../generic/tkDecls.h:1983: error: syntax error before '}' token
/opt/local/var/macports/build/_opt_local_var_macports_sources_rsync.macports.org_release_ports_x11_tk/work/tk8.5.6/unix/../generic/tkDecls.h:1983: warning: data definition has no type or storage class
/opt/local/var/macports/build/_opt_local_var_macports_sources_rsync.macports.org_release_ports_x11_tk/work/tk8.5.6/unix/../generic/tkDecls.h:1988: error: syntax error before '*' token
/opt/local/var/macports/build/_opt_local_var_macports_sources_rsync.macports.org_release_ports_x11_tk/work/tk8.5.6/unix/../generic/tkDecls.h:1988: warning: data definition has no type or storage class
In file included from /usr/include/sys/time.h:198,
                 from /opt/local/var/macports/build/_opt_local_var_macports_sources_rsync.macports.org_release_ports_x11_tk/work/tk8.5.6/unix/../unix/tkUnixPort.h:63,
                 from /opt/local/var/macports/build/_opt_local_var_macports_sources_rsync.macports.org_release_ports_x11_tk/work/tk8.5.6/unix/../generic/tkPort.h:32,
                 from /opt/local/var/macports/build/_opt_local_var_macports_sources_rsync.macports.org_release_ports_x11_tk/work/tk8.5.6/unix/../generic/tkInt.h:27,
                 from /opt/local/var/macports/build/_opt_local_var_macports_sources_rsync.macports.org_release_ports_x11_tk/work/tk8.5.6/unix/../generic/tk3d.c:16:
/usr/include/time.h:133: error: 'time' redeclared as different kind of symbol
/opt/local/var/macports/build/_opt_local_var_macports_sources_rsync.macports.org_release_ports_x11_tk/work/tk8.5.6/unix/../generic/tk.h:661: error: previous declaration of 'time' was here
In file included from /opt/local/var/macports/build/_opt_local_var_macports_sources_rsync.macports.org_release_ports_x11_tk/work/tk8.5.6/unix/../generic/tkPort.h:32,
                 from /opt/local/var/macports/build/_opt_local_var_macports_sources_rsync.macports.org_release_ports_x11_tk/work/tk8.5.6/unix/../generic/tkInt.h:27,
                 from /opt/local/var/macports/build/_opt_local_var_macports_sources_rsync.macports.org_release_ports_x11_tk/work/tk8.5.6/unix/../generic/tk3d.c:16:
/opt/local/var/macports/build/_opt_local_var_macports_sources_rsync.macports.org_release_ports_x11_tk/work/tk8.5.6/unix/../unix/tkUnixPort.h:81:28: error: X11/cursorfont.h: No such file or directory
/opt/local/var/macports/build/_opt_local_var_macports_sources_rsync.macports.org_release_ports_x11_tk/work/tk8.5.6/unix/../unix/tkUnixPort.h:82:24: error: X11/keysym.h: No such file or directory
/opt/local/var/macports/build/_opt_local_var_macports_sources_rsync.macports.org_release_ports_x11_tk/work/tk8.5.6/unix/../unix/tkUnixPort.h:83:23: error: X11/Xatom.h: No such file or directory
/opt/local/var/macports/build/_opt_local_var_macports_sources_rsync.macports.org_release_ports_x11_tk/work/tk8.5.6/unix/../unix/tkUnixPort.h:84:24: error: X11/Xproto.h: No such file or directory
/opt/local/var/macports/build/_opt_local_var_macports_sources_rsync.macports.org_release_ports_x11_tk/work/tk8.5.6/unix/../unix/tkUnixPort.h:85:27: error: X11/Xresource.h: No such file or directory
/opt/local/var/macports/build/_opt_local_var_macports_sources_rsync.macports.org_release_ports_x11_tk/work/tk8.5.6/unix/../unix/tkUnixPort.h:86:23: error: X11/Xutil.h: No such file or directory
In file included from /opt/local/var/macports/build/_opt_local_var_macports_sources_rsync.macports.org_release_ports_x11_tk/work/tk8.5.6/unix/../generic/tk3d.c:16:
/opt/local/var/macports/build/_opt_local_var_macports_sources_rsync.macports.org_release_ports_x11_tk/work/tk8.5.6/unix/../generic/tkInt.h:111: error: syntax error before 'XEvent'
/opt/local/var/macports/build/_opt_local_var_macports_sources_rsync.macports.org_release_ports_x11_tk/work/tk8.5.6/unix/../generic/tkInt.h:122: error: syntax error before 'Display'
/opt/local/var/macports/build/_opt_local_var_macports_sources_rsync.macports.org_release_ports_x11_tk/work/tk8.5.6/unix/../generic/tkInt.h:122: warning: no semicolon at end of struct or union
/opt/local/var/macports/build/_opt_local_var_macports_sources_rsync.macports.org_release_ports_x11_tk/work/tk8.5.6/unix/../generic/tkInt.h:145: error: syntax error before '}' token
/opt/local/var/macports/build/_opt_local_var_macports_sources_rsync.macports.org_release_ports_x11_tk/work/tk8.5.6/unix/../generic/tkInt.h:145: warning: data definition has no type or storage class
/opt/local/var/macports/build/_opt_local_var_macports_sources_rsync.macports.org_release_ports_x11_tk/work/tk8.5.6/unix/../generic/tkInt.h:169: error: syntax error before 'Display'
/opt/local/var/macports/build/_opt_local_var_macports_sources_rsync.macports.org_release_ports_x11_tk/work/tk8.5.6/unix/../generic/tkInt.h:169: warning: no semicolon at end of struct or union
/opt/local/var/macports/build/_opt_local_var_macports_sources_rsync.macports.org_release_ports_x11_tk/work/tk8.5.6/unix/../generic/tkInt.h:170: error: conflicting types for 'nextPtr'
/opt/local/var/macports/build/_opt_local_var_macports_sources_rsync.macports.org_release_ports_x11_tk/work/tk8.5.6/unix/../generic/tkInt.h:141: error: previous declaration of 'nextPtr' was here
/opt/local/var/macports/build/_opt_local_var_macports_sources_rsync.macports.org_release_ports_x11_tk/work/tk8.5.6/unix/../generic/tkInt.h:171: error: conflicting types for 'name'
/opt/local/var/macports/build/_opt_local_var_macports_sources_rsync.macports.org_release_ports_x11_tk/work/tk8.5.6/unix/../generic/tk.h:666: error: previous declaration of 'name' was here
/opt/local/var/macports/build/_opt_local_var_macports_sources_rsync.macports.org_release_ports_x11_tk/work/tk8.5.6/unix/../generic/tkInt.h:173: error: syntax error before 'lastEventTime'
/opt/local/var/macports/build/_opt_local_var_macports_sources_rsync.macports.org_release_ports_x11_tk/work/tk8.5.6/unix/../generic/tkInt.h:173: warning: data definition has no type or storage class
/opt/local/var/macports/build/_opt_local_var_macports_sources_rsync.macports.org_release_ports_x11_tk/work/tk8.5.6/unix/../generic/tkInt.h:214: error: syntax error before '*' token
/opt/local/var/macports/build/_opt_local_var_macports_sources_rsync.macports.org_release_ports_x11_tk/work/tk8.5.6/unix/../generic/tkInt.h:214: warning: data definition has no type or storage class
/opt/local/var/macports/build/_opt_local_var_macports_sources_rsync.macports.org_release_ports_x11_tk/work/tk8.5.6/unix/../generic/tkInt.h:272: error: syntax error before 'cursorFont'
/opt/local/var/macports/build/_opt_local_var_macports_sources_rsync.macports.org_release_ports_x11_tk/work/tk8.5.6/unix/../generic/tkInt.h:272: warning: data definition has no type or storage class
/opt/local/var/macports/build/_opt_local_var_macports_sources_rsync.macports.org_release_ports_x11_tk/work/tk8.5.6/unix/../generic/tkInt.h:432: error: syntax error before 'multipleAtom'
/opt/local/var/macports/build/_opt_local_var_macports_sources_rsync.macports.org_release_ports_x11_tk/work/tk8.5.6/unix/../generic/tkInt.h:432: warning: data definition has no type or storage class
/opt/local/var/macports/build/_opt_local_var_macports_sources_rsync.macports.org_release_ports_x11_tk/work/tk8.5.6/unix/../generic/tkInt.h:434: error: syntax error before 'incrAtom'
/opt/local/var/macports/build/_opt_local_var_macports_sources_rsync.macports.org_release_ports_x11_tk/work/tk8.5.6/unix/../generic/tkInt.h:434: warning: data definition has no type or storage class
/opt/local/var/macports/build/_opt_local_var_macports_sources_rsync.macports.org_release_ports_x11_tk/work/tk8.5.6/unix/../generic/tkInt.h:435: error: syntax error before 'targetsAtom'
/opt/local/var/macports/build/_opt_local_var_macports_sources_rsync.macports.org_release_ports_x11_tk/work/tk8.5.6/unix/../generic/tkInt.h:435: warning: data definition has no type or storage class
/opt/local/var/macports/build/_opt_local_var_macports_sources_rsync.macports.org_release_ports_x11_tk/work/tk8.5.6/unix/../generic/tkInt.h:436: error: syntax error before 'timestampAtom'
/opt/local/var/macports/build/_opt_local_var_macports_sources_rsync.macports.org_release_ports_x11_tk/work/tk8.5.6/unix/../generic/tkInt.h:436: warning: data definition has no type or storage class
/opt/local/var/macports/build/_opt_local_var_macports_sources_rsync.macports.org_release_ports_x11_tk/work/tk8.5.6/unix/../generic/tkInt.h:437: error: syntax error before 'textAtom'
/opt/local/var/macports/build/_opt_local_var_macports_sources_rsync.macports.org_release_ports_x11_tk/work/tk8.5.6/unix/../generic/tkInt.h:437: warning: data definition has no type or storage class
/opt/local/var/macports/build/_opt_local_var_macports_sources_rsync.macports.org_release_ports_x11_tk/work/tk8.5.6/unix/../generic/tkInt.h:438: error: syntax error before 'compoundTextAtom'
/opt/local/var/macports/build/_opt_local_var_macports_sources_rsync.macports.org_release_ports_x11_tk/work/tk8.5.6/unix/../generic/tkInt.h:438: warning: data definition has no type or storage class
/opt/local/var/macports/build/_opt_local_var_macports_sources_rsync.macports.org_release_ports_x11_tk/work/tk8.5.6/unix/../generic/tkInt.h:439: error: syntax error before 'applicationAtom'
/opt/local/var/macports/build/_opt_local_var_macports_sources_rsync.macports.org_release_ports_x11_tk/work/tk8.5.6/unix/../generic/tkInt.h:439: warning: data definition has no type or storage class
/opt/local/var/macports/build/_opt_local_var_macports_sources_rsync.macports.org_release_ports_x11_tk/work/tk8.5.6/unix/../generic/tkInt.h:440: error: syntax error before 'windowAtom'
/opt/local/var/macports/build/_opt_local_var_macports_sources_rsync.macports.org_release_ports_x11_tk/work/tk8.5.6/unix/../generic/tkInt.h:440: warning: data definition has no type or storage class
/opt/local/var/macports/build/_opt_local_var_macports_sources_rsync.macports.org_release_ports_x11_tk/work/tk8.5.6/unix/../generic/tkInt.h:441: error: syntax error before 'clipboardAtom'
/opt/local/var/macports/build/_opt_local_var_macports_sources_rsync.macports.org_release_ports_x11_tk/work/tk8.5.6/unix/../generic/tkInt.h:441: warning: data definition has no type or storage class
/opt/local/var/macports/build/_opt_local_var_macports_sources_rsync.macports.org_release_ports_x11_tk/work/tk8.5.6/unix/../generic/tkInt.h:442: error: syntax error before 'utf8Atom'
/opt/local/var/macports/build/_opt_local_var_macports_sources_rsync.macports.org_release_ports_x11_tk/work/tk8.5.6/unix/../generic/tkInt.h:442: warning: data definition has no type or storage class
/opt/local/var/macports/build/_opt_local_var_macports_sources_rsync.macports.org_release_ports_x11_tk/work/tk8.5.6/unix/../generic/tkInt.h:466: error: syntax error before 'commProperty'
/opt/local/var/macports/build/_opt_local_var_macports_sources_rsync.macports.org_release_ports_x11_tk/work/tk8.5.6/unix/../generic/tkInt.h:466: warning: data definition has no type or storage class
/opt/local/var/macports/build/_opt_local_var_macports_sources_rsync.macports.org_release_ports_x11_tk/work/tk8.5.6/unix/../generic/tkInt.h:467: error: syntax error before 'registryProperty'
/opt/local/var/macports/build/_opt_local_var_macports_sources_rsync.macports.org_release_ports_x11_tk/work/tk8.5.6/unix/../generic/tkInt.h:467: warning: data definition has no type or storage class
/opt/local/var/macports/build/_opt_local_var_macports_sources_rsync.macports.org_release_ports_x11_tk/work/tk8.5.6/unix/../generic/tkInt.h:469: error: syntax error before 'appNameProperty'
/opt/local/var/macports/build/_opt_local_var_macports_sources_rsync.macports.org_release_ports_x11_tk/work/tk8.5.6/unix/../generic/tkInt.h:469: warning: data definition has no type or storage class
/opt/local/var/macports/build/_opt_local_var_macports_sources_rsync.macports.org_release_ports_x11_tk/work/tk8.5.6/unix/../generic/tkInt.h:480: error: syntax error before '*' token
/opt/local/var/macports/build/_opt_local_var_macports_sources_rsync.macports.org_release_ports_x11_tk/work/tk8.5.6/unix/../generic/tkInt.h:480: error: syntax error before '*' token
/opt/local/var/macports/build/_opt_local_var_macports_sources_rsync.macports.org_release_ports_x11_tk/work/tk8.5.6/unix/../generic/tkInt.h:480: error: 'XID' declared as function returning a function
/opt/local/var/macports/build/_opt_local_var_macports_sources_rsync.macports.org_release_ports_x11_tk/work/tk8.5.6/unix/../generic/tkInt.h:480: warning: data definition has no type or storage class
/opt/local/var/macports/build/_opt_local_var_macports_sources_rsync.macports.org_release_ports_x11_tk/work/tk8.5.6/unix/../generic/tkInt.h:556: error: syntax error before '}' token
/opt/local/var/macports/build/_opt_local_var_macports_sources_rsync.macports.org_release_ports_x11_tk/work/tk8.5.6/unix/../generic/tkInt.h:556: warning: data definition has no type or storage class
/opt/local/var/macports/build/_opt_local_var_macports_sources_rsync.macports.org_release_ports_x11_tk/work/tk8.5.6/unix/../generic/tkInt.h:581: error: syntax error before 'TkDisplay'
/opt/local/var/macports/build/_opt_local_var_macports_sources_rsync.macports.org_release_ports_x11_tk/work/tk8.5.6/unix/../generic/tkInt.h:581: warning: no semicolon at end of struct or union
/opt/local/var/macports/build/_opt_local_var_macports_sources_rsync.macports.org_release_ports_x11_tk/work/tk8.5.6/unix/../generic/tkInt.h:599: error: conflicting types for 'nextPtr'
/opt/local/var/macports/build/_opt_local_var_macports_sources_rsync.macports.org_release_ports_x11_tk/work/tk8.5.6/unix/../generic/tkInt.h:141: error: previous declaration of 'nextPtr' was here
/opt/local/var/macports/build/_opt_local_var_macports_sources_rsync.macports.org_release_ports_x11_tk/work/tk8.5.6/unix/../generic/tkInt.h:602: error: syntax error before '}' token
/opt/local/var/macports/build/_opt_local_var_macports_sources_rsync.macports.org_release_ports_x11_tk/work/tk8.5.6/unix/../generic/tkInt.h:602: warning: data definition has no type or storage class
/opt/local/var/macports/build/_opt_local_var_macports_sources_rsync.macports.org_release_ports_x11_tk/work/tk8.5.6/unix/../generic/tkInt.h:703: error: syntax error before 'Display'
/opt/local/var/macports/build/_opt_local_var_macports_sources_rsync.macports.org_release_ports_x11_tk/work/tk8.5.6/unix/../generic/tkInt.h:703: warning: no semicolon at end of struct or union
/opt/local/var/macports/build/_opt_local_var_macports_sources_rsync.macports.org_release_ports_x11_tk/work/tk8.5.6/unix/../generic/tkInt.h:704: warning: data definition has no type or storage class
/opt/local/var/macports/build/_opt_local_var_macports_sources_rsync.macports.org_release_ports_x11_tk/work/tk8.5.6/unix/../generic/tkInt.h:708: error: syntax error before '*' token
/opt/local/var/macports/build/_opt_local_var_macports_sources_rsync.macports.org_release_ports_x11_tk/work/tk8.5.6/unix/../generic/tkInt.h:708: warning: data definition has no type or storage class
/opt/local/var/macports/build/_opt_local_var_macports_sources_rsync.macports.org_release_ports_x11_tk/work/tk8.5.6/unix/../generic/tkInt.h:720: error: conflicting types for 'parentPtr'
/opt/local/var/macports/build/_opt_local_var_macports_sources_rsync.macports.org_release_ports_x11_tk/work/tk8.5.6/unix/../generic/tk.h:764: error: previous declaration of 'parentPtr' was here
/opt/local/var/macports/build/_opt_local_var_macports_sources_rsync.macports.org_release_ports_x11_tk/work/tk8.5.6/unix/../generic/tkInt.h:724: error: conflicting types for 'nextPtr'
/opt/local/var/macports/build/_opt_local_var_macports_sources_rsync.macports.org_release_ports_x11_tk/work/tk8.5.6/unix/../generic/tkInt.h:141: error: previous declaration of 'nextPtr' was here
/opt/local/var/macports/build/_opt_local_var_macports_sources_rsync.macports.org_release_ports_x11_tk/work/tk8.5.6/unix/../generic/tkInt.h:756: error: syntax error before 'changes'
/opt/local/var/macports/build/_opt_local_var_macports_sources_rsync.macports.org_release_ports_x11_tk/work/tk8.5.6/unix/../generic/tkInt.h:756: warning: data definition has no type or storage class
/opt/local/var/macports/build/_opt_local_var_macports_sources_rsync.macports.org_release_ports_x11_tk/work/tk8.5.6/unix/../generic/tkInt.h:759: error: syntax error before 'atts'
/opt/local/var/macports/build/_opt_local_var_macports_sources_rsync.macports.org_release_ports_x11_tk/work/tk8.5.6/unix/../generic/tkInt.h:759: warning: data definition has no type or storage class
/opt/local/var/macports/build/_opt_local_var_macports_sources_rsync.macports.org_release_ports_x11_tk/work/tk8.5.6/unix/../generic/tkInt.h:832: error: syntax error before '*' token
/opt/local/var/macports/build/_opt_local_var_macports_sources_rsync.macports.org_release_ports_x11_tk/work/tk8.5.6/unix/../generic/tkInt.h:832: warning: data definition has no type or storage class
/opt/local/var/macports/build/_opt_local_var_macports_sources_rsync.macports.org_release_ports_x11_tk/work/tk8.5.6/unix/../generic/tkInt.h:852: error: syntax error before '}' token
/opt/local/var/macports/build/_opt_local_var_macports_sources_rsync.macports.org_release_ports_x11_tk/work/tk8.5.6/unix/../generic/tkInt.h:852: warning: data definition has no type or storage class
/opt/local/var/macports/build/_opt_local_var_macports_sources_rsync.macports.org_release_ports_x11_tk/work/tk8.5.6/unix/../generic/tkInt.h:873: error: syntax error before 'Pixmap'
/opt/local/var/macports/build/_opt_local_var_macports_sources_rsync.macports.org_release_ports_x11_tk/work/tk8.5.6/unix/../generic/tkInt.h:873: warning: no semicolon at end of struct or union
/opt/local/var/macports/build/_opt_local_var_macports_sources_rsync.macports.org_release_ports_x11_tk/work/tk8.5.6/unix/../generic/tkInt.h:873: warning: no semicolon at end of struct or union
/opt/local/var/macports/build/_opt_local_var_macports_sources_rsync.macports.org_release_ports_x11_tk/work/tk8.5.6/unix/../generic/tkInt.h:875: error: syntax error before '}' token
/opt/local/var/macports/build/_opt_local_var_macports_sources_rsync.macports.org_release_ports_x11_tk/work/tk8.5.6/unix/../generic/tkInt.h:875: warning: data definition has no type or storage class
/opt/local/var/macports/build/_opt_local_var_macports_sources_rsync.macports.org_release_ports_x11_tk/work/tk8.5.6/unix/../generic/tkInt.h:876: error: syntax error before '}' token
/opt/local/var/macports/build/_opt_local_var_macports_sources_rsync.macports.org_release_ports_x11_tk/work/tk8.5.6/unix/../generic/tkInt.h:876: warning: data definition has no type or storage class
/opt/local/var/macports/build/_opt_local_var_macports_sources_rsync.macports.org_release_ports_x11_tk/work/tk8.5.6/unix/../generic/tkInt.h:885: error: syntax error before '*' token
/opt/local/var/macports/build/_opt_local_var_macports_sources_rsync.macports.org_release_ports_x11_tk/work/tk8.5.6/unix/../generic/tkInt.h:885: warning: data definition has no type or storage class
/opt/local/var/macports/build/_opt_local_var_macports_sources_rsync.macports.org_release_ports_x11_tk/work/tk8.5.6/unix/../generic/tkInt.h:951: error: syntax error before '*' token
In file included from /opt/local/var/macports/build/_opt_local_var_macports_sources_rsync.macports.org_release_ports_x11_tk/work/tk8.5.6/unix/../generic/tkInt.h:957,
                 from /opt/local/var/macports/build/_opt_local_var_macports_sources_rsync.macports.org_release_ports_x11_tk/work/tk8.5.6/unix/../generic/tk3d.c:16:
/opt/local/var/macports/build/_opt_local_var_macports_sources_rsync.macports.org_release_ports_x11_tk/work/tk8.5.6/unix/../generic/tkIntDecls.h:40: error: syntax error before '*' token
/opt/local/var/macports/build/_opt_local_var_macports_sources_rsync.macports.org_release_ports_x11_tk/work/tk8.5.6/unix/../generic/tkIntDecls.h:40: error: syntax error before '*' token
/opt/local/var/macports/build/_opt_local_var_macports_sources_rsync.macports.org_release_ports_x11_tk/work/tk8.5.6/unix/../generic/tkIntDecls.h:41: warning: data definition has no type or storage class
/opt/local/var/macports/build/_opt_local_var_macports_sources_rsync.macports.org_release_ports_x11_tk/work/tk8.5.6/unix/../generic/tkIntDecls.h:54: error: syntax error before 'XPoint'
/opt/local/var/macports/build/_opt_local_var_macports_sources_rsync.macports.org_release_ports_x11_tk/work/tk8.5.6/unix/../generic/tkIntDecls.h:59: error: syntax error before '*' token
/opt/local/var/macports/build/_opt_local_var_macports_sources_rsync.macports.org_release_ports_x11_tk/work/tk8.5.6/unix/../generic/tkIntDecls.h:64: error: syntax error before '*' token
/opt/local/var/macports/build/_opt_local_var_macports_sources_rsync.macports.org_release_ports_x11_tk/work/tk8.5.6/unix/../generic/tkIntDecls.h:80: error: syntax error before '*' token
/opt/local/var/macports/build/_opt_local_var_macports_sources_rsync.macports.org_release_ports_x11_tk/work/tk8.5.6/unix/../generic/tkIntDecls.h:86: error: syntax error before 'TkDisplay'
/opt/local/var/macports/build/_opt_local_var_macports_sources_rsync.macports.org_release_ports_x11_tk/work/tk8.5.6/unix/../generic/tkIntDecls.h:114: error: syntax error before '*' token
/opt/local/var/macports/build/_opt_local_var_macports_sources_rsync.macports.org_release_ports_x11_tk/work/tk8.5.6/unix/../generic/tkIntDecls.h:117: error: syntax error before 'XColor'
/opt/local/var/macports/build/_opt_local_var_macports_sources_rsync.macports.org_release_ports_x11_tk/work/tk8.5.6/unix/../generic/tkIntDecls.h:117: warning: data definition has no type or storage class
/opt/local/var/macports/build/_opt_local_var_macports_sources_rsync.macports.org_release_ports_x11_tk/work/tk8.5.6/unix/../generic/tkIntDecls.h:135: error: syntax error before 'TkCurrentTime'
/opt/local/var/macports/build/_opt_local_var_macports_sources_rsync.macports.org_release_ports_x11_tk/work/tk8.5.6/unix/../generic/tkIntDecls.h:135: error: syntax error before '*' token
/opt/local/var/macports/build/_opt_local_var_macports_sources_rsync.macports.org_release_ports_x11_tk/work/tk8.5.6/unix/../generic/tkIntDecls.h:135: warning: data definition has no type or storage class
/opt/local/var/macports/build/_opt_local_var_macports_sources_rsync.macports.org_release_ports_x11_tk/work/tk8.5.6/unix/../generic/tkIntDecls.h:145: error: syntax error before '*' token
/opt/local/var/macports/build/_opt_local_var_macports_sources_rsync.macports.org_release_ports_x11_tk/work/tk8.5.6/unix/../generic/tkIntDecls.h:150: error: syntax error before 'GC'
/opt/local/var/macports/build/_opt_local_var_macports_sources_rsync.macports.org_release_ports_x11_tk/work/tk8.5.6/unix/../generic/tkIntDecls.h:156: error: syntax error before '*' token
/opt/local/var/macports/build/_opt_local_var_macports_sources_rsync.macports.org_release_ports_x11_tk/work/tk8.5.6/unix/../generic/tkIntDecls.h:162: error: syntax error before 'Display'
/opt/local/var/macports/build/_opt_local_var_macports_sources_rsync.macports.org_release_ports_x11_tk/work/tk8.5.6/unix/../generic/tkIntDecls.h:182: error: syntax error before '*' token
/opt/local/var/macports/build/_opt_local_var_macports_sources_rsync.macports.org_release_ports_x11_tk/work/tk8.5.6/unix/../generic/tkIntDecls.h:187: error: syntax error before '*' token
/opt/local/var/macports/build/_opt_local_var_macports_sources_rsync.macports.org_release_ports_x11_tk/work/tk8.5.6/unix/../generic/tkIntDecls.h:193: error: syntax error before '*' token
/opt/local/var/macports/build/_opt_local_var_macports_sources_rsync.macports.org_release_ports_x11_tk/work/tk8.5.6/unix/../generic/tkIntDecls.h:193: error: syntax error before '*' token
/opt/local/var/macports/build/_opt_local_var_macports_sources_rsync.macports.org_release_ports_x11_tk/work/tk8.5.6/unix/../generic/tkIntDecls.h:194: warning: data definition has no type or storage class
/opt/local/var/macports/build/_opt_local_var_macports_sources_rsync.macports.org_release_ports_x11_tk/work/tk8.5.6/unix/../generic/tkIntDecls.h:209: error: syntax error before '*' token
/opt/local/var/macports/build/_opt_local_var_macports_sources_rsync.macports.org_release_ports_x11_tk/work/tk8.5.6/unix/../generic/tkIntDecls.h:214: error: syntax error before '*' token
/opt/local/var/macports/build/_opt_local_var_macports_sources_rsync.macports.org_release_ports_x11_tk/work/tk8.5.6/unix/../generic/tkIntDecls.h:234: error: syntax error before '*' token
/opt/local/var/macports/build/_opt_local_var_macports_sources_rsync.macports.org_release_ports_x11_tk/work/tk8.5.6/unix/../generic/tkIntDecls.h:235: warning: data definition has no type or storage class
/opt/local/var/macports/build/_opt_local_var_macports_sources_rsync.macports.org_release_ports_x11_tk/work/tk8.5.6/unix/../generic/tkIntDecls.h:246: error: syntax error before '*' token
/opt/local/var/macports/build/_opt_local_var_macports_sources_rsync.macports.org_release_ports_x11_tk/work/tk8.5.6/unix/../generic/tkIntDecls.h:246: error: syntax error before '*' token
/opt/local/var/macports/build/_opt_local_var_macports_sources_rsync.macports.org_release_ports_x11_tk/work/tk8.5.6/unix/../generic/tkIntDecls.h:246: warning: data definition has no type or storage class
/opt/local/var/macports/build/_opt_local_var_macports_sources_rsync.macports.org_release_ports_x11_tk/work/tk8.5.6/unix/../generic/tkIntDecls.h:257: error: syntax error before '*' token
/opt/local/var/macports/build/_opt_local_var_macports_sources_rsync.macports.org_release_ports_x11_tk/work/tk8.5.6/unix/../generic/tkIntDecls.h:257: error: syntax error before '*' token
/opt/local/var/macports/build/_opt_local_var_macports_sources_rsync.macports.org_release_ports_x11_tk/work/tk8.5.6/unix/../generic/tkIntDecls.h:257: warning: data definition has no type or storage class
/opt/local/var/macports/build/_opt_local_var_macports_sources_rsync.macports.org_release_ports_x11_tk/work/tk8.5.6/unix/../generic/tkIntDecls.h:287: error: syntax error before '*' token
/opt/local/var/macports/build/_opt_local_var_macports_sources_rsync.macports.org_release_ports_x11_tk/work/tk8.5.6/unix/../generic/tkIntDecls.h:292: error: syntax error before '*' token
/opt/local/var/macports/build/_opt_local_var_macports_sources_rsync.macports.org_release_ports_x11_tk/work/tk8.5.6/unix/../generic/tkIntDecls.h:302: error: syntax error before '*' token
/opt/local/var/macports/build/_opt_local_var_macports_sources_rsync.macports.org_release_ports_x11_tk/work/tk8.5.6/unix/../generic/tkIntDecls.h:315: error: syntax error before 'keysym'
/opt/local/var/macports/build/_opt_local_var_macports_sources_rsync.macports.org_release_ports_x11_tk/work/tk8.5.6/unix/../generic/tkIntDecls.h:334: error: syntax error before 'XPoint'
/opt/local/var/macports/build/_opt_local_var_macports_sources_rsync.macports.org_release_ports_x11_tk/work/tk8.5.6/unix/../generic/tkIntDecls.h:347: error: syntax error before '*' token
/opt/local/var/macports/build/_opt_local_var_macports_sources_rsync.macports.org_release_ports_x11_tk/work/tk8.5.6/unix/../generic/tkIntDecls.h:352: error: syntax error before '*' token
/opt/local/var/macports/build/_opt_local_var_macports_sources_rsync.macports.org_release_ports_x11_tk/work/tk8.5.6/unix/../generic/tkIntDecls.h:368: error: syntax error before '*' token
/opt/local/var/macports/build/_opt_local_var_macports_sources_rsync.macports.org_release_ports_x11_tk/work/tk8.5.6/unix/../generic/tkIntDecls.h:373: error: syntax error before '*' token
/opt/local/var/macports/build/_opt_local_var_macports_sources_rsync.macports.org_release_ports_x11_tk/work/tk8.5.6/unix/../generic/tkIntDecls.h:378: error: syntax error before '*' token
/opt/local/var/macports/build/_opt_local_var_macports_sources_rsync.macports.org_release_ports_x11_tk/work/tk8.5.6/unix/../generic/tkIntDecls.h:395: error: syntax error before '*' token
/opt/local/var/macports/build/_opt_local_var_macports_sources_rsync.macports.org_release_ports_x11_tk/work/tk8.5.6/unix/../generic/tkIntDecls.h:395: error: syntax error before '*' token
/opt/local/var/macports/build/_opt_local_var_macports_sources_rsync.macports.org_release_ports_x11_tk/work/tk8.5.6/unix/../generic/tkIntDecls.h:395: warning: data definition has no type or storage class
/opt/local/var/macports/build/_opt_local_var_macports_sources_rsync.macports.org_release_ports_x11_tk/work/tk8.5.6/unix/../generic/tkIntDecls.h:400: error: syntax error before '*' token
/opt/local/var/macports/build/_opt_local_var_macports_sources_rsync.macports.org_release_ports_x11_tk/work/tk8.5.6/unix/../generic/tkIntDecls.h:400: error: syntax error before '*' token
/opt/local/var/macports/build/_opt_local_var_macports_sources_rsync.macports.org_release_ports_x11_tk/work/tk8.5.6/unix/../generic/tkIntDecls.h:400: warning: data definition has no type or storage class
/opt/local/var/macports/build/_opt_local_var_macports_sources_rsync.macports.org_release_ports_x11_tk/work/tk8.5.6/unix/../generic/tkIntDecls.h:426: error: syntax error before '*' token
/opt/local/var/macports/build/_opt_local_var_macports_sources_rsync.macports.org_release_ports_x11_tk/work/tk8.5.6/unix/../generic/tkIntDecls.h:426: error: 'TkpMakeWindow' declared as function returning a function
/opt/local/var/macports/build/_opt_local_var_macports_sources_rsync.macports.org_release_ports_x11_tk/work/tk8.5.6/unix/../generic/tkIntDecls.h:437: error: syntax error before '*' token
/opt/local/var/macports/build/_opt_local_var_macports_sources_rsync.macports.org_release_ports_x11_tk/work/tk8.5.6/unix/../generic/tkIntDecls.h:437: warning: data definition has no type or storage class
/opt/local/var/macports/build/_opt_local_var_macports_sources_rsync.macports.org_release_ports_x11_tk/work/tk8.5.6/unix/../generic/tkIntDecls.h:442: error: syntax error before '*' token
/opt/local/var/macports/build/_opt_local_var_macports_sources_rsync.macports.org_release_ports_x11_tk/work/tk8.5.6/unix/../generic/tkIntDecls.h:459: error: syntax error before '*' token
/opt/local/var/macports/build/_opt_local_var_macports_sources_rsync.macports.org_release_ports_x11_tk/work/tk8.5.6/unix/../generic/tkIntDecls.h:465: error: syntax error before '*' token
/opt/local/var/macports/build/_opt_local_var_macports_sources_rsync.macports.org_release_ports_x11_tk/work/tk8.5.6/unix/../generic/tkIntDecls.h:484: error: syntax error before 'TkDisplay'
/opt/local/var/macports/build/_opt_local_var_macports_sources_rsync.macports.org_release_ports_x11_tk/work/tk8.5.6/unix/../generic/tkIntDecls.h:489: error: syntax error before '*' token
/opt/local/var/macports/build/_opt_local_var_macports_sources_rsync.macports.org_release_ports_x11_tk/work/tk8.5.6/unix/../generic/tkIntDecls.h:495: error: syntax error before '*' token
/opt/local/var/macports/build/_opt_local_var_macports_sources_rsync.macports.org_release_ports_x11_tk/work/tk8.5.6/unix/../generic/tkIntDecls.h:505: error: syntax error before 'GC'
/opt/local/var/macports/build/_opt_local_var_macports_sources_rsync.macports.org_release_ports_x11_tk/work/tk8.5.6/unix/../generic/tkIntDecls.h:512: error: syntax error before '*' token
/opt/local/var/macports/build/_opt_local_var_macports_sources_rsync.macports.org_release_ports_x11_tk/work/tk8.5.6/unix/../generic/tkIntDecls.h:517: error: syntax error before 'XEvent'
/opt/local/var/macports/build/_opt_local_var_macports_sources_rsync.macports.org_release_ports_x11_tk/work/tk8.5.6/unix/../generic/tkIntDecls.h:527: error: syntax error before '*' token
/opt/local/var/macports/build/_opt_local_var_macports_sources_rsync.macports.org_release_ports_x11_tk/work/tk8.5.6/unix/../generic/tkIntDecls.h:540: error: syntax error before 'TkStringToKeysym'
/opt/local/var/macports/build/_opt_local_var_macports_sources_rsync.macports.org_release_ports_x11_tk/work/tk8.5.6/unix/../generic/tkIntDecls.h:540: warning: data definition has no type or storage class
/opt/local/var/macports/build/_opt_local_var_macports_sources_rsync.macports.org_release_ports_x11_tk/work/tk8.5.6/unix/../generic/tkIntDecls.h:552: error: syntax error before '*' token
/opt/local/var/macports/build/_opt_local_var_macports_sources_rsync.macports.org_release_ports_x11_tk/work/tk8.5.6/unix/../generic/tkIntDecls.h:557: error: syntax error before '*' token
/opt/local/var/macports/build/_opt_local_var_macports_sources_rsync.macports.org_release_ports_x11_tk/work/tk8.5.6/unix/../generic/tkIntDecls.h:562: error: syntax error before '*' token
/opt/local/var/macports/build/_opt_local_var_macports_sources_rsync.macports.org_release_ports_x11_tk/work/tk8.5.6/unix/../generic/tkIntDecls.h:562: error: syntax error before '*' token
/opt/local/var/macports/build/_opt_local_var_macports_sources_rsync.macports.org_release_ports_x11_tk/work/tk8.5.6/unix/../generic/tkIntDecls.h:562: warning: data definition has no type or storage class
/opt/local/var/macports/build/_opt_local_var_macports_sources_rsync.macports.org_release_ports_x11_tk/work/tk8.5.6/unix/../generic/tkIntDecls.h:567: error: syntax error before '*' token
/opt/local/var/macports/build/_opt_local_var_macports_sources_rsync.macports.org_release_ports_x11_tk/work/tk8.5.6/unix/../generic/tkIntDecls.h:572: error: syntax error before '*' token
/opt/local/var/macports/build/_opt_local_var_macports_sources_rsync.macports.org_release_ports_x11_tk/work/tk8.5.6/unix/../generic/tkIntDecls.h:577: error: syntax error before '*' token
/opt/local/var/macports/build/_opt_local_var_macports_sources_rsync.macports.org_release_ports_x11_tk/work/tk8.5.6/unix/../generic/tkIntDecls.h:583: error: syntax error before '*' token
/opt/local/var/macports/build/_opt_local_var_macports_sources_rsync.macports.org_release_ports_x11_tk/work/tk8.5.6/unix/../generic/tkIntDecls.h:588: error: syntax error before '*' token
/opt/local/var/macports/build/_opt_local_var_macports_sources_rsync.macports.org_release_ports_x11_tk/work/tk8.5.6/unix/../generic/tkIntDecls.h:594: error: syntax error before '*' token
/opt/local/var/macports/build/_opt_local_var_macports_sources_rsync.macports.org_release_ports_x11_tk/work/tk8.5.6/unix/../generic/tkIntDecls.h:599: error: syntax error before '*' token
/opt/local/var/macports/build/_opt_local_var_macports_sources_rsync.macports.org_release_ports_x11_tk/work/tk8.5.6/unix/../generic/tkIntDecls.h:647: error: syntax error before '*' token
/opt/local/var/macports/build/_opt_local_var_macports_sources_rsync.macports.org_release_ports_x11_tk/work/tk8.5.6/unix/../generic/tkIntDecls.h:647: warning: data definition has no type or storage class
/opt/local/var/macports/build/_opt_local_var_macports_sources_rsync.macports.org_release_ports_x11_tk/work/tk8.5.6/unix/../generic/tkIntDecls.h:664: error: syntax error before '*' token
/opt/local/var/macports/build/_opt_local_var_macports_sources_rsync.macports.org_release_ports_x11_tk/work/tk8.5.6/unix/../generic/tkIntDecls.h:825: error: syntax error before 'GC'
/opt/local/var/macports/build/_opt_local_var_macports_sources_rsync.macports.org_release_ports_x11_tk/work/tk8.5.6/unix/../generic/tkIntDecls.h:832: error: syntax error before '*' token
/opt/local/var/macports/build/_opt_local_var_macports_sources_rsync.macports.org_release_ports_x11_tk/work/tk8.5.6/unix/../generic/tkIntDecls.h:838: error: syntax error before 'KeySym'
/opt/local/var/macports/build/_opt_local_var_macports_sources_rsync.macports.org_release_ports_x11_tk/work/tk8.5.6/unix/../generic/tkIntDecls.h:843: error: syntax error before 'TkpGetKeySym'
/opt/local/var/macports/build/_opt_local_var_macports_sources_rsync.macports.org_release_ports_x11_tk/work/tk8.5.6/unix/../generic/tkIntDecls.h:843: error: syntax error before '*' token
/opt/local/var/macports/build/_opt_local_var_macports_sources_rsync.macports.org_release_ports_x11_tk/work/tk8.5.6/unix/../generic/tkIntDecls.h:843: warning: data definition has no type or storage class
/opt/local/var/macports/build/_opt_local_var_macports_sources_rsync.macports.org_release_ports_x11_tk/work/tk8.5.6/unix/../generic/tkIntDecls.h:848: error: syntax error before '*' token
/opt/local/var/macports/build/_opt_local_var_macports_sources_rsync.macports.org_release_ports_x11_tk/work/tk8.5.6/unix/../generic/tkIntDecls.h:858: error: syntax error before '*' token
/opt/local/var/macports/build/_opt_local_var_macports_sources_rsync.macports.org_release_ports_x11_tk/work/tk8.5.6/unix/../generic/tkIntDecls.h:858: error: syntax error before '*' token
/opt/local/var/macports/build/_opt_local_var_macports_sources_rsync.macports.org_release_ports_x11_tk/work/tk8.5.6/unix/../generic/tkIntDecls.h:858: warning: data definition has no type or storage class
/opt/local/var/macports/build/_opt_local_var_macports_sources_rsync.macports.org_release_ports_x11_tk/work/tk8.5.6/unix/../generic/tkIntDecls.h:868: error: syntax error before '*' token
/opt/local/var/macports/build/_opt_local_var_macports_sources_rsync.macports.org_release_ports_x11_tk/work/tk8.5.6/unix/../generic/tkIntDecls.h:873: error: syntax error before '*' token
/opt/local/var/macports/build/_opt_local_var_macports_sources_rsync.macports.org_release_ports_x11_tk/work/tk8.5.6/unix/../generic/tkIntDecls.h:918: error: syntax error before 'XPoint'
/opt/local/var/macports/build/_opt_local_var_macports_sources_rsync.macports.org_release_ports_x11_tk/work/tk8.5.6/unix/../generic/tkIntDecls.h:966: error: syntax error before 'TkWindow'
/opt/local/var/macports/build/_opt_local_var_macports_sources_rsync.macports.org_release_ports_x11_tk/work/tk8.5.6/unix/../generic/tkIntDecls.h:966: warning: no semicolon at end of struct or union
/opt/local/var/macports/build/_opt_local_var_macports_sources_rsync.macports.org_release_ports_x11_tk/work/tk8.5.6/unix/../generic/tkIntDecls.h:968: error: syntax error before 'XPoint'
/opt/local/var/macports/build/_opt_local_var_macports_sources_rsync.macports.org_release_ports_x11_tk/work/tk8.5.6/unix/../generic/tkIntDecls.h:969: error: syntax error before '*' token
/opt/local/var/macports/build/_opt_local_var_macports_sources_rsync.macports.org_release_ports_x11_tk/work/tk8.5.6/unix/../generic/tkIntDecls.h:970: error: syntax error before '*' token
/opt/local/var/macports/build/_opt_local_var_macports_sources_rsync.macports.org_release_ports_x11_tk/work/tk8.5.6/unix/../generic/tkIntDecls.h:973: error: syntax error before '*' token
/opt/local/var/macports/build/_opt_local_var_macports_sources_rsync.macports.org_release_ports_x11_tk/work/tk8.5.6/unix/../generic/tkIntDecls.h:974: error: syntax error before 'TkDisplay'
/opt/local/var/macports/build/_opt_local_var_macports_sources_rsync.macports.org_release_ports_x11_tk/work/tk8.5.6/unix/../generic/tkIntDecls.h:978: error: syntax error before '*' token
/opt/local/var/macports/build/_opt_local_var_macports_sources_rsync.macports.org_release_ports_x11_tk/work/tk8.5.6/unix/../generic/tkIntDecls.h:978: error: syntax error before 'XColor'
/opt/local/var/macports/build/_opt_local_var_macports_sources_rsync.macports.org_release_ports_x11_tk/work/tk8.5.6/unix/../generic/tkIntDecls.h:978: warning: data definition has no type or storage class
/opt/local/var/macports/build/_opt_local_var_macports_sources_rsync.macports.org_release_ports_x11_tk/work/tk8.5.6/unix/../generic/tkIntDecls.h:981: error: syntax error before '*' token
/opt/local/var/macports/build/_opt_local_var_macports_sources_rsync.macports.org_release_ports_x11_tk/work/tk8.5.6/unix/../generic/tkIntDecls.h:981: error: syntax error before '*' token
/opt/local/var/macports/build/_opt_local_var_macports_sources_rsync.macports.org_release_ports_x11_tk/work/tk8.5.6/unix/../generic/tkIntDecls.h:981: error: 'Time' declared as function returning a function
/opt/local/var/macports/build/_opt_local_var_macports_sources_rsync.macports.org_release_ports_x11_tk/work/tk8.5.6/unix/../generic/tkIntDecls.h:981: warning: data definition has no type or storage class
/opt/local/var/macports/build/_opt_local_var_macports_sources_rsync.macports.org_release_ports_x11_tk/work/tk8.5.6/unix/../generic/tkIntDecls.h:983: error: syntax error before '*' token
/opt/local/var/macports/build/_opt_local_var_macports_sources_rsync.macports.org_release_ports_x11_tk/work/tk8.5.6/unix/../generic/tkIntDecls.h:984: error: syntax error before 'GC'
/opt/local/var/macports/build/_opt_local_var_macports_sources_rsync.macports.org_release_ports_x11_tk/work/tk8.5.6/unix/../generic/tkIntDecls.h:985: error: syntax error before '*' token
/opt/local/var/macports/build/_opt_local_var_macports_sources_rsync.macports.org_release_ports_x11_tk/work/tk8.5.6/unix/../generic/tkIntDecls.h:986: error: syntax error before 'Display'
/opt/local/var/macports/build/_opt_local_var_macports_sources_rsync.macports.org_release_ports_x11_tk/work/tk8.5.6/unix/../generic/tkIntDecls.h:989: error: syntax error before '*' token
/opt/local/var/macports/build/_opt_local_var_macports_sources_rsync.macports.org_release_ports_x11_tk/work/tk8.5.6/unix/../generic/tkIntDecls.h:990: error: syntax error before '*' token
/opt/local/var/macports/build/_opt_local_var_macports_sources_rsync.macports.org_release_ports_x11_tk/work/tk8.5.6/unix/../generic/tkIntDecls.h:991: error: syntax error before '*' token
/opt/local/var/macports/build/_opt_local_var_macports_sources_rsync.macports.org_release_ports_x11_tk/work/tk8.5.6/unix/../generic/tkIntDecls.h:991: error: syntax error before '*' token
/opt/local/var/macports/build/_opt_local_var_macports_sources_rsync.macports.org_release_ports_x11_tk/work/tk8.5.6/unix/../generic/tkIntDecls.h:991: warning: data definition has no type or storage class
/opt/local/var/macports/build/_opt_local_var_macports_sources_rsync.macports.org_release_ports_x11_tk/work/tk8.5.6/unix/../generic/tkIntDecls.h:994: error: syntax error before '*' token
/opt/local/var/macports/build/_opt_local_var_macports_sources_rsync.macports.org_release_ports_x11_tk/work/tk8.5.6/unix/../generic/tkIntDecls.h:995: error: syntax error before '*' token
/opt/local/var/macports/build/_opt_local_var_macports_sources_rsync.macports.org_release_ports_x11_tk/work/tk8.5.6/unix/../generic/tkIntDecls.h:998: error: syntax error before '*' token
/opt/local/var/macports/build/_opt_local_var_macports_sources_rsync.macports.org_release_ports_x11_tk/work/tk8.5.6/unix/../generic/tkIntDecls.h:998: warning: data definition has no type or storage class
/opt/local/var/macports/build/_opt_local_var_macports_sources_rsync.macports.org_release_ports_x11_tk/work/tk8.5.6/unix/../generic/tkIntDecls.h:1000: error: syntax error before '*' token
/opt/local/var/macports/build/_opt_local_var_macports_sources_rsync.macports.org_release_ports_x11_tk/work/tk8.5.6/unix/../generic/tkIntDecls.h:1000: error: syntax error before '*' token
/opt/local/var/macports/build/_opt_local_var_macports_sources_rsync.macports.org_release_ports_x11_tk/work/tk8.5.6/unix/../generic/tkIntDecls.h:1000: warning: data definition has no type or storage class
/opt/local/var/macports/build/_opt_local_var_macports_sources_rsync.macports.org_release_ports_x11_tk/work/tk8.5.6/unix/../generic/tkIntDecls.h:1002: error: syntax error before '*' token
/opt/local/var/macports/build/_opt_local_var_macports_sources_rsync.macports.org_release_ports_x11_tk/work/tk8.5.6/unix/../generic/tkIntDecls.h:1002: error: syntax error before '*' token
/opt/local/var/macports/build/_opt_local_var_macports_sources_rsync.macports.org_release_ports_x11_tk/work/tk8.5.6/unix/../generic/tkIntDecls.h:1002: warning: data definition has no type or storage class
/opt/local/var/macports/build/_opt_local_var_macports_sources_rsync.macports.org_release_ports_x11_tk/work/tk8.5.6/unix/../generic/tkIntDecls.h:1007: error: syntax error before '*' token
/opt/local/var/macports/build/_opt_local_var_macports_sources_rsync.macports.org_release_ports_x11_tk/work/tk8.5.6/unix/../generic/tkIntDecls.h:1008: error: syntax error before '*' token
/opt/local/var/macports/build/_opt_local_var_macports_sources_rsync.macports.org_release_ports_x11_tk/work/tk8.5.6/unix/../generic/tkIntDecls.h:1010: error: syntax error before '*' token
/opt/local/var/macports/build/_opt_local_var_macports_sources_rsync.macports.org_release_ports_x11_tk/work/tk8.5.6/unix/../generic/tkIntDecls.h:1012: error: syntax error before 'keysym'
/opt/local/var/macports/build/_opt_local_var_macports_sources_rsync.macports.org_release_ports_x11_tk/work/tk8.5.6/unix/../generic/tkIntDecls.h:1015: error: syntax error before 'XPoint'
/opt/local/var/macports/build/_opt_local_var_macports_sources_rsync.macports.org_release_ports_x11_tk/work/tk8.5.6/unix/../generic/tkIntDecls.h:1017: error: syntax error before '*' token
/opt/local/var/macports/build/_opt_local_var_macports_sources_rsync.macports.org_release_ports_x11_tk/work/tk8.5.6/unix/../generic/tkIntDecls.h:1018: error: syntax error before '*' token
/opt/local/var/macports/build/_opt_local_var_macports_sources_rsync.macports.org_release_ports_x11_tk/work/tk8.5.6/unix/../generic/tkIntDecls.h:1021: error: syntax error before '*' token
/opt/local/var/macports/build/_opt_local_var_macports_sources_rsync.macports.org_release_ports_x11_tk/work/tk8.5.6/unix/../generic/tkIntDecls.h:1022: error: syntax error before '*' token
/opt/local/var/macports/build/_opt_local_var_macports_sources_rsync.macports.org_release_ports_x11_tk/work/tk8.5.6/unix/../generic/tkIntDecls.h:1023: error: syntax error before '*' token
/opt/local/var/macports/build/_opt_local_var_macports_sources_rsync.macports.org_release_ports_x11_tk/work/tk8.5.6/unix/../generic/tkIntDecls.h:1026: error: syntax error before '*' token
/opt/local/var/macports/build/_opt_local_var_macports_sources_rsync.macports.org_release_ports_x11_tk/work/tk8.5.6/unix/../generic/tkIntDecls.h:1026: error: syntax error before '*' token
/opt/local/var/macports/build/_opt_local_var_macports_sources_rsync.macports.org_release_ports_x11_tk/work/tk8.5.6/unix/../generic/tkIntDecls.h:1026: warning: data definition has no type or storage class
/opt/local/var/macports/build/_opt_local_var_macports_sources_rsync.macports.org_release_ports_x11_tk/work/tk8.5.6/unix/../generic/tkIntDecls.h:1027: error: syntax error before '*' token
/opt/local/var/macports/build/_opt_local_var_macports_sources_rsync.macports.org_release_ports_x11_tk/work/tk8.5.6/unix/../generic/tkIntDecls.h:1027: error: syntax error before '*' token
/opt/local/var/macports/build/_opt_local_var_macports_sources_rsync.macports.org_release_ports_x11_tk/work/tk8.5.6/unix/../generic/tkIntDecls.h:1027: warning: data definition has no type or storage class
/opt/local/var/macports/build/_opt_local_var_macports_sources_rsync.macports.org_release_ports_x11_tk/work/tk8.5.6/unix/../generic/tkIntDecls.h:1032: error: syntax error before '*' token
/opt/local/var/macports/build/_opt_local_var_macports_sources_rsync.macports.org_release_ports_x11_tk/work/tk8.5.6/unix/../generic/tkIntDecls.h:1032: error: 'tkpMakeWindow' declared as function returning a function
/opt/local/var/macports/build/_opt_local_var_macports_sources_rsync.macports.org_release_ports_x11_tk/work/tk8.5.6/unix/../generic/tkIntDecls.h:1034: error: syntax error before '*' token
/opt/local/var/macports/build/_opt_local_var_macports_sources_rsync.macports.org_release_ports_x11_tk/work/tk8.5.6/unix/../generic/tkIntDecls.h:1034: warning: data definition has no type or storage class
/opt/local/var/macports/build/_opt_local_var_macports_sources_rsync.macports.org_release_ports_x11_tk/work/tk8.5.6/unix/../generic/tkIntDecls.h:1035: error: syntax error before '*' token
/opt/local/var/macports/build/_opt_local_var_macports_sources_rsync.macports.org_release_ports_x11_tk/work/tk8.5.6/unix/../generic/tkIntDecls.h:1038: error: syntax error before '*' token
/opt/local/var/macports/build/_opt_local_var_macports_sources_rsync.macports.org_release_ports_x11_tk/work/tk8.5.6/unix/../generic/tkIntDecls.h:1039: error: syntax error before '*' token
/opt/local/var/macports/build/_opt_local_var_macports_sources_rsync.macports.org_release_ports_x11_tk/work/tk8.5.6/unix/../generic/tkIntDecls.h:1042: error: syntax error before 'TkDisplay'
/opt/local/var/macports/build/_opt_local_var_macports_sources_rsync.macports.org_release_ports_x11_tk/work/tk8.5.6/unix/../generic/tkIntDecls.h:1043: error: syntax error before '*' token
/opt/local/var/macports/build/_opt_local_var_macports_sources_rsync.macports.org_release_ports_x11_tk/work/tk8.5.6/unix/../generic/tkIntDecls.h:1044: error: syntax error before '*' token
/opt/local/var/macports/build/_opt_local_var_macports_sources_rsync.macports.org_release_ports_x11_tk/work/tk8.5.6/unix/../generic/tkIntDecls.h:1045: error: syntax error before 'GC'
/opt/local/var/macports/build/_opt_local_var_macports_sources_rsync.macports.org_release_ports_x11_tk/work/tk8.5.6/unix/../generic/tkIntDecls.h:1046: error: syntax error before '*' token
/opt/local/var/macports/build/_opt_local_var_macports_sources_rsync.macports.org_release_ports_x11_tk/work/tk8.5.6/unix/../generic/tkIntDecls.h:1047: error: syntax error before 'XEvent'
/opt/local/var/macports/build/_opt_local_var_macports_sources_rsync.macports.org_release_ports_x11_tk/work/tk8.5.6/unix/../generic/tkIntDecls.h:1049: error: syntax error before '*' token
/opt/local/var/macports/build/_opt_local_var_macports_sources_rsync.macports.org_release_ports_x11_tk/work/tk8.5.6/unix/../generic/tkIntDecls.h:1052: error: syntax error before '*' token
/opt/local/var/macports/build/_opt_local_var_macports_sources_rsync.macports.org_release_ports_x11_tk/work/tk8.5.6/unix/../generic/tkIntDecls.h:1052: error: 'KeySym' declared as function returning a function
/opt/local/var/macports/build/_opt_local_var_macports_sources_rsync.macports.org_release_ports_x11_tk/work/tk8.5.6/unix/../generic/tkIntDecls.h:1052: warning: data definition has no type or storage class
/opt/local/var/macports/build/_opt_local_var_macports_sources_rsync.macports.org_release_ports_x11_tk/work/tk8.5.6/unix/../generic/tkIntDecls.h:1054: error: syntax error before '*' token
/opt/local/var/macports/build/_opt_local_var_macports_sources_rsync.macports.org_release_ports_x11_tk/work/tk8.5.6/unix/../generic/tkIntDecls.h:1055: error: syntax error before '*' token
/opt/local/var/macports/build/_opt_local_var_macports_sources_rsync.macports.org_release_ports_x11_tk/work/tk8.5.6/unix/../generic/tkIntDecls.h:1056: error: syntax error before '*' token
/opt/local/var/macports/build/_opt_local_var_macports_sources_rsync.macports.org_release_ports_x11_tk/work/tk8.5.6/unix/../generic/tkIntDecls.h:1056: error: syntax error before '*' token
/opt/local/var/macports/build/_opt_local_var_macports_sources_rsync.macports.org_release_ports_x11_tk/work/tk8.5.6/unix/../generic/tkIntDecls.h:1056: warning: data definition has no type or storage class
/opt/local/var/macports/build/_opt_local_var_macports_sources_rsync.macports.org_release_ports_x11_tk/work/tk8.5.6/unix/../generic/tkIntDecls.h:1057: error: syntax error before '*' token
/opt/local/var/macports/build/_opt_local_var_macports_sources_rsync.macports.org_release_ports_x11_tk/work/tk8.5.6/unix/../generic/tkIntDecls.h:1058: error: syntax error before '*' token
/opt/local/var/macports/build/_opt_local_var_macports_sources_rsync.macports.org_release_ports_x11_tk/work/tk8.5.6/unix/../generic/tkIntDecls.h:1059: error: syntax error before '*' token
/opt/local/var/macports/build/_opt_local_var_macports_sources_rsync.macports.org_release_ports_x11_tk/work/tk8.5.6/unix/../generic/tkIntDecls.h:1060: error: syntax error before '*' token
/opt/local/var/macports/build/_opt_local_var_macports_sources_rsync.macports.org_release_ports_x11_tk/work/tk8.5.6/unix/../generic/tkIntDecls.h:1061: error: syntax error before '*' token
/opt/local/var/macports/build/_opt_local_var_macports_sources_rsync.macports.org_release_ports_x11_tk/work/tk8.5.6/unix/../generic/tkIntDecls.h:1062: error: syntax error before '*' token
/opt/local/var/macports/build/_opt_local_var_macports_sources_rsync.macports.org_release_ports_x11_tk/work/tk8.5.6/unix/../generic/tkIntDecls.h:1063: error: syntax error before '*' token
/opt/local/var/macports/build/_opt_local_var_macports_sources_rsync.macports.org_release_ports_x11_tk/work/tk8.5.6/unix/../generic/tkIntDecls.h:1072: error: syntax error before '*' token
/opt/local/var/macports/build/_opt_local_var_macports_sources_rsync.macports.org_release_ports_x11_tk/work/tk8.5.6/unix/../generic/tkIntDecls.h:1072: warning: data definition has no type or storage class
/opt/local/var/macports/build/_opt_local_var_macports_sources_rsync.macports.org_release_ports_x11_tk/work/tk8.5.6/unix/../generic/tkIntDecls.h:1075: error: syntax error before '*' token
/opt/local/var/macports/build/_opt_local_var_macports_sources_rsync.macports.org_release_ports_x11_tk/work/tk8.5.6/unix/../generic/tkIntDecls.h:1191: error: syntax error before 'GC'
/opt/local/var/macports/build/_opt_local_var_macports_sources_rsync.macports.org_release_ports_x11_tk/work/tk8.5.6/unix/../generic/tkIntDecls.h:1192: error: syntax error before '*' token
/opt/local/var/macports/build/_opt_local_var_macports_sources_rsync.macports.org_release_ports_x11_tk/work/tk8.5.6/unix/../generic/tkIntDecls.h:1193: error: syntax error before 'KeySym'
/opt/local/var/macports/build/_opt_local_var_macports_sources_rsync.macports.org_release_ports_x11_tk/work/tk8.5.6/unix/../generic/tkIntDecls.h:1194: error: syntax error before '*' token
/opt/local/var/macports/build/_opt_local_var_macports_sources_rsync.macports.org_release_ports_x11_tk/work/tk8.5.6/unix/../generic/tkIntDecls.h:1194: error: syntax error before '*' token
/opt/local/var/macports/build/_opt_local_var_macports_sources_rsync.macports.org_release_ports_x11_tk/work/tk8.5.6/unix/../generic/tkIntDecls.h:1194: error: 'KeySym' declared as function returning a function
/opt/local/var/macports/build/_opt_local_var_macports_sources_rsync.macports.org_release_ports_x11_tk/work/tk8.5.6/unix/../generic/tkIntDecls.h:1194: warning: data definition has no type or storage class
/opt/local/var/macports/build/_opt_local_var_macports_sources_rsync.macports.org_release_ports_x11_tk/work/tk8.5.6/unix/../generic/tkIntDecls.h:1195: error: syntax error before '*' token
/opt/local/var/macports/build/_opt_local_var_macports_sources_rsync.macports.org_release_ports_x11_tk/work/tk8.5.6/unix/../generic/tkIntDecls.h:1197: error: syntax error before '*' token
/opt/local/var/macports/build/_opt_local_var_macports_sources_rsync.macports.org_release_ports_x11_tk/work/tk8.5.6/unix/../generic/tkIntDecls.h:1197: error: syntax error before '*' token
/opt/local/var/macports/build/_opt_local_var_macports_sources_rsync.macports.org_release_ports_x11_tk/work/tk8.5.6/unix/../generic/tkIntDecls.h:1197: warning: data definition has no type or storage class
/opt/local/var/macports/build/_opt_local_var_macports_sources_rsync.macports.org_release_ports_x11_tk/work/tk8.5.6/unix/../generic/tkIntDecls.h:1199: error: syntax error before '*' token
/opt/local/var/macports/build/_opt_local_var_macports_sources_rsync.macports.org_release_ports_x11_tk/work/tk8.5.6/unix/../generic/tkIntDecls.h:1200: error: syntax error before '*' token
/opt/local/var/macports/build/_opt_local_var_macports_sources_rsync.macports.org_release_ports_x11_tk/work/tk8.5.6/unix/../generic/tkIntDecls.h:1215: error: syntax error before 'XPoint'
/opt/local/var/macports/build/_opt_local_var_macports_sources_rsync.macports.org_release_ports_x11_tk/work/tk8.5.6/unix/../generic/tkIntDecls.h:1223: error: syntax error before '}' token
/opt/local/var/macports/build/_opt_local_var_macports_sources_rsync.macports.org_release_ports_x11_tk/work/tk8.5.6/unix/../generic/tkIntDecls.h:1223: warning: data definition has no type or storage class
/opt/local/var/macports/build/_opt_local_var_macports_sources_rsync.macports.org_release_ports_x11_tk/work/tk8.5.6/unix/../generic/tkIntDecls.h:1228: error: syntax error before '*' token
/opt/local/var/macports/build/_opt_local_var_macports_sources_rsync.macports.org_release_ports_x11_tk/work/tk8.5.6/unix/../generic/tkIntDecls.h:1228: warning: data definition has no type or storage class
In file included from /opt/local/var/macports/build/_opt_local_var_macports_sources_rsync.macports.org_release_ports_x11_tk/work/tk8.5.6/unix/../generic/tk3d.c:16:
/opt/local/var/macports/build/_opt_local_var_macports_sources_rsync.macports.org_release_ports_x11_tk/work/tk8.5.6/unix/../generic/tkInt.h:1154: error: syntax error before 'XImage'
/opt/local/var/macports/build/_opt_local_var_macports_sources_rsync.macports.org_release_ports_x11_tk/work/tk8.5.6/unix/../generic/tkInt.h:1175: error: syntax error before '*' token
/opt/local/var/macports/build/_opt_local_var_macports_sources_rsync.macports.org_release_ports_x11_tk/work/tk8.5.6/unix/../generic/tkInt.h:1175: warning: data definition has no type or storage class
/opt/local/var/macports/build/_opt_local_var_macports_sources_rsync.macports.org_release_ports_x11_tk/work/tk8.5.6/unix/../generic/tkInt.h:1191: error: syntax error before '*' token
/opt/local/var/macports/build/_opt_local_var_macports_sources_rsync.macports.org_release_ports_x11_tk/work/tk8.5.6/unix/../generic/tkInt.h:1192: error: syntax error before '*' token
/opt/local/var/macports/build/_opt_local_var_macports_sources_rsync.macports.org_release_ports_x11_tk/work/tk8.5.6/unix/../generic/tkInt.h:1194: error: syntax error before '*' token
/opt/local/var/macports/build/_opt_local_var_macports_sources_rsync.macports.org_release_ports_x11_tk/work/tk8.5.6/unix/../generic/tkInt.h:1202: error: syntax error before '*' token
In file included from /opt/local/var/macports/build/_opt_local_var_macports_sources_rsync.macports.org_release_ports_x11_tk/work/tk8.5.6/unix/../generic/tk3d.c:17:
/opt/local/var/macports/build/_opt_local_var_macports_sources_rsync.macports.org_release_ports_x11_tk/work/tk8.5.6/unix/../generic/tk3d.h:31: error: syntax error before 'Screen'
/opt/local/var/macports/build/_opt_local_var_macports_sources_rsync.macports.org_release_ports_x11_tk/work/tk8.5.6/unix/../generic/tk3d.h:31: warning: no semicolon at end of struct or union
/opt/local/var/macports/build/_opt_local_var_macports_sources_rsync.macports.org_release_ports_x11_tk/work/tk8.5.6/unix/../generic/tk3d.h:32: warning: data definition has no type or storage class
/opt/local/var/macports/build/_opt_local_var_macports_sources_rsync.macports.org_release_ports_x11_tk/work/tk8.5.6/unix/../generic/tk3d.h:36: error: syntax error before 'colormap'
/opt/local/var/macports/build/_opt_local_var_macports_sources_rsync.macports.org_release_ports_x11_tk/work/tk8.5.6/unix/../generic/tk3d.h:36: warning: data definition has no type or storage class
/opt/local/var/macports/build/_opt_local_var_macports_sources_rsync.macports.org_release_ports_x11_tk/work/tk8.5.6/unix/../generic/tk3d.h:50: error: syntax error before '*' token
/opt/local/var/macports/build/_opt_local_var_macports_sources_rsync.macports.org_release_ports_x11_tk/work/tk8.5.6/unix/../generic/tk3d.h:50: warning: data definition has no type or storage class
/opt/local/var/macports/build/_opt_local_var_macports_sources_rsync.macports.org_release_ports_x11_tk/work/tk8.5.6/unix/../generic/tk3d.h:52: error: syntax error before '*' token
/opt/local/var/macports/build/_opt_local_var_macports_sources_rsync.macports.org_release_ports_x11_tk/work/tk8.5.6/unix/../generic/tk3d.h:52: warning: data definition has no type or storage class
/opt/local/var/macports/build/_opt_local_var_macports_sources_rsync.macports.org_release_ports_x11_tk/work/tk8.5.6/unix/../generic/tk3d.h:55: error: syntax error before '*' token
/opt/local/var/macports/build/_opt_local_var_macports_sources_rsync.macports.org_release_ports_x11_tk/work/tk8.5.6/unix/../generic/tk3d.h:55: warning: data definition has no type or storage class
/opt/local/var/macports/build/_opt_local_var_macports_sources_rsync.macports.org_release_ports_x11_tk/work/tk8.5.6/unix/../generic/tk3d.h:59: error: syntax error before 'shadow'
/opt/local/var/macports/build/_opt_local_var_macports_sources_rsync.macports.org_release_ports_x11_tk/work/tk8.5.6/unix/../generic/tk3d.h:59: warning: data definition has no type or storage class
/opt/local/var/macports/build/_opt_local_var_macports_sources_rsync.macports.org_release_ports_x11_tk/work/tk8.5.6/unix/../generic/tk3d.h:62: error: syntax error before 'bgGC'
/opt/local/var/macports/build/_opt_local_var_macports_sources_rsync.macports.org_release_ports_x11_tk/work/tk8.5.6/unix/../generic/tk3d.h:62: warning: data definition has no type or storage class
/opt/local/var/macports/build/_opt_local_var_macports_sources_rsync.macports.org_release_ports_x11_tk/work/tk8.5.6/unix/../generic/tk3d.h:64: error: syntax error before 'darkGC'
/opt/local/var/macports/build/_opt_local_var_macports_sources_rsync.macports.org_release_ports_x11_tk/work/tk8.5.6/unix/../generic/tk3d.h:64: warning: data definition has no type or storage class
/opt/local/var/macports/build/_opt_local_var_macports_sources_rsync.macports.org_release_ports_x11_tk/work/tk8.5.6/unix/../generic/tk3d.h:67: error: syntax error before 'lightGC'
/opt/local/var/macports/build/_opt_local_var_macports_sources_rsync.macports.org_release_ports_x11_tk/work/tk8.5.6/unix/../generic/tk3d.h:67: warning: data definition has no type or storage class
/opt/local/var/macports/build/_opt_local_var_macports_sources_rsync.macports.org_release_ports_x11_tk/work/tk8.5.6/unix/../generic/tk3d.h:72: error: conflicting types for 'nextPtr'
/opt/local/var/macports/build/_opt_local_var_macports_sources_rsync.macports.org_release_ports_x11_tk/work/tk8.5.6/unix/../generic/tkInt.h:141: error: previous declaration of 'nextPtr' was here
/opt/local/var/macports/build/_opt_local_var_macports_sources_rsync.macports.org_release_ports_x11_tk/work/tk8.5.6/unix/../generic/tk3d.h:77: error: syntax error before '}' token
/opt/local/var/macports/build/_opt_local_var_macports_sources_rsync.macports.org_release_ports_x11_tk/work/tk8.5.6/unix/../generic/tk3d.h:77: warning: data definition has no type or storage class
/opt/local/var/macports/build/_opt_local_var_macports_sources_rsync.macports.org_release_ports_x11_tk/work/tk8.5.6/unix/../generic/tk3d.h:89: error: syntax error before '*' token
/opt/local/var/macports/build/_opt_local_var_macports_sources_rsync.macports.org_release_ports_x11_tk/work/tk8.5.6/unix/../generic/tk3d.h:89: warning: data definition has no type or storage class
/opt/local/var/macports/build/_opt_local_var_macports_sources_rsync.macports.org_release_ports_x11_tk/work/tk8.5.6/unix/../generic/tk3d.h:90: error: syntax error before '*' token
/opt/local/var/macports/build/_opt_local_var_macports_sources_rsync.macports.org_release_ports_x11_tk/work/tk8.5.6/unix/../generic/tk3d.h:91: error: syntax error before '*' token
/opt/local/var/macports/build/_opt_local_var_macports_sources_rsync.macports.org_release_ports_x11_tk/work/tk8.5.6/unix/../generic/tk3d.c:32: error: syntax error before '*' token
/opt/local/var/macports/build/_opt_local_var_macports_sources_rsync.macports.org_release_ports_x11_tk/work/tk8.5.6/unix/../generic/tk3d.c:36: error: syntax error before '*' token
/opt/local/var/macports/build/_opt_local_var_macports_sources_rsync.macports.org_release_ports_x11_tk/work/tk8.5.6/unix/../generic/tk3d.c:39: error: syntax error before '*' token
/opt/local/var/macports/build/_opt_local_var_macports_sources_rsync.macports.org_release_ports_x11_tk/work/tk8.5.6/unix/../generic/tk3d.c: In function 'Tk_Alloc3DBorderFromObj':
/opt/local/var/macports/build/_opt_local_var_macports_sources_rsync.macports.org_release_ports_x11_tk/work/tk8.5.6/unix/../generic/tk3d.c:89: error: 'borderPtr' undeclared (first use in this function)
/opt/local/var/macports/build/_opt_local_var_macports_sources_rsync.macports.org_release_ports_x11_tk/work/tk8.5.6/unix/../generic/tk3d.c:89: error: (Each undeclared identifier is reported only once
/opt/local/var/macports/build/_opt_local_var_macports_sources_rsync.macports.org_release_ports_x11_tk/work/tk8.5.6/unix/../generic/tk3d.c:89: error: for each function it appears in.)
/opt/local/var/macports/build/_opt_local_var_macports_sources_rsync.macports.org_release_ports_x11_tk/work/tk8.5.6/unix/../generic/tk3d.c:94: error: syntax error before ')' token
/opt/local/var/macports/build/_opt_local_var_macports_sources_rsync.macports.org_release_ports_x11_tk/work/tk8.5.6/unix/../generic/tk3d.c:110: warning: implicit declaration of function 'ScreenOfDisplay'
/opt/local/var/macports/build/_opt_local_var_macports_sources_rsync.macports.org_release_ports_x11_tk/work/tk8.5.6/unix/../generic/tk3d.c:110: error: syntax error before ')' token
/opt/local/var/macports/build/_opt_local_var_macports_sources_rsync.macports.org_release_ports_x11_tk/work/tk8.5.6/unix/../generic/tk3d.c:110: error: syntax error before ')' token
/opt/local/var/macports/build/_opt_local_var_macports_sources_rsync.macports.org_release_ports_x11_tk/work/tk8.5.6/unix/../generic/tk3d.c:111: error: syntax error before ')' token
/opt/local/var/macports/build/_opt_local_var_macports_sources_rsync.macports.org_release_ports_x11_tk/work/tk8.5.6/unix/../generic/tk3d.c:133: error: 'firstBorderPtr' undeclared (first use in this function)
/opt/local/var/macports/build/_opt_local_var_macports_sources_rsync.macports.org_release_ports_x11_tk/work/tk8.5.6/unix/../generic/tk3d.c:134: error: syntax error before ')' token
/opt/local/var/macports/build/_opt_local_var_macports_sources_rsync.macports.org_release_ports_x11_tk/work/tk8.5.6/unix/../generic/tk3d.c:138: error: syntax error before ')' token
/opt/local/var/macports/build/_opt_local_var_macports_sources_rsync.macports.org_release_ports_x11_tk/work/tk8.5.6/unix/../generic/tk3d.c:138: error: syntax error before ')' token
/opt/local/var/macports/build/_opt_local_var_macports_sources_rsync.macports.org_release_ports_x11_tk/work/tk8.5.6/unix/../generic/tk3d.c:139: error: syntax error before ')' token
/opt/local/var/macports/build/_opt_local_var_macports_sources_rsync.macports.org_release_ports_x11_tk/work/tk8.5.6/unix/../generic/tk3d.c:152: error: syntax error before ')' token
/opt/local/var/macports/build/_opt_local_var_macports_sources_rsync.macports.org_release_ports_x11_tk/work/tk8.5.6/unix/../generic/tk3d.c: In function 'Tk_Get3DBorder':
/opt/local/var/macports/build/_opt_local_var_macports_sources_rsync.macports.org_release_ports_x11_tk/work/tk8.5.6/unix/../generic/tk3d.c:192: error: 'borderPtr' undeclared (first use in this function)
/opt/local/var/macports/build/_opt_local_var_macports_sources_rsync.macports.org_release_ports_x11_tk/work/tk8.5.6/unix/../generic/tk3d.c:192: error: 'existingBorderPtr' undeclared (first use in this function)
/opt/local/var/macports/build/_opt_local_var_macports_sources_rsync.macports.org_release_ports_x11_tk/work/tk8.5.6/unix/../generic/tk3d.c:192: warning: left-hand operand of comma expression has no effect
/opt/local/var/macports/build/_opt_local_var_macports_sources_rsync.macports.org_release_ports_x11_tk/work/tk8.5.6/unix/../generic/tk3d.c:192: warning: statement with no effect
/opt/local/var/macports/build/_opt_local_var_macports_sources_rsync.macports.org_release_ports_x11_tk/work/tk8.5.6/unix/../generic/tk3d.c:194: error: 'XGCValues' undeclared (first use in this function)
/opt/local/var/macports/build/_opt_local_var_macports_sources_rsync.macports.org_release_ports_x11_tk/work/tk8.5.6/unix/../generic/tk3d.c:194: error: syntax error before 'gcValues'
/opt/local/var/macports/build/_opt_local_var_macports_sources_rsync.macports.org_release_ports_x11_tk/work/tk8.5.6/unix/../generic/tk3d.c:195: error: 'XColor' undeclared (first use in this function)
/opt/local/var/macports/build/_opt_local_var_macports_sources_rsync.macports.org_release_ports_x11_tk/work/tk8.5.6/unix/../generic/tk3d.c:196: error: invalid operands to binary *
/opt/local/var/macports/build/_opt_local_var_macports_sources_rsync.macports.org_release_ports_x11_tk/work/tk8.5.6/unix/../generic/tk3d.c:198: error: syntax error before ')' token
/opt/local/var/macports/build/_opt_local_var_macports_sources_rsync.macports.org_release_ports_x11_tk/work/tk8.5.6/unix/../generic/tk3d.c:200: error: request for member 'borderInit' in something not a structure or union
/opt/local/var/macports/build/_opt_local_var_macports_sources_rsync.macports.org_release_ports_x11_tk/work/tk8.5.6/unix/../generic/tk3d.c:204: error: request for member 'borderTable' in something not a structure or union
/opt/local/var/macports/build/_opt_local_var_macports_sources_rsync.macports.org_release_ports_x11_tk/work/tk8.5.6/unix/../generic/tk3d.c:204: error: request for member 'borderTable' in something not a structure or union
/opt/local/var/macports/build/_opt_local_var_macports_sources_rsync.macports.org_release_ports_x11_tk/work/tk8.5.6/unix/../generic/tk3d.c:206: error: syntax error before ')' token
/opt/local/var/macports/build/_opt_local_var_macports_sources_rsync.macports.org_release_ports_x11_tk/work/tk8.5.6/unix/../generic/tk3d.c:209: error: syntax error before ')' token
/opt/local/var/macports/build/_opt_local_var_macports_sources_rsync.macports.org_release_ports_x11_tk/work/tk8.5.6/unix/../generic/tk3d.c:209: error: syntax error before ')' token
/opt/local/var/macports/build/_opt_local_var_macports_sources_rsync.macports.org_release_ports_x11_tk/work/tk8.5.6/unix/../generic/tk3d.c:210: error: syntax error before ')' token
/opt/local/var/macports/build/_opt_local_var_macports_sources_rsync.macports.org_release_ports_x11_tk/work/tk8.5.6/unix/../generic/tk3d.c:232: error: syntax error before ')' token
/opt/local/var/macports/build/_opt_local_var_macports_sources_rsync.macports.org_release_ports_x11_tk/work/tk8.5.6/unix/../generic/tk3d.c:232: error: syntax error before ')' token
/opt/local/var/macports/build/_opt_local_var_macports_sources_rsync.macports.org_release_ports_x11_tk/work/tk8.5.6/unix/../generic/tk3d.c:233: error: syntax error before ')' token
/opt/local/var/macports/build/_opt_local_var_macports_sources_rsync.macports.org_release_ports_x11_tk/work/tk8.5.6/unix/../generic/tk3d.c:234: error: syntax error before ')' token
/opt/local/var/macports/build/_opt_local_var_macports_sources_rsync.macports.org_release_ports_x11_tk/work/tk8.5.6/unix/../generic/tk3d.c:235: error: syntax error before ')' token
/opt/local/var/macports/build/_opt_local_var_macports_sources_rsync.macports.org_release_ports_x11_tk/work/tk8.5.6/unix/../generic/tk3d.c:241: error: 'None' undeclared (first use in this function)
/opt/local/var/macports/build/_opt_local_var_macports_sources_rsync.macports.org_release_ports_x11_tk/work/tk8.5.6/unix/../generic/tk3d.c:254: error: 'gcValues' undeclared (first use in this function)
/opt/local/var/macports/build/_opt_local_var_macports_sources_rsync.macports.org_release_ports_x11_tk/work/tk8.5.6/unix/../generic/tk3d.c:255: error: 'GCForeground' undeclared (first use in this function)
/opt/local/var/macports/build/_opt_local_var_macports_sources_rsync.macports.org_release_ports_x11_tk/work/tk8.5.6/unix/../generic/tk3d.c: At top level:
/opt/local/var/macports/build/_opt_local_var_macports_sources_rsync.macports.org_release_ports_x11_tk/work/tk8.5.6/unix/../generic/tk3d.c:281: error: syntax error before 'Drawable'
/opt/local/var/macports/build/_opt_local_var_macports_sources_rsync.macports.org_release_ports_x11_tk/work/tk8.5.6/unix/../generic/tk3d.c: In function 'Tk_Draw3DRectangle':
/opt/local/var/macports/build/_opt_local_var_macports_sources_rsync.macports.org_release_ports_x11_tk/work/tk8.5.6/unix/../generic/tk3d.c:290: error: 'borderWidth' undeclared (first use in this function)
/opt/local/var/macports/build/_opt_local_var_macports_sources_rsync.macports.org_release_ports_x11_tk/work/tk8.5.6/unix/../generic/tk3d.c:293: error: 'height' undeclared (first use in this function)
/opt/local/var/macports/build/_opt_local_var_macports_sources_rsync.macports.org_release_ports_x11_tk/work/tk8.5.6/unix/../generic/tk3d.c:296: error: 'tkwin' undeclared (first use in this function)
/opt/local/var/macports/build/_opt_local_var_macports_sources_rsync.macports.org_release_ports_x11_tk/work/tk8.5.6/unix/../generic/tk3d.c:296: error: 'drawable' undeclared (first use in this function)
/opt/local/var/macports/build/_opt_local_var_macports_sources_rsync.macports.org_release_ports_x11_tk/work/tk8.5.6/unix/../generic/tk3d.c:296: error: 'border' undeclared (first use in this function)
/opt/local/var/macports/build/_opt_local_var_macports_sources_rsync.macports.org_release_ports_x11_tk/work/tk8.5.6/unix/../generic/tk3d.c:297: error: 'relief' undeclared (first use in this function)
/opt/local/var/macports/build/_opt_local_var_macports_sources_rsync.macports.org_release_ports_x11_tk/work/tk8.5.6/unix/../generic/tk3d.c: In function 'Tk_NameOf3DBorder':
/opt/local/var/macports/build/_opt_local_var_macports_sources_rsync.macports.org_release_ports_x11_tk/work/tk8.5.6/unix/../generic/tk3d.c:327: error: 'borderPtr' undeclared (first use in this function)
/opt/local/var/macports/build/_opt_local_var_macports_sources_rsync.macports.org_release_ports_x11_tk/work/tk8.5.6/unix/../generic/tk3d.c:327: error: syntax error before ')' token
/opt/local/var/macports/build/_opt_local_var_macports_sources_rsync.macports.org_release_ports_x11_tk/work/tk8.5.6/unix/../generic/tk3d.c: At top level:
/opt/local/var/macports/build/_opt_local_var_macports_sources_rsync.macports.org_release_ports_x11_tk/work/tk8.5.6/unix/../generic/tk3d.c:347: error: syntax error before '*' token
/opt/local/var/macports/build/_opt_local_var_macports_sources_rsync.macports.org_release_ports_x11_tk/work/tk8.5.6/unix/../generic/tk3d.c:350: warning: return type defaults to 'int'
/opt/local/var/macports/build/_opt_local_var_macports_sources_rsync.macports.org_release_ports_x11_tk/work/tk8.5.6/unix/../generic/tk3d.c: In function 'Tk_3DBorderColor':
/opt/local/var/macports/build/_opt_local_var_macports_sources_rsync.macports.org_release_ports_x11_tk/work/tk8.5.6/unix/../generic/tk3d.c:351: error: syntax error before ')' token
/opt/local/var/macports/build/_opt_local_var_macports_sources_rsync.macports.org_release_ports_x11_tk/work/tk8.5.6/unix/../generic/tk3d.c: At top level:
/opt/local/var/macports/build/_opt_local_var_macports_sources_rsync.macports.org_release_ports_x11_tk/work/tk8.5.6/unix/../generic/tk3d.c:371: error: syntax error before 'Tk_3DBorderGC'
/opt/local/var/macports/build/_opt_local_var_macports_sources_rsync.macports.org_release_ports_x11_tk/work/tk8.5.6/unix/../generic/tk3d.c:377: warning: return type defaults to 'int'
/opt/local/var/macports/build/_opt_local_var_macports_sources_rsync.macports.org_release_ports_x11_tk/work/tk8.5.6/unix/../generic/tk3d.c: In function 'Tk_3DBorderGC':
/opt/local/var/macports/build/_opt_local_var_macports_sources_rsync.macports.org_release_ports_x11_tk/work/tk8.5.6/unix/../generic/tk3d.c:378: error: 'borderPtr' undeclared (first use in this function)
/opt/local/var/macports/build/_opt_local_var_macports_sources_rsync.macports.org_release_ports_x11_tk/work/tk8.5.6/unix/../generic/tk3d.c:378: error: syntax error before ')' token
/opt/local/var/macports/build/_opt_local_var_macports_sources_rsync.macports.org_release_ports_x11_tk/work/tk8.5.6/unix/../generic/tk3d.c:380: error: 'None' undeclared (first use in this function)
/opt/local/var/macports/build/_opt_local_var_macports_sources_rsync.macports.org_release_ports_x11_tk/work/tk8.5.6/unix/../generic/tk3d.c:397: error: syntax error before 'None'
/opt/local/var/macports/build/_opt_local_var_macports_sources_rsync.macports.org_release_ports_x11_tk/work/tk8.5.6/unix/../generic/tk3d.c: In function 'Tk_Free3DBorder':
/opt/local/var/macports/build/_opt_local_var_macports_sources_rsync.macports.org_release_ports_x11_tk/work/tk8.5.6/unix/../generic/tk3d.c:422: error: 'borderPtr' undeclared (first use in this function)
/opt/local/var/macports/build/_opt_local_var_macports_sources_rsync.macports.org_release_ports_x11_tk/work/tk8.5.6/unix/../generic/tk3d.c:422: error: syntax error before ')' token
/opt/local/var/macports/build/_opt_local_var_macports_sources_rsync.macports.org_release_ports_x11_tk/work/tk8.5.6/unix/../generic/tk3d.c:423: error: 'Display' undeclared (first use in this function)
/opt/local/var/macports/build/_opt_local_var_macports_sources_rsync.macports.org_release_ports_x11_tk/work/tk8.5.6/unix/../generic/tk3d.c:423: warning: implicit declaration of function 'DisplayOfScreen'
/opt/local/var/macports/build/_opt_local_var_macports_sources_rsync.macports.org_release_ports_x11_tk/work/tk8.5.6/unix/../generic/tk3d.c:424: error: 'prevPtr' undeclared (first use in this function)
/opt/local/var/macports/build/_opt_local_var_macports_sources_rsync.macports.org_release_ports_x11_tk/work/tk8.5.6/unix/../generic/tk3d.c:431: error: syntax error before ')' token
/opt/local/var/macports/build/_opt_local_var_macports_sources_rsync.macports.org_release_ports_x11_tk/work/tk8.5.6/unix/../generic/tk3d.c:442: error: 'None' undeclared (first use in this function)
/opt/local/var/macports/build/_opt_local_var_macports_sources_rsync.macports.org_release_ports_x11_tk/work/tk8.5.6/unix/../generic/tk3d.c: In function 'FreeBorderObjProc':
/opt/local/var/macports/build/_opt_local_var_macports_sources_rsync.macports.org_release_ports_x11_tk/work/tk8.5.6/unix/../generic/tk3d.c:525: error: 'borderPtr' undeclared (first use in this function)
/opt/local/var/macports/build/_opt_local_var_macports_sources_rsync.macports.org_release_ports_x11_tk/work/tk8.5.6/unix/../generic/tk3d.c:525: error: syntax error before ')' token
/opt/local/var/macports/build/_opt_local_var_macports_sources_rsync.macports.org_release_ports_x11_tk/work/tk8.5.6/unix/../generic/tk3d.c: In function 'DupBorderObjProc':
/opt/local/var/macports/build/_opt_local_var_macports_sources_rsync.macports.org_release_ports_x11_tk/work/tk8.5.6/unix/../generic/tk3d.c:560: error: 'borderPtr' undeclared (first use in this function)
/opt/local/var/macports/build/_opt_local_var_macports_sources_rsync.macports.org_release_ports_x11_tk/work/tk8.5.6/unix/../generic/tk3d.c:560: error: syntax error before ')' token
/opt/local/var/macports/build/_opt_local_var_macports_sources_rsync.macports.org_release_ports_x11_tk/work/tk8.5.6/unix/../generic/tk3d.c: In function 'Tk_SetBackgroundFromBorder':
/opt/local/var/macports/build/_opt_local_var_macports_sources_rsync.macports.org_release_ports_x11_tk/work/tk8.5.6/unix/../generic/tk3d.c:592: error: nested functions are disabled, use -fnested-functions to re-enable
/opt/local/var/macports/build/_opt_local_var_macports_sources_rsync.macports.org_release_ports_x11_tk/work/tk8.5.6/unix/../generic/tk3d.c:592: error: syntax error before '*' token
/opt/local/var/macports/build/_opt_local_var_macports_sources_rsync.macports.org_release_ports_x11_tk/work/tk8.5.6/unix/../generic/tk3d.c:594: error: 'borderPtr' undeclared (first use in this function)
/opt/local/var/macports/build/_opt_local_var_macports_sources_rsync.macports.org_release_ports_x11_tk/work/tk8.5.6/unix/../generic/tk3d.c: At top level:
/opt/local/var/macports/build/_opt_local_var_macports_sources_rsync.macports.org_release_ports_x11_tk/work/tk8.5.6/unix/../generic/tk3d.c:743: error: syntax error before 'Drawable'
/opt/local/var/macports/build/_opt_local_var_macports_sources_rsync.macports.org_release_ports_x11_tk/work/tk8.5.6/unix/../generic/tk3d.c: In function 'Tk_Draw3DPolygon':
/opt/local/var/macports/build/_opt_local_var_macports_sources_rsync.macports.org_release_ports_x11_tk/work/tk8.5.6/unix/../generic/tk3d.c:756: error: 'XPoint' undeclared (first use in this function)
/opt/local/var/macports/build/_opt_local_var_macports_sources_rsync.macports.org_release_ports_x11_tk/work/tk8.5.6/unix/../generic/tk3d.c:756: error: syntax error before 'poly'
/opt/local/var/macports/build/_opt_local_var_macports_sources_rsync.macports.org_release_ports_x11_tk/work/tk8.5.6/unix/../generic/tk3d.c:758: error: nested functions are disabled, use -fnested-functions to re-enable
/opt/local/var/macports/build/_opt_local_var_macports_sources_rsync.macports.org_release_ports_x11_tk/work/tk8.5.6/unix/../generic/tk3d.c:758: error: syntax error before '*' token
/opt/local/var/macports/build/_opt_local_var_macports_sources_rsync.macports.org_release_ports_x11_tk/work/tk8.5.6/unix/../generic/tk3d.c:759: error: 'borderPtr' undeclared (first use in this function)
/opt/local/var/macports/build/_opt_local_var_macports_sources_rsync.macports.org_release_ports_x11_tk/work/tk8.5.6/unix/../generic/tk3d.c:759: error: syntax error before ')' token
/opt/local/var/macports/build/_opt_local_var_macports_sources_rsync.macports.org_release_ports_x11_tk/work/tk8.5.6/unix/../generic/tk3d.c:762: error: 'Display' undeclared (first use in this function)
/opt/local/var/macports/build/_opt_local_var_macports_sources_rsync.macports.org_release_ports_x11_tk/work/tk8.5.6/unix/../generic/tk3d.c:762: error: syntax error before ')' token
/opt/local/var/macports/build/_opt_local_var_macports_sources_rsync.macports.org_release_ports_x11_tk/work/tk8.5.6/unix/../generic/tk3d.c:762: error: 'tkwin' undeclared (first use in this function)
/opt/local/var/macports/build/_opt_local_var_macports_sources_rsync.macports.org_release_ports_x11_tk/work/tk8.5.6/unix/../generic/tk3d.c:764: error: 'None' undeclared (first use in this function)
/opt/local/var/macports/build/_opt_local_var_macports_sources_rsync.macports.org_release_ports_x11_tk/work/tk8.5.6/unix/../generic/tk3d.c:772: error: 'leftRelief' undeclared (first use in this function)
/opt/local/var/macports/build/_opt_local_var_macports_sources_rsync.macports.org_release_ports_x11_tk/work/tk8.5.6/unix/../generic/tk3d.c:775: error: 'borderWidth' undeclared (first use in this function)
/opt/local/var/macports/build/_opt_local_var_macports_sources_rsync.macports.org_release_ports_x11_tk/work/tk8.5.6/unix/../generic/tk3d.c:776: error: 'drawable' undeclared (first use in this function)
/opt/local/var/macports/build/_opt_local_var_macports_sources_rsync.macports.org_release_ports_x11_tk/work/tk8.5.6/unix/../generic/tk3d.c:776: error: 'border' undeclared (first use in this function)
/opt/local/var/macports/build/_opt_local_var_macports_sources_rsync.macports.org_release_ports_x11_tk/work/tk8.5.6/unix/../generic/tk3d.c:776: error: 'pointPtr' undeclared (first use in this function)
/opt/local/var/macports/build/_opt_local_var_macports_sources_rsync.macports.org_release_ports_x11_tk/work/tk8.5.6/unix/../generic/tk3d.c:776: error: 'numPoints' undeclared (first use in this function)
/opt/local/var/macports/build/_opt_local_var_macports_sources_rsync.macports.org_release_ports_x11_tk/work/tk8.5.6/unix/../generic/tk3d.c:790: error: 'p1Ptr' undeclared (first use in this function)
/opt/local/var/macports/build/_opt_local_var_macports_sources_rsync.macports.org_release_ports_x11_tk/work/tk8.5.6/unix/../generic/tk3d.c:791: error: 'p2Ptr' undeclared (first use in this function)
/opt/local/var/macports/build/_opt_local_var_macports_sources_rsync.macports.org_release_ports_x11_tk/work/tk8.5.6/unix/../generic/tk3d.c:835: warning: value computed is not used
/opt/local/var/macports/build/_opt_local_var_macports_sources_rsync.macports.org_release_ports_x11_tk/work/tk8.5.6/unix/../generic/tk3d.c:835: warning: value computed is not used
/opt/local/var/macports/build/_opt_local_var_macports_sources_rsync.macports.org_release_ports_x11_tk/work/tk8.5.6/unix/../generic/tk3d.c:836: warning: value computed is not used
/opt/local/var/macports/build/_opt_local_var_macports_sources_rsync.macports.org_release_ports_x11_tk/work/tk8.5.6/unix/../generic/tk3d.c:836: warning: value computed is not used
/opt/local/var/macports/build/_opt_local_var_macports_sources_rsync.macports.org_release_ports_x11_tk/work/tk8.5.6/unix/../generic/tk3d.c:848: error: 'newB1' undeclared (first use in this function)
/opt/local/var/macports/build/_opt_local_var_macports_sources_rsync.macports.org_release_ports_x11_tk/work/tk8.5.6/unix/../generic/tk3d.c:849: error: 'newB2' undeclared (first use in this function)
/opt/local/var/macports/build/_opt_local_var_macports_sources_rsync.macports.org_release_ports_x11_tk/work/tk8.5.6/unix/../generic/tk3d.c:851: error: 'poly' undeclared (first use in this function)
/opt/local/var/macports/build/_opt_local_var_macports_sources_rsync.macports.org_release_ports_x11_tk/work/tk8.5.6/unix/../generic/tk3d.c:854: error: 'b1' undeclared (first use in this function)
/opt/local/var/macports/build/_opt_local_var_macports_sources_rsync.macports.org_release_ports_x11_tk/work/tk8.5.6/unix/../generic/tk3d.c:854: error: 'b2' undeclared (first use in this function)
/opt/local/var/macports/build/_opt_local_var_macports_sources_rsync.macports.org_release_ports_x11_tk/work/tk8.5.6/unix/../generic/tk3d.c:885: error: 'perp' undeclared (first use in this function)
/opt/local/var/macports/build/_opt_local_var_macports_sources_rsync.macports.org_release_ports_x11_tk/work/tk8.5.6/unix/../generic/tk3d.c:888: error: 'c' undeclared (first use in this function)
/opt/local/var/macports/build/_opt_local_var_macports_sources_rsync.macports.org_release_ports_x11_tk/work/tk8.5.6/unix/../generic/tk3d.c:889: error: 'shift1' undeclared (first use in this function)
/opt/local/var/macports/build/_opt_local_var_macports_sources_rsync.macports.org_release_ports_x11_tk/work/tk8.5.6/unix/../generic/tk3d.c:890: error: 'shift2' undeclared (first use in this function)
/opt/local/var/macports/build/_opt_local_var_macports_sources_rsync.macports.org_release_ports_x11_tk/work/tk8.5.6/unix/../generic/tk3d.c:904: error: 'gc' undeclared (first use in this function)
/opt/local/var/macports/build/_opt_local_var_macports_sources_rsync.macports.org_release_ports_x11_tk/work/tk8.5.6/unix/../generic/tk3d.c:908: warning: implicit declaration of function 'XFillPolygon'
/opt/local/var/macports/build/_opt_local_var_macports_sources_rsync.macports.org_release_ports_x11_tk/work/tk8.5.6/unix/../generic/tk3d.c:908: error: 'Convex' undeclared (first use in this function)
/opt/local/var/macports/build/_opt_local_var_macports_sources_rsync.macports.org_release_ports_x11_tk/work/tk8.5.6/unix/../generic/tk3d.c:909: error: 'CoordModeOrigin' undeclared (first use in this function)
/opt/local/var/macports/build/_opt_local_var_macports_sources_rsync.macports.org_release_ports_x11_tk/work/tk8.5.6/unix/../generic/tk3d.c: At top level:
/opt/local/var/macports/build/_opt_local_var_macports_sources_rsync.macports.org_release_ports_x11_tk/work/tk8.5.6/unix/../generic/tk3d.c:947: error: syntax error before 'Drawable'
/opt/local/var/macports/build/_opt_local_var_macports_sources_rsync.macports.org_release_ports_x11_tk/work/tk8.5.6/unix/../generic/tk3d.c: In function 'Tk_Fill3DRectangle':
/opt/local/var/macports/build/_opt_local_var_macports_sources_rsync.macports.org_release_ports_x11_tk/work/tk8.5.6/unix/../generic/tk3d.c:956: error: nested functions are disabled, use -fnested-functions to re-enable
/opt/local/var/macports/build/_opt_local_var_macports_sources_rsync.macports.org_release_ports_x11_tk/work/tk8.5.6/unix/../generic/tk3d.c:956: error: syntax error before '*' token
/opt/local/var/macports/build/_opt_local_var_macports_sources_rsync.macports.org_release_ports_x11_tk/work/tk8.5.6/unix/../generic/tk3d.c:965: error: 'relief' undeclared (first use in this function)
/opt/local/var/macports/build/_opt_local_var_macports_sources_rsync.macports.org_release_ports_x11_tk/work/tk8.5.6/unix/../generic/tk3d.c:966: error: 'borderWidth' undeclared (first use in this function)
/opt/local/var/macports/build/_opt_local_var_macports_sources_rsync.macports.org_release_ports_x11_tk/work/tk8.5.6/unix/../generic/tk3d.c:976: error: 'height' undeclared (first use in this function)
/opt/local/var/macports/build/_opt_local_var_macports_sources_rsync.macports.org_release_ports_x11_tk/work/tk8.5.6/unix/../generic/tk3d.c:983: warning: implicit declaration of function 'XFillRectangle'
/opt/local/var/macports/build/_opt_local_var_macports_sources_rsync.macports.org_release_ports_x11_tk/work/tk8.5.6/unix/../generic/tk3d.c:983: error: syntax error before ')' token
/opt/local/var/macports/build/_opt_local_var_macports_sources_rsync.macports.org_release_ports_x11_tk/work/tk8.5.6/unix/../generic/tk3d.c:983: error: 'tkwin' undeclared (first use in this function)
/opt/local/var/macports/build/_opt_local_var_macports_sources_rsync.macports.org_release_ports_x11_tk/work/tk8.5.6/unix/../generic/tk3d.c:983: error: 'drawable' undeclared (first use in this function)
/opt/local/var/macports/build/_opt_local_var_macports_sources_rsync.macports.org_release_ports_x11_tk/work/tk8.5.6/unix/../generic/tk3d.c:983: error: 'borderPtr' undeclared (first use in this function)
/opt/local/var/macports/build/_opt_local_var_macports_sources_rsync.macports.org_release_ports_x11_tk/work/tk8.5.6/unix/../generic/tk3d.c:989: error: 'border' undeclared (first use in this function)
/opt/local/var/macports/build/_opt_local_var_macports_sources_rsync.macports.org_release_ports_x11_tk/work/tk8.5.6/unix/../generic/tk3d.c: At top level:
/opt/local/var/macports/build/_opt_local_var_macports_sources_rsync.macports.org_release_ports_x11_tk/work/tk8.5.6/unix/../generic/tk3d.c:1013: error: syntax error before 'Drawable'
/opt/local/var/macports/build/_opt_local_var_macports_sources_rsync.macports.org_release_ports_x11_tk/work/tk8.5.6/unix/../generic/tk3d.c: In function 'Tk_Fill3DPolygon':
/opt/local/var/macports/build/_opt_local_var_macports_sources_rsync.macports.org_release_ports_x11_tk/work/tk8.5.6/unix/../generic/tk3d.c:1027: error: nested functions are disabled, use -fnested-functions to re-enable
/opt/local/var/macports/build/_opt_local_var_macports_sources_rsync.macports.org_release_ports_x11_tk/work/tk8.5.6/unix/../generic/tk3d.c:1027: error: syntax error before '*' token
/opt/local/var/macports/build/_opt_local_var_macports_sources_rsync.macports.org_release_ports_x11_tk/work/tk8.5.6/unix/../generic/tk3d.c:1029: error: syntax error before ')' token
/opt/local/var/macports/build/_opt_local_var_macports_sources_rsync.macports.org_release_ports_x11_tk/work/tk8.5.6/unix/../generic/tk3d.c:1029: error: 'tkwin' undeclared (first use in this function)
/opt/local/var/macports/build/_opt_local_var_macports_sources_rsync.macports.org_release_ports_x11_tk/work/tk8.5.6/unix/../generic/tk3d.c:1029: error: 'drawable' undeclared (first use in this function)
/opt/local/var/macports/build/_opt_local_var_macports_sources_rsync.macports.org_release_ports_x11_tk/work/tk8.5.6/unix/../generic/tk3d.c:1029: error: 'borderPtr' undeclared (first use in this function)
/opt/local/var/macports/build/_opt_local_var_macports_sources_rsync.macports.org_release_ports_x11_tk/work/tk8.5.6/unix/../generic/tk3d.c:1030: error: 'pointPtr' undeclared (first use in this function)
/opt/local/var/macports/build/_opt_local_var_macports_sources_rsync.macports.org_release_ports_x11_tk/work/tk8.5.6/unix/../generic/tk3d.c:1030: error: 'numPoints' undeclared (first use in this function)
/opt/local/var/macports/build/_opt_local_var_macports_sources_rsync.macports.org_release_ports_x11_tk/work/tk8.5.6/unix/../generic/tk3d.c:1030: error: 'Complex' undeclared (first use in this function)
/opt/local/var/macports/build/_opt_local_var_macports_sources_rsync.macports.org_release_ports_x11_tk/work/tk8.5.6/unix/../generic/tk3d.c:1030: error: 'CoordModeOrigin' undeclared (first use in this function)
/opt/local/var/macports/build/_opt_local_var_macports_sources_rsync.macports.org_release_ports_x11_tk/work/tk8.5.6/unix/../generic/tk3d.c:1031: error: 'leftRelief' undeclared (first use in this function)
/opt/local/var/macports/build/_opt_local_var_macports_sources_rsync.macports.org_release_ports_x11_tk/work/tk8.5.6/unix/../generic/tk3d.c:1032: error: 'border' undeclared (first use in this function)
/opt/local/var/macports/build/_opt_local_var_macports_sources_rsync.macports.org_release_ports_x11_tk/work/tk8.5.6/unix/../generic/tk3d.c:1033: error: 'borderWidth' undeclared (first use in this function)
/opt/local/var/macports/build/_opt_local_var_macports_sources_rsync.macports.org_release_ports_x11_tk/work/tk8.5.6/unix/../generic/tk3d.c: At top level:
/opt/local/var/macports/build/_opt_local_var_macports_sources_rsync.macports.org_release_ports_x11_tk/work/tk8.5.6/unix/../generic/tk3d.c:1055: error: syntax error before '*' token
/opt/local/var/macports/build/_opt_local_var_macports_sources_rsync.macports.org_release_ports_x11_tk/work/tk8.5.6/unix/../generic/tk3d.c: In function 'BorderInit':
/opt/local/var/macports/build/_opt_local_var_macports_sources_rsync.macports.org_release_ports_x11_tk/work/tk8.5.6/unix/../generic/tk3d.c:1057: error: request for member 'borderInit' in something not a structure or union
/opt/local/var/macports/build/_opt_local_var_macports_sources_rsync.macports.org_release_ports_x11_tk/work/tk8.5.6/unix/../generic/tk3d.c:1058: error: request for member 'borderTable' in something not a structure or union
/opt/local/var/macports/build/_opt_local_var_macports_sources_rsync.macports.org_release_ports_x11_tk/work/tk8.5.6/unix/../generic/tk3d.c: At top level:
/opt/local/var/macports/build/_opt_local_var_macports_sources_rsync.macports.org_release_ports_x11_tk/work/tk8.5.6/unix/../generic/tk3d.c:1080: error: syntax error before '*' token
/opt/local/var/macports/build/_opt_local_var_macports_sources_rsync.macports.org_release_ports_x11_tk/work/tk8.5.6/unix/../generic/tk3d.c: In function 'ShiftLine':
/opt/local/var/macports/build/_opt_local_var_macports_sources_rsync.macports.org_release_ports_x11_tk/work/tk8.5.6/unix/../generic/tk3d.c:1117: error: 'p3Ptr' undeclared (first use in this function)
/opt/local/var/macports/build/_opt_local_var_macports_sources_rsync.macports.org_release_ports_x11_tk/work/tk8.5.6/unix/../generic/tk3d.c:1117: error: 'p1Ptr' undeclared (first use in this function)
/opt/local/var/macports/build/_opt_local_var_macports_sources_rsync.macports.org_release_ports_x11_tk/work/tk8.5.6/unix/../generic/tk3d.c:1118: error: 'p2Ptr' undeclared (first use in this function)
/opt/local/var/macports/build/_opt_local_var_macports_sources_rsync.macports.org_release_ports_x11_tk/work/tk8.5.6/unix/../generic/tk3d.c:1133: error: 'distance' undeclared (first use in this function)
/opt/local/var/macports/build/_opt_local_var_macports_sources_rsync.macports.org_release_ports_x11_tk/work/tk8.5.6/unix/../generic/tk3d.c: At top level:
/opt/local/var/macports/build/_opt_local_var_macports_sources_rsync.macports.org_release_ports_x11_tk/work/tk8.5.6/unix/../generic/tk3d.c:1167: error: syntax error before '*' token
/opt/local/var/macports/build/_opt_local_var_macports_sources_rsync.macports.org_release_ports_x11_tk/work/tk8.5.6/unix/../generic/tk3d.c: In function 'Intersect':
/opt/local/var/macports/build/_opt_local_var_macports_sources_rsync.macports.org_release_ports_x11_tk/work/tk8.5.6/unix/../generic/tk3d.c:1181: error: 'a2Ptr' undeclared (first use in this function)
/opt/local/var/macports/build/_opt_local_var_macports_sources_rsync.macports.org_release_ports_x11_tk/work/tk8.5.6/unix/../generic/tk3d.c:1181: error: 'a1Ptr' undeclared (first use in this function)
/opt/local/var/macports/build/_opt_local_var_macports_sources_rsync.macports.org_release_ports_x11_tk/work/tk8.5.6/unix/../generic/tk3d.c:1181: error: 'b2Ptr' undeclared (first use in this function)
/opt/local/var/macports/build/_opt_local_var_macports_sources_rsync.macports.org_release_ports_x11_tk/work/tk8.5.6/unix/../generic/tk3d.c:1181: error: 'b1Ptr' undeclared (first use in this function)
/opt/local/var/macports/build/_opt_local_var_macports_sources_rsync.macports.org_release_ports_x11_tk/work/tk8.5.6/unix/../generic/tk3d.c:1196: error: 'iPtr' undeclared (first use in this function)
/opt/local/var/macports/build/_opt_local_var_macports_sources_rsync.macports.org_release_ports_x11_tk/work/tk8.5.6/unix/../generic/tk3d.c: In function 'Tk_Get3DBorderFromObj':
/opt/local/var/macports/build/_opt_local_var_macports_sources_rsync.macports.org_release_ports_x11_tk/work/tk8.5.6/unix/../generic/tk3d.c:1240: error: 'borderPtr' undeclared (first use in this function)
/opt/local/var/macports/build/_opt_local_var_macports_sources_rsync.macports.org_release_ports_x11_tk/work/tk8.5.6/unix/../generic/tk3d.c:1242: error: invalid operands to binary *
/opt/local/var/macports/build/_opt_local_var_macports_sources_rsync.macports.org_release_ports_x11_tk/work/tk8.5.6/unix/../generic/tk3d.c:1242: error: syntax error before ')' token
/opt/local/var/macports/build/_opt_local_var_macports_sources_rsync.macports.org_release_ports_x11_tk/work/tk8.5.6/unix/../generic/tk3d.c:1254: error: syntax error before ')' token
/opt/local/var/macports/build/_opt_local_var_macports_sources_rsync.macports.org_release_ports_x11_tk/work/tk8.5.6/unix/../generic/tk3d.c:1257: error: syntax error before ')' token
/opt/local/var/macports/build/_opt_local_var_macports_sources_rsync.macports.org_release_ports_x11_tk/work/tk8.5.6/unix/../generic/tk3d.c:1257: error: syntax error before ')' token
/opt/local/var/macports/build/_opt_local_var_macports_sources_rsync.macports.org_release_ports_x11_tk/work/tk8.5.6/unix/../generic/tk3d.c:1258: error: syntax error before ')' token
/opt/local/var/macports/build/_opt_local_var_macports_sources_rsync.macports.org_release_ports_x11_tk/work/tk8.5.6/unix/../generic/tk3d.c:1278: error: request for member 'borderTable' in something not a structure or union
/opt/local/var/macports/build/_opt_local_var_macports_sources_rsync.macports.org_release_ports_x11_tk/work/tk8.5.6/unix/../generic/tk3d.c:1278: error: request for member 'borderTable' in something not a structure or union
/opt/local/var/macports/build/_opt_local_var_macports_sources_rsync.macports.org_release_ports_x11_tk/work/tk8.5.6/unix/../generic/tk3d.c:1282: error: syntax error before ')' token
/opt/local/var/macports/build/_opt_local_var_macports_sources_rsync.macports.org_release_ports_x11_tk/work/tk8.5.6/unix/../generic/tk3d.c:1284: error: syntax error before ')' token
/opt/local/var/macports/build/_opt_local_var_macports_sources_rsync.macports.org_release_ports_x11_tk/work/tk8.5.6/unix/../generic/tk3d.c:1284: error: syntax error before ')' token
/opt/local/var/macports/build/_opt_local_var_macports_sources_rsync.macports.org_release_ports_x11_tk/work/tk8.5.6/unix/../generic/tk3d.c:1285: error: syntax error before ')' token
/opt/local/var/macports/build/_opt_local_var_macports_sources_rsync.macports.org_release_ports_x11_tk/work/tk8.5.6/unix/../generic/tk3d.c: In function 'TkDebugBorder':
/opt/local/var/macports/build/_opt_local_var_macports_sources_rsync.macports.org_release_ports_x11_tk/work/tk8.5.6/unix/../generic/tk3d.c:1365: error: 'borderPtr' undeclared (first use in this function)
/opt/local/var/macports/build/_opt_local_var_macports_sources_rsync.macports.org_release_ports_x11_tk/work/tk8.5.6/unix/../generic/tk3d.c:1368: error: invalid operands to binary *
/opt/local/var/macports/build/_opt_local_var_macports_sources_rsync.macports.org_release_ports_x11_tk/work/tk8.5.6/unix/../generic/tk3d.c:1368: error: syntax error before ')' token
/opt/local/var/macports/build/_opt_local_var_macports_sources_rsync.macports.org_release_ports_x11_tk/work/tk8.5.6/unix/../generic/tk3d.c:1371: error: request for member 'borderTable' in something not a structure or union
/opt/local/var/macports/build/_opt_local_var_macports_sources_rsync.macports.org_release_ports_x11_tk/work/tk8.5.6/unix/../generic/tk3d.c:1371: error: request for member 'borderTable' in something not a structure or union
/opt/local/var/macports/build/_opt_local_var_macports_sources_rsync.macports.org_release_ports_x11_tk/work/tk8.5.6/unix/../generic/tk3d.c:1373: error: syntax error before ')' token
make: *** [tk3d.o] Error 1
Error: Target org.macports.build returned: shell command " cd "/opt/local/var/macports/build/_opt_local_var_macports_sources_rsync.macports.org_release_ports_x11_tk/work/tk8.5.6/unix" && make all " returned error 2
Command output: /opt/local/var/macports/build/_opt_local_var_macports_sources_rsync.macports.org_release_ports_x11_tk/work/tk8.5.6/unix/../generic/tk3d.c: At top level:
/opt/local/var/macports/build/_opt_local_var_macports_sources_rsync.macports.org_release_ports_x11_tk/work/tk8.5.6/unix/../generic/tk3d.c:1167: error: syntax error before '*' token
/opt/local/var/macports/build/_opt_local_var_macports_sources_rsync.macports.org_release_ports_x11_tk/work/tk8.5.6/unix/../generic/tk3d.c: In function 'Intersect':
/opt/local/var/macports/build/_opt_local_var_macports_sources_rsync.macports.org_release_ports_x11_tk/work/tk8.5.6/unix/../generic/tk3d.c:1181: error: 'a2Ptr' undeclared (first use in this function)
/opt/local/var/macports/build/_opt_local_var_macports_sources_rsync.macports.org_release_ports_x11_tk/work/tk8.5.6/unix/../generic/tk3d.c:1181: error: 'a1Ptr' undeclared (first use in this function)
/opt/local/var/macports/build/_opt_local_var_macports_sources_rsync.macports.org_release_ports_x11_tk/work/tk8.5.6/unix/../generic/tk3d.c:1181: error: 'b2Ptr' undeclared (first use in this function)
/opt/local/var/macports/build/_opt_local_var_macports_sources_rsync.macports.org_release_ports_x11_tk/work/tk8.5.6/unix/../generic/tk3d.c:1181: error: 'b1Ptr' undeclared (first use in this function)
/opt/local/var/macports/build/_opt_local_var_macports_sources_rsync.macports.org_release_ports_x11_tk/work/tk8.5.6/unix/../generic/tk3d.c:1196: error: 'iPtr' undeclared (first use in this function)
/opt/local/var/macports/build/_opt_local_var_macports_sources_rsync.macports.org_release_ports_x11_tk/work/tk8.5.6/unix/../generic/tk3d.c: In function 'Tk_Get3DBorderFromObj':
/opt/local/var/macports/build/_opt_local_var_macports_sources_rsync.macports.org_release_ports_x11_tk/work/tk8.5.6/unix/../generic/tk3d.c:1240: error: 'borderPtr' undeclared (first use in this function)
/opt/local/var/macports/build/_opt_local_var_macports_sources_rsync.macports.org_release_ports_x11_tk/work/tk8.5.6/unix/../generic/tk3d.c:1242: error: invalid operands to binary *
/opt/local/var/macports/build/_opt_local_var_macports_sources_rsync.macports.org_release_ports_x11_tk/work/tk8.5.6/unix/../generic/tk3d.c:1242: error: syntax error before ')' token
/opt/local/var/macports/build/_opt_local_var_macports_sources_rsync.macports.org_release_ports_x11_tk/work/tk8.5.6/unix/../generic/tk3d.c:1254: error: syntax error before ')' token
/opt/local/var/macports/build/_opt_local_var_macports_sources_rsync.macports.org_release_ports_x11_tk/work/tk8.5.6/unix/../generic/tk3d.c:1257: error: syntax error before ')' token
/opt/local/var/macports/build/_opt_local_var_macports_sources_rsync.macports.org_release_ports_x11_tk/work/tk8.5.6/unix/../generic/tk3d.c:1257: error: syntax error before ')' token
/opt/local/var/macports/build/_opt_local_var_macports_sources_rsync.macports.org_release_ports_x11_tk/work/tk8.5.6/unix/../generic/tk3d.c:1258: error: syntax error before ')' token
/opt/local/var/macports/build/_opt_local_var_macports_sources_rsync.macports.org_release_ports_x11_tk/work/tk8.5.6/unix/../generic/tk3d.c:1278: error: request for member 'borderTable' in something not a structure or union
/opt/local/var/macports/build/_opt_local_var_macports_sources_rsync.macports.org_release_ports_x11_tk/work/tk8.5.6/unix/../generic/tk3d.c:1278: error: request for member 'borderTable' in something not a structure or union
/opt/local/var/macports/build/_opt_local_var_macports_sources_rsync.macports.org_release_ports_x11_tk/work/tk8.5.6/unix/../generic/tk3d.c:1282: error: syntax error before ')' token
/opt/local/var/macports/build/_opt_local_var_macports_sources_rsync.macports.org_release_ports_x11_tk/work/tk8.5.6/unix/../generic/tk3d.c:1284: error: syntax error before ')' token
/opt/local/var/macports/build/_opt_local_var_macports_sources_rsync.macports.org_release_ports_x11_tk/work/tk8.5.6/unix/../generic/tk3d.c:1284: error: syntax error before ')' token
/opt/local/var/macports/build/_opt_local_var_macports_sources_rsync.macports.org_release_ports_x11_tk/work/tk8.5.6/unix/../generic/tk3d.c:1285: error: syntax error before ')' token
/opt/local/var/macports/build/_opt_local_var_macports_sources_rsync.macports.org_release_ports_x11_tk/work/tk8.5.6/unix/../generic/tk3d.c: In function 'TkDebugBorder':
/opt/local/var/macports/build/_opt_local_var_macports_sources_rsync.macports.org_release_ports_x11_tk/work/tk8.5.6/unix/../generic/tk3d.c:1365: error: 'borderPtr' undeclared (first use in this function)
/opt/local/var/macports/build/_opt_local_var_macports_sources_rsync.macports.org_release_ports_x11_tk/work/tk8.5.6/unix/../generic/tk3d.c:1368: error: invalid operands to binary *
/opt/local/var/macports/build/_opt_local_var_macports_sources_rsync.macports.org_release_ports_x11_tk/work/tk8.5.6/unix/../generic/tk3d.c:1368: error: syntax error before ')' token
/opt/local/var/macports/build/_opt_local_var_macports_sources_rsync.macports.org_release_ports_x11_tk/work/tk8.5.6/unix/../generic/tk3d.c:1371: error: request for member 'borderTable' in something not a structure or union
/opt/local/var/macports/build/_opt_local_var_macports_sources_rsync.macports.org_release_ports_x11_tk/work/tk8.5.6/unix/../generic/tk3d.c:1371: error: request for member 'borderTable' in something not a structure or union
/opt/local/var/macports/build/_opt_local_var_macports_sources_rsync.macports.org_release_ports_x11_tk/work/tk8.5.6/unix/../generic/tk3d.c:1373: error: syntax error before ')' token
make: *** [tk3d.o] Error 1

Warning: the following items did not execute (for tk): org.macports.activate org.macports.build org.macports.destroot org.macports.install
Error: Status 1 encountered during processing.

comment:4 Changed 5 years ago by blb@…

  • Owner changed from macports-tickets@… to mww@…
/usr/bin/gcc-4.0 -c -Os -O2 -pipe  -I/opt/local/var/macports/build/_opt_local_var_macports_sources_rsync.macports.org_release_ports_x11_tk/work/tcl8.5.6/generic  -Wall -Wno-implicit-int -fno-common -I/opt/local/var/macports/build/_opt_local_var_macports_sources_rsync.macports.org_release_ports_x11_tk/work/tk8.5.6/unix/../unix -I/opt/local/var/macports/build/_opt_local_var_macports_sources_rsync.macports.org_release_ports_x11_tk/work/tk8.5.6/unix/../generic -I/opt/local/var/macports/build/_opt_local_var_macports_sources_rsync.macports.org_release_ports_x11_tk/work/tk8.5.6/unix/../bitmaps -I/opt/local/var/macports/build/_opt_local_var_macports_sources_rsync.macports.org_release_ports_x11_tk/work/tk8.5.6/unix/../../tcl8.5.6//generic -I/opt/local/var/macports/build/_opt_local_var_macports_sources_rsync.macports.org_release_ports_x11_tk/work/tk8.5.6/unix/../../tcl8.5.6//unix  -DPACKAGE_NAME=\"tk\" -DPACKAGE_TARNAME=\"tk\" -DPACKAGE_VERSION=\"8.5\" -DPACKAGE_STRING=\"tk\ 8.5\" -DPACKAGE_BUGREPORT=\"\" -DSTDC_HEADERS=1 -DHAVE_SYS_TYPES_H=1 -DHAVE_SYS_STAT_H=1 -DHAVE_STDLIB_H=1 -DHAVE_STRING_H=1 -DHAVE_MEMORY_H=1 -DHAVE_STRINGS_H=1 -DHAVE_INTTYPES_H=1 -DHAVE_STDINT_H=1 -DHAVE_UNISTD_H=1 -DHAVE_LIMITS_H=1 -DMODULE_SCOPE=extern\ __attribute__\(\(__visibility__\(\"hidden\"\)\)\) -DMAC_OSX_TCL=1 -DHAVE_COREFOUNDATION=1 -DTCL_SHLIB_EXT=\".dylib\" -DTCL_CFG_OPTIMIZED=1 -DTCL_CFG_DEBUG=1 -DTCL_WIDE_INT_TYPE=long\ long -DHAVE_STRUCT_STAT64=1 -DHAVE_SYS_TIME_H=1 -DTIME_WITH_SYS_TIME=1 -DHAVE_INTPTR_T=1 -DHAVE_UINTPTR_T=1 -DHAVE_PW_GECOS=1 -DHAVE_LIBXFT=1 -DHAVE_XFT=1      -DTCL_NO_DEPRECATED  -DUSE_TCL_STUBS  /opt/local/var/macports/build/_opt_local_var_macports_sources_rsync.macports.org_release_ports_x11_tk/work/tk8.5.6/unix/../generic/tk3d.c
In file included from /opt/local/var/macports/build/_opt_local_var_macports_sources_rsync.macports.org_release_ports_x11_tk/work/tk8.5.6/unix/../generic/tkInt.h:21,
                 from /opt/local/var/macports/build/_opt_local_var_macports_sources_rsync.macports.org_release_ports_x11_tk/work/tk8.5.6/unix/../generic/tk3d.c:16:
/opt/local/var/macports/build/_opt_local_var_macports_sources_rsync.macports.org_release_ports_x11_tk/work/tk8.5.6/unix/../generic/tk.h:78:23: error: X11/Xlib.h: No such file or directory

It's not finding Xlib.h which should be provided with the xorg-libX11 port (which is an eventual dependency of tk); what is the output of

$ port installed xorg-libX11

comment:5 Changed 5 years ago by rictic@…

loki:~/ peter$ port installed xorg-libX11
The following ports are currently installed:
  xorg-libX11 @1.2.2_0 (active)

comment:6 Changed 5 years ago by akaukone@…

  • Cc akaukone@… added

Cc Me!

comment:7 follow-up: ↓ 10 Changed 5 years ago by ryandesign@…

  • Cc ryandesign@… added
  • Summary changed from tk 8.5.6 Build error: syntax error in tk3d.c to tk 8.5.6: X11/Xlib.h: No such file or directory

This was also reported on the mailing list by Ivan "Rambius" Ivanov who was using MacPorts 1.7.1 on Mac OS X 10.4.11. He found that the solution was to change the line

configure.cppflags  "-I${workpath}/tcl${version}/generic"

in the Portfile to

configure.cppflags  "-I${workpath}/tcl${version}/generic -I${prefix}/include"

I'm not sure what the implications of this are, or why the port currently deletes -I${prefix}/include from its cppflags.

In trunk (what will be 1.8.0 by the end of this week) we now have CPATH set to ${prefix}/include so maybe that will preclude the need for any change in the tk port.

comment:8 follow-up: ↓ 11 Changed 5 years ago by jeremy@…

I had this happen on a fresh install of macports 1.8.0 on Snow Leopard. Changing the Portfile as mentioned by Rambius did the trick.

comment:9 in reply to: ↑ description Changed 4 years ago by probono@…

I can confirm that the solution posted by ryandesign works. This is on a PureDarwin 9 i386 host. Please apply this fix to the portfile.

comment:10 in reply to: ↑ 7 Changed 4 years ago by ryandesign@…

Replying to ryandesign@…:

I'm not sure what the implications of this are, or why the port currently deletes -I${prefix}/include from its cppflags.

configure.cppflags in tk has seen a lot of churn. Here are the notable events that I can see:

  • r32235: tcl and tk updated to 8.5.0; cppflags line added with the value -I${workpath}/tcl${version}/generic; aqua variant deleted; commented-out quartz variant added
  • r33103: -I${prefix}/include moved to after -I${workpath}/tcl${version}/generic in cppflags to avoid picking up an already-installed incompatible tcl
  • r39335: tcl and tk updated to 8.5.4; -I${x11prefix}/include added to cppflags; quartz variant uncommented
  • r41095: tcl and tk updated to 8.5.5; -I${prefix}/include removed from cppflags with no explanation
  • r41100: -I${x11prefix}/include removed from cppflags to fix quartz variant
  • r56378: -I${prefix}/include added to cppflags to help find X11 headers
  • r56380: -I${prefix}/include removed from cppflags; pkgconfig dependency added instead

comment:11 in reply to: ↑ 8 Changed 4 years ago by ryandesign@…

Replying to jeremy@…:

I had this happen on a fresh install of macports 1.8.0 on Snow Leopard.

For comparison, I had no problem installing tk and all its dependencies in an empty MacPorts 1.8.2 prefix, on either Snow Leopard 10.6.2 x86_64 or Tiger 10.4.11 ppc.

comment:12 Changed 4 years ago by jmr@…

Is this still a problem with tk 8.5.9 and MacPorts 1.9.1?

comment:13 Changed 3 years ago by jmr@…

  • Status changed from new to closed
  • Resolution set to worksforme
Note: See TracTickets for help on using tickets.