Opened 9 years ago

Closed 9 years ago

#27100 closed defect (fixed)

tiemu3 failed to install

Reported by: denis.b.bergeron@… Owned by: anddam (Andrea D'Amore)
Priority: Normal Milestone:
Component: ports Version: 1.9.1
Keywords: Cc: jwilliams@…
Port: tiemu3

Description (last modified by jmroot (Joshua Root))

The install of tiemu3 give me this error :

$ sudo port install tiemu3
Password:
--->  Computing dependencies for tiemu3
--->  Building tiemu3
Error: Target org.macports.build returned: shell command failed
Log for tiemu3 is at: /opt/local/var/macports/logs/_opt_local_var_macports_sources_rsync.macports.org_release_ports_math_tiemu3/main.log
Error: Status 1 encountered during processing.

Then the tail of the log is :

$ tail -30 /opt/local/var/macports/logs/_opt_local_var_macports_sources_rsync.macports.org_release_ports_math_tiemu3/main.log
:info:build Making all in skins
:info:build make[2]: Nothing to be done for `all'.
:info:build Making all in src
:info:build cd core/uae && /usr/bin/make CC="/usr/bin/gcc-4.0" CFLAGS="-pipe -O2 -arch i386 -D__I386__ -D__MACOSX__ -fvisibility=hidden -DGTK_DISABLE_DEPRECATED -DDEBUGGER -DNO_GDB -I/opt/local/include/tilp2 -I/opt/local/include/glib-2.0 -I/opt/local/lib/glib-2.0/include -I/opt/local/include   -I/opt/local/include/tilp2 -I/opt/local/include/glib-2.0 -I/opt/local/lib/glib-2.0/include -I/opt/local/include   -I/opt/local/include/tilp2 -I/opt/local/include/glib-2.0 -I/opt/local/lib/glib-2.0/include -I/opt/local/include   -I/opt/local/include/tilp2 -I/opt/local/include/glib-2.0 -I/opt/local/lib/glib-2.0/include -I/opt/local/include   -I/opt/local/include/glib-2.0 -I/opt/local/lib/glib-2.0/include -I/opt/local/include   -D_REENTRANT -I/opt/local/include/gtk-2.0 -I/opt/local/lib/gtk-2.0/include -I/opt/local/include/atk-1.0 -I/opt/local/include/cairo -I/opt/local/include/gdk-pixbuf-2.0 -I/opt/local/include/pango-1.0 -I/opt/local/include/gio-unix-2.0/ -I/opt/local/include -I/opt/local/include/glib-2.0 -I/opt/local/lib/glib-2.0/include -I/opt/local/include/pixman-1 -I/opt/local/include/freetype2 -I/opt/local/include/libpng12   -D_REENTRANT -I/opt/local/include/libglade-2.0 -I/opt/local/include/gtk-2.0 -I/opt/local/include/libxml2 -I/opt/local/lib/gtk-2.0/include -I/opt/local/include/atk-1.0 -I/opt/local/include/cairo -I/opt/local/include/gdk-pixbuf-2.0 -I/opt/local/include/pango-1.0 -I/opt/local/include/gio-unix-2.0/ -I/opt/local/include -I/opt/local/include/glib-2.0 -I/opt/local/lib/glib-2.0/include -I/opt/local/include/pixman-1 -I/opt/local/include/freetype2 -I/opt/local/include/libpng12   -I/opt/local/include/SDL -D_GNU_SOURCE=1 -D_THREAD_SAFE " gen
:info:build make[3]: Nothing to be done for `gen'.
:info:build cd core/uae && /usr/bin/make CC="/usr/bin/gcc-4.0" CFLAGS="-pipe -O2 -arch i386 -D__I386__ -D__MACOSX__ -fvisibility=hidden -DGTK_DISABLE_DEPRECATED -DDEBUGGER -DNO_GDB -I/opt/local/include/tilp2 -I/opt/local/include/glib-2.0 -I/opt/local/lib/glib-2.0/include -I/opt/local/include   -I/opt/local/include/tilp2 -I/opt/local/include/glib-2.0 -I/opt/local/lib/glib-2.0/include -I/opt/local/include   -I/opt/local/include/tilp2 -I/opt/local/include/glib-2.0 -I/opt/local/lib/glib-2.0/include -I/opt/local/include   -I/opt/local/include/tilp2 -I/opt/local/include/glib-2.0 -I/opt/local/lib/glib-2.0/include -I/opt/local/include   -I/opt/local/include/glib-2.0 -I/opt/local/lib/glib-2.0/include -I/opt/local/include   -D_REENTRANT -I/opt/local/include/gtk-2.0 -I/opt/local/lib/gtk-2.0/include -I/opt/local/include/atk-1.0 -I/opt/local/include/cairo -I/opt/local/include/gdk-pixbuf-2.0 -I/opt/local/include/pango-1.0 -I/opt/local/include/gio-unix-2.0/ -I/opt/local/include -I/opt/local/include/glib-2.0 -I/opt/local/lib/glib-2.0/include -I/opt/local/include/pixman-1 -I/opt/local/include/freetype2 -I/opt/local/include/libpng12   -D_REENTRANT -I/opt/local/include/libglade-2.0 -I/opt/local/include/gtk-2.0 -I/opt/local/include/libxml2 -I/opt/local/lib/gtk-2.0/include -I/opt/local/include/atk-1.0 -I/opt/local/include/cairo -I/opt/local/include/gdk-pixbuf-2.0 -I/opt/local/include/pango-1.0 -I/opt/local/include/gio-unix-2.0/ -I/opt/local/include -I/opt/local/include/glib-2.0 -I/opt/local/lib/glib-2.0/include -I/opt/local/include/pixman-1 -I/opt/local/include/freetype2 -I/opt/local/include/libpng12   -I/opt/local/include/SDL -D_GNU_SOURCE=1 -D_THREAD_SAFE " all
:info:build make[3]: Nothing to be done for `all'.
:info:build /usr/bin/gcc-4.0 -I.. -I -DPREFIX=\"/opt/local\" -I. -I./core -I./core/uae -I./core/ti_hw -I./core/ti_sw -I./core/dbg -I./sound -I./gui -I./gui/calc -I./gui/debugger -I./ipc/dcop -I./ipc/dbus -I./ipc/com -I./kde -I./misc -DHAVE_CONFIG_H -DSHARE_DIR=\"/opt/local/share/tiemu\" -DLOCALEDIR=\"/opt/local/share/locale\" -c -pipe -O2 -arch i386 -D__I386__ -D__MACOSX__ -fvisibility=hidden -DGTK_DISABLE_DEPRECATED -DDEBUGGER -DNO_GDB -I/opt/local/include/tilp2 -I/opt/local/include/glib-2.0 -I/opt/local/lib/glib-2.0/include -I/opt/local/include   -I/opt/local/include/tilp2 -I/opt/local/include/glib-2.0 -I/opt/local/lib/glib-2.0/include -I/opt/local/include   -I/opt/local/include/tilp2 -I/opt/local/include/glib-2.0 -I/opt/local/lib/glib-2.0/include -I/opt/local/include   -I/opt/local/include/tilp2 -I/opt/local/include/glib-2.0 -I/opt/local/lib/glib-2.0/include -I/opt/local/include   -I/opt/local/include/glib-2.0 -I/opt/local/lib/glib-2.0/include -I/opt/local/include   -D_REENTRANT -I/opt/local/include/gtk-2.0 -I/opt/local/lib/gtk-2.0/include -I/opt/local/include/atk-1.0 -I/opt/local/include/cairo -I/opt/local/include/gdk-pixbuf-2.0 -I/opt/local/include/pango-1.0 -I/opt/local/include/gio-unix-2.0/ -I/opt/local/include -I/opt/local/include/glib-2.0 -I/opt/local/lib/glib-2.0/include -I/opt/local/include/pixman-1 -I/opt/local/include/freetype2 -I/opt/local/include/libpng12   -D_REENTRANT -I/opt/local/include/libglade-2.0 -I/opt/local/include/gtk-2.0 -I/opt/local/include/libxml2 -I/opt/local/lib/gtk-2.0/include -I/opt/local/include/atk-1.0 -I/opt/local/include/cairo -I/opt/local/include/gdk-pixbuf-2.0 -I/opt/local/include/pango-1.0 -I/opt/local/include/gio-unix-2.0/ -I/opt/local/include -I/opt/local/include/glib-2.0 -I/opt/local/lib/glib-2.0/include -I/opt/local/include/pixman-1 -I/opt/local/include/freetype2 -I/opt/local/include/libpng12   -I/opt/local/include/SDL -D_GNU_SOURCE=1 -D_THREAD_SAFE  gui/debugger/dbg_mem.c -o gui/debugger/dbg_mem.o
:info:build gui/debugger/dbg_mem.c: In function 'memmap_menu':
:info:build gui/debugger/dbg_mem.c:543: warning: passing argument 3 of 'g_object_set_data_full' makes pointer from integer without a cast
:info:build gui/debugger/dbg_mem.c:566: warning: passing argument 3 of 'g_object_set_data_full' makes pointer from integer without a cast
:info:build gui/debugger/dbg_mem.c: At top level:
:info:build gui/debugger/dbg_mem.c:596: error: syntax error before 'GtkNotebookPage'
:info:build gui/debugger/dbg_mem.c: In function 'on_notebook1_switch_page':
:info:build gui/debugger/dbg_mem.c:600: error: 'page_num' undeclared (first use in this function)
:info:build gui/debugger/dbg_mem.c:600: error: (Each undeclared identifier is reported only once
:info:build gui/debugger/dbg_mem.c:600: error: for each function it appears in.)
:info:build make[2]: *** [gui/debugger/dbg_mem.o] Error 1
:info:build make[1]: *** [all-recursive] Error 1
:info:build make: *** [all] Error 2
:info:build shell command " cd "/opt/local/var/macports/build/_opt_local_var_macports_sources_rsync.macports.org_release_ports_math_tiemu3/work/tiemu-3.02" && /usr/bin/make -j2 all " returned error 2
:error:build Target org.macports.build returned: shell command failed
:debug:build Backtrace: shell command failed
    while executing
"command_exec build"
    (procedure "portbuild::build_main" line 8)
    invoked from within
"$procedure $targetname"
:info:build Warning: the following items did not execute (for tiemu3): org.macports.activate org.macports.build org.macports.destroot org.macports.install
:notice:build Log for tiemu3 is at: /opt/local/var/macports/logs/_opt_local_var_macports_sources_rsync.macports.org_release_ports_math_tiemu3/main.log

Attachments (1)

main.log (78.0 KB) - added by denis.b.bergeron@… 9 years ago.
complete Log

Download all attachments as: .zip

Change History (5)

Changed 9 years ago by denis.b.bergeron@…

Attachment: main.log added

complete Log

comment:1 Changed 9 years ago by jmroot (Joshua Root)

Description: modified (diff)
Keywords: tiemu integer to pointer removed
Owner: changed from macports-tickets@… to and.damore@…
Port: tiemu3 added

Please remember to preview and use WikiFormatting, fill in the Port field, and cc the maintainer.

comment:2 Changed 9 years ago by anddam (Andrea D'Amore)

Status: newassigned

comment:3 Changed 9 years ago by jwilliams@…

Cc: jwilliams@… added

Cc Me!

comment:4 Changed 9 years ago by anddam (Andrea D'Amore)

Resolution: fixed
Status: assignedclosed

Check this bug and its fix, GTK now hides GtkNotebookPage that has to be replaced.

Committed in r73203 .

Note: See TracTickets for help on using tickets.