Opened 9 years ago

Closed 8 years ago

#27781 closed defect (fixed)

gnome-python-extras @2.25.3_0: 'GDL_TYPE_DOCK_NOTEBOOK' undeclared

Reported by: paolo.fazzi@… Owned by: elelay (Eric Le Lay)
Priority: Normal Milestone:
Component: ports Version: 1.9.2
Keywords: Cc: landonf@…
Port: gnome-python-extras

Description

Computer: MacBook Pro 15" 2.8 GHz Intel Core 2 Duo / 4 GB 1067 MHz DDR3 Memory

Software: Mac OS 10.6.5 SnowLeopard / Xcode 3.2.5 / MacPorts 1.9.2-10.6-SnowLeopard

I have found problem to instal Glom 1.4.2_0 (Glom is an easy-to-use database designer and user interface). The problem is:

Building gnome-python-extras
Error: Target org.macports.build returned: shell command failed (see log for details)
Error: Failed to install gnome-python-extras
Log for gnome-python-extras is at: /opt/local/var/macports/logs/_opt_local_var_macports_sources_rsync.macports.org_release_ports_gnome_gnome-python-extras/main.log
Error: The following dependencies were not installed: gnome-python-extras gnome-session startup-notification xorg-xcb-util upower xorg-libXtst xorg-recordproto libgdamm libgda db44 mysql5 postgresql80 bison libgnomecanvasmm libgtksourceviewmm doxygen coreutils gtksourceview gnuregex libgnomeprint flex libgnomecups libgnomeprintui gnome-icon-theme hicolor-icon-theme icon-naming-utils p5-xml-simple p5-xml-namespacesupport p5-xml-sax p5-xml-sax-expat libgnomemm postgresql81 python24
Error: Status 1 encountered during processing.

Relative Log is:

version:1
:debug:main Executing org.macports.main (gnome-python-extras)
:debug:main Skipping completed org.macports.fetch (gnome-python-extras)
:debug:main Skipping completed org.macports.checksum (gnome-python-extras)
:debug:main setting option extract.cmd to /usr/bin/bzip2
:debug:main Skipping completed org.macports.extract (gnome-python-extras)
:debug:main Skipping completed org.macports.patch (gnome-python-extras)
:debug:main Skipping completed org.macports.configure (gnome-python-extras)
:msg:main --->  Building gnome-python-extras
:debug:build build phase started at Sat Dec 25 18:03:38 CET 2010
:debug:build Executing org.macports.build (gnome-python-extras)
:debug:build Environment: CPATH='/opt/local/include' CC_PRINT_OPTIONS_FILE='/opt/local/var/macports/build/_opt_local_var_macports_sources_rsync.macports.org_release_ports_gnome_gnome-python-extras/work/.CC_PRINT_OPTIONS' LIBRARY_PATH='/opt/local/lib' CC_PRINT_OPTIONS='YES' MACOSX_DEPLOYMENT_TARGET='10.6'
:debug:build Assembled command: 'cd "/opt/local/var/macports/build/_opt_local_var_macports_sources_rsync.macports.org_release_ports_gnome_gnome-python-extras/work/gnome-python-extras-2.25.3" && /usr/bin/make -j2 all'
:info:build /usr/bin/make  all-recursive
:info:build Making all in tests
:info:build make[2]: Nothing to be done for `all'.
:info:build Making all in egg
:info:build Making all in tray
:info:build make[3]: Nothing to be done for `all'.
:info:build Making all in recent
:info:build /usr/bin/make  all-am
:info:build make[4]: Nothing to be done for `all-am'.
:info:build make[3]: Nothing to be done for `all-am'.
:info:build Making all in gtkhtml2
:info:build make[2]: Nothing to be done for `all'.
:info:build Making all in gdl
:info:build /bin/sh ../libtool --tag=CC   --mode=compile /usr/bin/gcc-4.2 -DHAVE_CONFIG_H -I. -I.. -I/opt/local/Library/Frameworks/Python.framework/Versions/2.5/include/python2.5 -D_REENTRANT -I/opt/local/include/libgdl-1.0 -I/opt/local/include/gtk-2.0 -I/opt/local/include/libxml2 -I/opt/local/lib/gtk-2.0/include -I/opt/local/include/atk-1.0 -I/opt/local/include/cairo -I/opt/local/include/gdk-pixbuf-2.0 -I/opt/local/include/pango-1.0 -I/opt/local/include/gio-unix-2.0/ -I/opt/local/include -I/opt/local/include/glib-2.0 -I/opt/local/lib/glib-2.0/include -I/opt/local/include/pixman-1 -I/opt/local/include/freetype2 -I/opt/local/include/libpng12 -I/opt/local/include/pygtk-2.0    -I/opt/local/include  -pipe -O2 -arch x86_64 -Wall -fno-strict-aliasing -MT gdl.lo -MD -MP -MF .deps/gdl.Tpo -c -o gdl.lo gdl.c
:info:build  /usr/bin/gcc-4.2 -DHAVE_CONFIG_H -I. -I.. -I/opt/local/Library/Frameworks/Python.framework/Versions/2.5/include/python2.5 -D_REENTRANT -I/opt/local/include/libgdl-1.0 -I/opt/local/include/gtk-2.0 -I/opt/local/include/libxml2 -I/opt/local/lib/gtk-2.0/include -I/opt/local/include/atk-1.0 -I/opt/local/include/cairo -I/opt/local/include/gdk-pixbuf-2.0 -I/opt/local/include/pango-1.0 -I/opt/local/include/gio-unix-2.0/ -I/opt/local/include -I/opt/local/include/glib-2.0 -I/opt/local/lib/glib-2.0/include -I/opt/local/include/pixman-1 -I/opt/local/include/freetype2 -I/opt/local/include/libpng12 -I/opt/local/include/pygtk-2.0 -I/opt/local/include -pipe -O2 -arch x86_64 -Wall -fno-strict-aliasing -MT gdl.lo -MD -MP -MF .deps/gdl.Tpo -c gdl.c  -fno-common -DPIC -o .libs/gdl.o
:info:build gdl.c: In function '_wrap_gdl_dock_tablabel_activate':
:info:build gdl.c:1530: warning: implicit declaration of function 'gdl_dock_tablabel_activate'
:info:build gdl.c:1530: warning: implicit declaration of function 'GDL_DOCK_TABLABEL'
:info:build gdl.c: In function '_wrap_gdl_dock_tablabel_deactivate':
:info:build gdl.c:1540: warning: implicit declaration of function 'gdl_dock_tablabel_deactivate'
:info:build gdl.c: In function 'pygdl_register_classes':
:info:build gdl.c:1790: error: 'GDL_TYPE_DOCK_NOTEBOOK' undeclared (first use in this function)
:info:build gdl.c:1790: error: (Each undeclared identifier is reported only once
:info:build gdl.c:1790: error: for each function it appears in.)
:info:build gdl.c:1794: error: 'GDL_TYPE_DOCK_PANED' undeclared (first use in this function)
:info:build gdl.c:1797: error: 'GDL_TYPE_DOCK_TABLABEL' undeclared (first use in this function)
:info:build make[2]: *** [gdl.lo] Error 1
:info:build make[1]: *** [all-recursive] Error 1
:info:build make: *** [all] Error 2
:info:build shell command " cd "/opt/local/var/macports/build/_opt_local_var_macports_sources_rsync.macports.org_release_ports_gnome_gnome-python-extras/work/gnome-python-extras-2.25.3" && /usr/bin/make -j2 all " returned error 2
:error:build Target org.macports.build returned: shell command failed (see log for details)
:debug:build Backtrace: shell command failed (see log for details)
    while executing
"command_exec build"
    (procedure "portbuild::build_main" line 8)
    invoked from within
"$procedure $targetname"
:info:build Warning: the following items did not execute (for gnome-python-extras): org.macports.activate org.macports.build org.macports.destroot org.macports.install
:error:build Failed to install gnome-python-extras
:notice:build Log for gnome-python-extras is at: /opt/local/var/macports/logs/_opt_local_var_macports_sources_rsync.macports.org_release_ports_gnome_gnome-python-extras/main.log

I am only a user and I don' t know what I can do. Thanks in advance

Paolo Fazzi

Change History (6)

comment:1 Changed 9 years ago by ryandesign (Ryan Schmidt)

Cc: elelay@… added
Keywords: Failed to install gnome-python-extras/SnowLeopard 10.6.5/Xcode 3.2.5 removed
Owner: changed from macports-tickets@… to landonf@…
Summary: gnome-python-extras@2.25.3_0@Extra Python modules for some GNOME Desktop librariesgnome-python-extras @2.25.3_0: 'GDL_TYPE_DOCK_NOTEBOOK' undeclared

This looks just like #26858 which was reported against gnome-python26-extras; perhaps the fix from there is needed here as well.

comment:2 Changed 9 years ago by mf2k (Frank Schima)

Port: 2.25.3_0 removed

comment:3 Changed 9 years ago by paolo.fazzi@…

I'm sorry, but this information do not help me. I am only a user and I'm not able to solve this problem, whilst I have read a lot of information in the wiki page, ticket reports and guide.

Is there anybody that could show me step by step what I can do?

This is my first experience with MacPorts and I don't know what I can do.

I would like install "Glom" and the relative dependences, but "gnome-python-extras" block the process. I installed "Gnumeric" and other application with success, while I'm not able to install "Glom".

Please help me. Thanks in advance.

Paolo Fazzi

comment:4 in reply to:  1 Changed 9 years ago by otto.hasselblad@…

Replying to ryandesign@…:

This looks just like #26858 which was reported against gnome-python26-extras; perhaps the fix from there is needed here as well.

Yeah, after I modified the portfile to include the gdl patch file mentioned in #26858, the GDL_TYPE_DOCK errors went away and the port built.

comment:5 Changed 9 years ago by elelay (Eric Le Lay)

Owner: changed from landonf@… to elelay@…
Status: newassigned

maintainer timeout. committed the patch in r75361.

Please tell me if it doesn't work.

comment:6 Changed 8 years ago by jmroot (Joshua Root)

Cc: landonf@… added; elelay@… removed
Resolution: fixed
Status: assignedclosed

Assuming fixed.

Note: See TracTickets for help on using tickets.