Opened 9 years ago

Closed 9 years ago

#29098 closed defect (fixed)

gnome-utils @2.30.0 +gsearchtool-entry.o - build failure

Reported by: nevans1@… Owned by: dbevans (David B. Evans)
Priority: Normal Milestone:
Component: ports Version: 1.9.2
Keywords: Cc:
Port: gnome-utils

Description

Making all in libgnomeui-deprecated
  CC    gsearchtool-entry.o
In file included from gsearchtool-entry.c:39:
gsearchtool-entry.h:50: error: expected specifier-qualifier-list before 'GtkComboBoxEntryClass'
gsearchtool-entry.h:55: error: expected specifier-qualifier-list before 'GtkComboBoxEntry'
gsearchtool-entry.c: In function 'gsearch_history_entry_get_type':
gsearchtool-entry.c:63: error: 'GTK_TYPE_COMBO_BOX_ENTRY' undeclared (first use in this function)
gsearchtool-entry.c:63: error: (Each undeclared identifier is reported only once
gsearchtool-entry.c:63: error: for each function it appears in.)
gsearchtool-entry.c: In function 'gsearch_history_entry_set_property':
gsearchtool-entry.c:79: error: 'GsearchHistoryEntry' has no member named 'priv'
gsearchtool-entry.c: In function 'gsearch_history_entry_get_property':
gsearchtool-entry.c:100: error: 'GsearchHistoryEntry' has no member named 'priv'
gsearchtool-entry.c: In function 'gsearch_history_entry_finalize':
gsearchtool-entry.c:128: error: 'GsearchHistoryEntry' has no member named 'priv'
gsearchtool-entry.c: In function 'get_history_key':
gsearchtool-entry.c:199: error: 'GsearchHistoryEntry' has no member named 'priv'
gsearchtool-entry.c: In function 'gsearch_history_entry_save_history':
gsearchtool-entry.c:252: error: 'GsearchHistoryEntry' has no member named 'priv'
gsearchtool-entry.c: In function 'insert_history_item':
gsearchtool-entry.c:341: error: 'GsearchHistoryEntry' has no member named 'priv'
gsearchtool-entry.c: In function 'gsearch_history_entry_load_history':
gsearchtool-entry.c:391: error: 'GsearchHistoryEntry' has no member named 'priv'
gsearchtool-entry.c:399: error: 'GsearchHistoryEntry' has no member named 'priv'
gsearchtool-entry.c: In function 'gsearch_history_entry_init':
gsearchtool-entry.c:434: error: 'GsearchHistoryEntry' has no member named 'priv'
gsearchtool-entry.c: In function 'gsearch_history_entry_set_history_length':
gsearchtool-entry.c:451: error: 'GsearchHistoryEntry' has no member named 'priv'
gsearchtool-entry.c: In function 'gsearch_history_entry_get_history_length':
gsearchtool-entry.c:461: error: 'GsearchHistoryEntry' has no member named 'priv'
gsearchtool-entry.c: In function 'gsearch_history_entry_get_history_id':
gsearchtool-entry.c:469: error: 'GsearchHistoryEntry' has no member named 'priv'
gsearchtool-entry.c: In function 'gsearch_history_entry_set_enable_completion':
gsearchtool-entry.c:480: error: 'GsearchHistoryEntry' has no member named 'priv'
gsearchtool-entry.c:483: error: 'GsearchHistoryEntry' has no member named 'priv'
gsearchtool-entry.c:484: error: 'GsearchHistoryEntry' has no member named 'priv'
gsearchtool-entry.c:488: error: 'GsearchHistoryEntry' has no member named 'priv'
gsearchtool-entry.c:490: error: 'GsearchHistoryEntry' has no member named 'priv'
gsearchtool-entry.c:493: error: 'GsearchHistoryEntry' has no member named 'priv'
gsearchtool-entry.c:494: error: 'GsearchHistoryEntry' has no member named 'priv'
gsearchtool-entry.c:498: error: 'GsearchHistoryEntry' has no member named 'priv'
gsearchtool-entry.c:502: error: 'GsearchHistoryEntry' has no member named 'priv'
gsearchtool-entry.c:508: error: 'GsearchHistoryEntry' has no member named 'priv'
gsearchtool-entry.c:510: error: 'GsearchHistoryEntry' has no member named 'priv'
gsearchtool-entry.c: In function 'gsearch_history_entry_get_enable_completion':
gsearchtool-entry.c:519: error: 'GsearchHistoryEntry' has no member named 'priv'
make[3]: *** [libgnomeui_deprecated_la-gsearchtool-entry.lo] Error 1
make[2]: *** [all-recursive] Error 1
make[1]: *** [all-recursive] Error 1
make: *** [all] Error 2
shell command " cd "/opt/local/var/macports/build/_opt_local_var_macports_sources_rsync.macports.org_release_ports_gnome_gnome-utils/work/gnome-utils-2.30.0" && /usr/bin/make -j2 all " returned error 2
Error: Target org.macports.build returned: shell command failed (see log for details)
Warning: the following items did not execute (for gnome-utils): org.macports.activate org.macports.build org.macports.destroot org.macports.install
Log for gnome-utils is at: /opt/local/var/macports/logs/_opt_local_var_macports_sources_rsync.macports.org_release_ports_gnome_gnome-utils/main.log
Error: Status 1 encountered during processing.
To report a bug, see <http://guide.macports.org/#project.tickets>
sh-3.2# 

Change History (4)

comment:1 Changed 9 years ago by nevans1@…

Cc: nevans1@… added

Cc Me!

comment:2 Changed 9 years ago by ryandesign (Ryan Schmidt)

Cc: nevans1@… removed
Owner: changed from macports-tickets@… to devans@…
Port: gnome-utils added

comment:3 Changed 9 years ago by dbevans (David B. Evans)

Status: newassigned

comment:4 Changed 9 years ago by dbevans (David B. Evans)

Resolution: fixed
Status: assignedclosed

Fix committed in r77771. Thanks.

Note: See TracTickets for help on using tickets.