Opened 8 years ago

Closed 8 years ago

#29558 closed update (fixed)

awesome @3.4.10 update

Reported by: jwatzman@… Owned by: milosh@…
Priority: Normal Milestone:
Component: ports Version:
Keywords: haspatch Cc: jeremyhu (Jeremy Huddleston Sequoia)
Port: awesome

Description

I'm very new to MacPorts, so I apologize if this tickets has improper form. Attached are a Portfile diff and new source code diff to bring awesome up to version 3.4.10. This should fix bugs #28946 and #28081.

I had to hack around a problem with iconv; not sure what the problem is. And I had to explicitly build cairo with xcb, but from my brief looking at the bugtracker that is a known problem with no good solution.

It complains about dbus on launch, which I'm pretty sure I have running on my machine. It can't find the default config either. I reused/modified an existing config I had, but note that the default config includes some keycode keyboard bindings that do not work on OS X. I reported that bug upstream:

https://awesome.naquadah.org/bugs/index.php?do=details&task_id=909

Reverting the git commit in that bug report fixes the problem. Other than that, it seems to work beautifully!

Attachments (3)

patch-CMakeLists.txt.diff (354 bytes) - added by jwatzman@… 8 years ago.
new source code diff
patch-upstream-xcb.diff (22.5 KB) - added by jwatzman@… 8 years ago.
upstream diff to fix with xcb-util 0.3.8
Portfile.diff (1.5 KB) - added by jwatzman@… 8 years ago.
portfile diff 3.4.4 -> 3.4.10

Download all attachments as: .zip

Change History (13)

comment:1 Changed 8 years ago by jmroot (Joshua Root)

Cc: milosh removed
Keywords: haspatch added
Owner: changed from macports-tickets@… to milosh@…
Port: awesome added
Version: 1.9.2

Bare usernames do not work in the cc field; you have to use complete email addresses. Also please fill in the Port field in future.

comment:2 Changed 8 years ago by timelzayus@…

Well, th patch did help for the configure, but the build fails :

Building…
Scanning dependencies of target generated_sources
Scanning dependencies of target generated_icons
[  0%] [  0%] [  0%] [  0%] Generating atoms-intern.h
Generating themes/default/titlebar/floating_normal_active.png
Generating atoms-extern.h
Generating themes/default/titlebar/close_normal.png
[  0%] [  0%] [  0%] [  0%] Generating common/tokenize.c
Generating common/tokenize.h
Generating themes/default/titlebar/maximized_normal_active.png
Generating themes/default/titlebar/ontop_normal_active.png
[  0%] [  0%] Generating themes/default/titlebar/sticky_normal_active.png
[  0%] Generating themes/zenburn/titlebar/close_normal.png
Generating themes/zenburn/titlebar/floating_normal_active.png
[  0%] [  0%] [  0%] Generating themes/zenburn/titlebar/maximized_normal_active.png
Generating themes/zenburn/titlebar/ontop_normal_active.png
Generating themes/zenburn/titlebar/sticky_normal_active.png
[  0%] [  0%] [  0%] Generating themes/default/titlebar/floating_focus_inactive.png
Generating themes/default/titlebar/maximized_focus_inactive.png
Generating themes/default/titlebar/ontop_focus_inactive.png
[  0%] [  0%] [  0%] Generating themes/default/titlebar/sticky_focus_inactive.png
Generating themes/zenburn/titlebar/floating_focus_inactive.png
Generating themes/zenburn/titlebar/maximized_focus_inactive.png
[  0%] [  0%] [  0%] Generating themes/zenburn/titlebar/ontop_focus_inactive.png
Generating themes/default/titlebar/floating_normal_inactive.png
Generating themes/zenburn/titlebar/sticky_focus_inactive.png
[  0%] [  0%] [  0%] Generating themes/default/titlebar/maximized_normal_inactive.png
Generating themes/default/titlebar/ontop_normal_inactive.png
Generating themes/default/titlebar/sticky_normal_inactive.png
[  0%] [  0%] [  0%] Generating themes/zenburn/titlebar/floating_normal_inactive.png
Generating themes/zenburn/titlebar/maximized_normal_inactive.png
Generating themes/zenburn/titlebar/ontop_normal_inactive.png
incorrect gamma=(0/100000)
incorrect gamma=(0/100000)
convert: Ignoring incorrect gAMA value when sRGB is also present `themes/zenburn/titlebar/floating_normal_active.png' @ warning/png.c/MagickPNGWarningHandler/1335.
incorrect gamma=(0/100000)
convert: Ignoring incorrect gAMA value when sRGB is also present `themes/zenburn/titlebar/maximized_normal_active.png' @ warning/png.c/MagickPNGWarningHandler/1335.
convert: Ignoring incorrect gAMA value when sRGB is also present `themes/zenburn/titlebar/ontop_normal_active.png' @ warning/png.c/MagickPNGWarningHandler/1335.
[  0%] Generating themes/zenburn/titlebar/sticky_normal_inactive.png
incorrect gamma=(0/100000)
convert: Ignoring incorrect gAMA value when sRGB is also present `themes/zenburn/titlebar/sticky_normal_active.png' @ warning/png.c/MagickPNGWarningHandler/1335.
[ 33%] Built target generated_icons
[ 38%] Built target generated_sources
Scanning dependencies of target awesome
[ 39%] [ 41%] [ 42%] [ 43%] Building C object CMakeFiles/awesome.dir/client.c.o
Building C object CMakeFiles/awesome.dir/awesome.c.o
Building C object CMakeFiles/awesome.dir/dbus.c.o
Building C object CMakeFiles/awesome.dir/strut.c.o
In file included from /opt/local/var/macports/build/_opt_local_var_macports_sources_rsync.macports.org_release_ports_x11_awesome/work/awesome-3.4.10/dbus.c:28:
/opt/local/include/ev.h: In function 'ev_is_default_loop':
/opt/local/include/ev.h:495: warning: redundant redeclaration of 'ev_default_loop_ptr'
/opt/local/include/ev.h:449: warning: previous declaration of 'ev_default_loop_ptr' was here
In file included from /opt/local/var/macports/build/_opt_local_var_macports_sources_rsync.macports.org_release_ports_x11_awesome/work/awesome-3.4.10/dbus.c:28:
/opt/local/include/ev.h:547:6: warning: "EV_MINIMAL" is not defined
In file included from /opt/local/var/macports/build/_opt_local_var_macports_sources_rsync.macports.org_release_ports_x11_awesome/work/awesome-3.4.10/luaa.h:25,
                 from /opt/local/var/macports/build/_opt_local_var_macports_sources_rsync.macports.org_release_ports_x11_awesome/work/awesome-3.4.10/strut.c:23:
/opt/local/include/ev.h: In function 'ev_is_default_loop':
/opt/local/include/ev.h:495: warning: redundant redeclaration of 'ev_default_loop_ptr'
/opt/local/include/ev.h:449: warning: previous declaration of 'ev_default_loop_ptr' was here
In file included from /opt/local/var/macports/build/_opt_local_var_macports_sources_rsync.macports.org_release_ports_x11_awesome/work/awesome-3.4.10/luaa.h:25,
                 from /opt/local/var/macports/build/_opt_local_var_macports_sources_rsync.macports.org_release_ports_x11_awesome/work/awesome-3.4.10/strut.c:23:
/opt/local/include/ev.h:547:6: warning: "EV_MINIMAL" is not defined
In file included from /opt/local/var/macports/build/_opt_local_var_macports_sources_rsync.macports.org_release_ports_x11_awesome/work/awesome-3.4.10/globalconf.h:28,
                 from /opt/local/var/macports/build/_opt_local_var_macports_sources_rsync.macports.org_release_ports_x11_awesome/work/awesome-3.4.10/stack.h:25,
                 from /opt/local/var/macports/build/_opt_local_var_macports_sources_rsync.macports.org_release_ports_x11_awesome/work/awesome-3.4.10/client.h:26,
                 from /opt/local/var/macports/build/_opt_local_var_macports_sources_rsync.macports.org_release_ports_x11_awesome/work/awesome-3.4.10/tag.h:25,
                 from /opt/local/var/macports/build/_opt_local_var_macports_sources_rsync.macports.org_release_ports_x11_awesome/work/awesome-3.4.10/client.c:25:
/opt/local/include/ev.h: In function 'ev_is_default_loop':
/opt/local/include/ev.h:495: warning: redundant redeclaration of 'ev_default_loop_ptr'
/opt/local/include/ev.h:449: warning: previous declaration of 'ev_default_loop_ptr' was here
In file included from /opt/local/var/macports/build/_opt_local_var_macports_sources_rsync.macports.org_release_ports_x11_awesome/work/awesome-3.4.10/globalconf.h:28,
                 from /opt/local/var/macports/build/_opt_local_var_macports_sources_rsync.macports.org_release_ports_x11_awesome/work/awesome-3.4.10/stack.h:25,
                 from /opt/local/var/macports/build/_opt_local_var_macports_sources_rsync.macports.org_release_ports_x11_awesome/work/awesome-3.4.10/client.h:26,
                 from /opt/local/var/macports/build/_opt_local_var_macports_sources_rsync.macports.org_release_ports_x11_awesome/work/awesome-3.4.10/tag.h:25,
                 from /opt/local/var/macports/build/_opt_local_var_macports_sources_rsync.macports.org_release_ports_x11_awesome/work/awesome-3.4.10/client.c:25:
/opt/local/include/ev.h:547:6: warning: "EV_MINIMAL" is not defined
In file included from /opt/local/var/macports/build/_opt_local_var_macports_sources_rsync.macports.org_release_ports_x11_awesome/work/awesome-3.4.10/globalconf.h:28,
                 from /opt/local/var/macports/build/_opt_local_var_macports_sources_rsync.macports.org_release_ports_x11_awesome/work/awesome-3.4.10/spawn.h:25,
                 from /opt/local/var/macports/build/_opt_local_var_macports_sources_rsync.macports.org_release_ports_x11_awesome/work/awesome-3.4.10/awesome.c:37:
/opt/local/include/ev.h: In function 'ev_is_default_loop':
/opt/local/include/ev.h:495: warning: redundant redeclaration of 'ev_default_loop_ptr'
/opt/local/include/ev.h:449: warning: previous declaration of 'ev_default_loop_ptr' was here
In file included from /opt/local/var/macports/build/_opt_local_var_macports_sources_rsync.macports.org_release_ports_x11_awesome/work/awesome-3.4.10/globalconf.h:28,
                 from /opt/local/var/macports/build/_opt_local_var_macports_sources_rsync.macports.org_release_ports_x11_awesome/work/awesome-3.4.10/spawn.h:25,
                 from /opt/local/var/macports/build/_opt_local_var_macports_sources_rsync.macports.org_release_ports_x11_awesome/work/awesome-3.4.10/awesome.c:37:
/opt/local/include/ev.h:547:6: warning: "EV_MINIMAL" is not defined
In file included from /opt/local/var/macports/build/_opt_local_var_macports_sources_rsync.macports.org_release_ports_x11_awesome/work/awesome-3.4.10/tag.h:25,
                 from /opt/local/var/macports/build/_opt_local_var_macports_sources_rsync.macports.org_release_ports_x11_awesome/work/awesome-3.4.10/client.c:25:
/opt/local/var/macports/build/_opt_local_var_macports_sources_rsync.macports.org_release_ports_x11_awesome/work/awesome-3.4.10/client.h: At top level:
/opt/local/var/macports/build/_opt_local_var_macports_sources_rsync.macports.org_release_ports_x11_awesome/work/awesome-3.4.10/client.h:126: error: expected specifier-qualifier-list before 'xcb_get_wm_protocols_reply_t'
/opt/local/var/macports/build/_opt_local_var_macports_sources_rsync.macports.org_release_ports_x11_awesome/work/awesome-3.4.10/client.h: In function 'client_raise':
/opt/local/var/macports/build/_opt_local_var_macports_sources_rsync.macports.org_release_ports_x11_awesome/work/awesome-3.4.10/client.h:227: error: 'client_t' has no member named 'transient_for'
/opt/local/var/macports/build/_opt_local_var_macports_sources_rsync.macports.org_release_ports_x11_awesome/work/awesome-3.4.10/client.h:228: error: 'client_t' has no member named 'transient_for'
/opt/local/var/macports/build/_opt_local_var_macports_sources_rsync.macports.org_release_ports_x11_awesome/work/awesome-3.4.10/client.h:235: error: 'client_t' has no member named 'transient_for'
/opt/local/var/macports/build/_opt_local_var_macports_sources_rsync.macports.org_release_ports_x11_awesome/work/awesome-3.4.10/client.h: In function 'client_isfixed':
/opt/local/var/macports/build/_opt_local_var_macports_sources_rsync.macports.org_release_ports_x11_awesome/work/awesome-3.4.10/client.h:251: error: 'client_t' has no member named 'size_hints'
/opt/local/var/macports/build/_opt_local_var_macports_sources_rsync.macports.org_release_ports_x11_awesome/work/awesome-3.4.10/client.h:251: error: 'XCB_SIZE_HINT_P_MAX_SIZE' undeclared (first use in this function)
/opt/local/var/macports/build/_opt_local_var_macports_sources_rsync.macports.org_release_ports_x11_awesome/work/awesome-3.4.10/client.h:251: error: (Each undeclared identifier is reported only once
/opt/local/var/macports/build/_opt_local_var_macports_sources_rsync.macports.org_release_ports_x11_awesome/work/awesome-3.4.10/client.h:251: error: for each function it appears in.)
/opt/local/var/macports/build/_opt_local_var_macports_sources_rsync.macports.org_release_ports_x11_awesome/work/awesome-3.4.10/client.h:252: error: 'client_t' has no member named 'size_hints'
/opt/local/var/macports/build/_opt_local_var_macports_sources_rsync.macports.org_release_ports_x11_awesome/work/awesome-3.4.10/client.h:252: error: 'XCB_SIZE_HINT_P_MIN_SIZE' undeclared (first use in this function)
/opt/local/var/macports/build/_opt_local_var_macports_sources_rsync.macports.org_release_ports_x11_awesome/work/awesome-3.4.10/client.h:253: error: 'client_t' has no member named 'size_hints'
/opt/local/var/macports/build/_opt_local_var_macports_sources_rsync.macports.org_release_ports_x11_awesome/work/awesome-3.4.10/client.h:253: error: 'client_t' has no member named 'size_hints'
/opt/local/var/macports/build/_opt_local_var_macports_sources_rsync.macports.org_release_ports_x11_awesome/work/awesome-3.4.10/client.h:254: error: 'client_t' has no member named 'size_hints'
/opt/local/var/macports/build/_opt_local_var_macports_sources_rsync.macports.org_release_ports_x11_awesome/work/awesome-3.4.10/client.h:254: error: 'client_t' has no member named 'size_hints'
/opt/local/var/macports/build/_opt_local_var_macports_sources_rsync.macports.org_release_ports_x11_awesome/work/awesome-3.4.10/client.h:255: error: 'client_t' has no member named 'size_hints'
/opt/local/var/macports/build/_opt_local_var_macports_sources_rsync.macports.org_release_ports_x11_awesome/work/awesome-3.4.10/client.h:256: error: 'client_t' has no member named 'size_hints'
/opt/local/var/macports/build/_opt_local_var_macports_sources_rsync.macports.org_release_ports_x11_awesome/work/awesome-3.4.10/client.h:257: error: 'client_t' has no member named 'size_hints_honor'
In file included from /opt/local/var/macports/build/_opt_local_var_macports_sources_rsync.macports.org_release_ports_x11_awesome/work/awesome-3.4.10/client.c:28:
/opt/local/var/macports/build/_opt_local_var_macports_sources_rsync.macports.org_release_ports_x11_awesome/work/awesome-3.4.10/titlebar.h: In function 'titlebar_isvisible':
/opt/local/var/macports/build/_opt_local_var_macports_sources_rsync.macports.org_release_ports_x11_awesome/work/awesome-3.4.10/titlebar.h:48: error: 'client_t' has no member named 'titlebar'
/opt/local/var/macports/build/_opt_local_var_macports_sources_rsync.macports.org_release_ports_x11_awesome/work/awesome-3.4.10/titlebar.h:48: error: 'client_t' has no member named 'titlebar'
/opt/local/var/macports/build/_opt_local_var_macports_sources_rsync.macports.org_release_ports_x11_awesome/work/awesome-3.4.10/titlebar.h: In function 'titlebar_update_geometry':
/opt/local/var/macports/build/_opt_local_var_macports_sources_rsync.macports.org_release_ports_x11_awesome/work/awesome-3.4.10/titlebar.h:145: error: 'client_t' has no member named 'titlebar'
/opt/local/var/macports/build/_opt_local_var_macports_sources_rsync.macports.org_release_ports_x11_awesome/work/awesome-3.4.10/titlebar.h:149: error: 'client_t' has no member named 'titlebar'
/opt/local/var/macports/build/_opt_local_var_macports_sources_rsync.macports.org_release_ports_x11_awesome/work/awesome-3.4.10/titlebar.h:150: error: 'client_t' has no member named 'titlebar'
/opt/local/var/macports/build/_opt_local_var_macports_sources_rsync.macports.org_release_ports_x11_awesome/work/awesome-3.4.10/client.c: In function 'luaA_client_gc':
/opt/local/var/macports/build/_opt_local_var_macports_sources_rsync.macports.org_release_ports_x11_awesome/work/awesome-3.4.10/client.c:53: error: 'client_t' has no member named 'buttons'
/opt/local/var/macports/build/_opt_local_var_macports_sources_rsync.macports.org_release_ports_x11_awesome/work/awesome-3.4.10/client.c:54: error: 'client_t' has no member named 'keys'
/opt/local/var/macports/build/_opt_local_var_macports_sources_rsync.macports.org_release_ports_x11_awesome/work/awesome-3.4.10/client.c:55: warning: implicit declaration of function 'xcb_get_wm_protocols_reply_wipe'
/opt/local/var/macports/build/_opt_local_var_macports_sources_rsync.macports.org_release_ports_x11_awesome/work/awesome-3.4.10/client.c:55: error: 'client_t' has no member named 'protocols'
/opt/local/var/macports/build/_opt_local_var_macports_sources_rsync.macports.org_release_ports_x11_awesome/work/awesome-3.4.10/client.c:56: error: 'client_t' has no member named 'machine'
/opt/local/var/macports/build/_opt_local_var_macports_sources_rsync.macports.org_release_ports_x11_awesome/work/awesome-3.4.10/client.c:56: warning: type defaults to 'int' in declaration of '__ptr'
/opt/local/var/macports/build/_opt_local_var_macports_sources_rsync.macports.org_release_ports_x11_awesome/work/awesome-3.4.10/client.c:56: error: 'client_t' has no member named 'machine'
/opt/local/var/macports/build/_opt_local_var_macports_sources_rsync.macports.org_release_ports_x11_awesome/work/awesome-3.4.10/client.c: In function 'client_set_opacity':
/opt/local/var/macports/build/_opt_local_var_macports_sources_rsync.macports.org_release_ports_x11_awesome/work/awesome-3.4.10/client.c:76: error: 'client_t' has no member named 'opacity'
/opt/local/var/macports/build/_opt_local_var_macports_sources_rsync.macports.org_release_ports_x11_awesome/work/awesome-3.4.10/client.c:78: error: 'client_t' has no member named 'opacity'
/opt/local/var/macports/build/_opt_local_var_macports_sources_rsync.macports.org_release_ports_x11_awesome/work/awesome-3.4.10/client.c: In function 'client_set_urgent':
/opt/local/var/macports/build/_opt_local_var_macports_sources_rsync.macports.org_release_ports_x11_awesome/work/awesome-3.4.10/client.c:97: warning: implicit declaration of function 'xcb_get_wm_hints_unchecked'
/opt/local/var/macports/build/_opt_local_var_macports_sources_rsync.macports.org_release_ports_x11_awesome/work/awesome-3.4.10/client.c:97: error: invalid initializer
/opt/local/var/macports/build/_opt_local_var_macports_sources_rsync.macports.org_release_ports_x11_awesome/work/awesome-3.4.10/client.c:103: error: 'xcb_wm_hints_t' undeclared (first use in this function)
/opt/local/var/macports/build/_opt_local_var_macports_sources_rsync.macports.org_release_ports_x11_awesome/work/awesome-3.4.10/client.c:103: error: expected ';' before 'wmh'
/opt/local/var/macports/build/_opt_local_var_macports_sources_rsync.macports.org_release_ports_x11_awesome/work/awesome-3.4.10/client.c:104: warning: implicit declaration of function 'xcb_get_wm_hints_reply'
/opt/local/var/macports/build/_opt_local_var_macports_sources_rsync.macports.org_release_ports_x11_awesome/work/awesome-3.4.10/client.c:104: error: 'wmh' undeclared (first use in this function)
/opt/local/var/macports/build/_opt_local_var_macports_sources_rsync.macports.org_release_ports_x11_awesome/work/awesome-3.4.10/client.c:107: error: 'XCB_WM_HINT_X_URGENCY' undeclared (first use in this function)
/opt/local/var/macports/build/_opt_local_var_macports_sources_rsync.macports.org_release_ports_x11_awesome/work/awesome-3.4.10/client.c:111: warning: implicit declaration of function 'xcb_set_wm_hints'
In file included from /opt/local/var/macports/build/_opt_local_var_macports_sources_rsync.macports.org_release_ports_x11_awesome/work/awesome-3.4.10/event.h:27,
                 from /opt/local/var/macports/build/_opt_local_var_macports_sources_rsync.macports.org_release_ports_x11_awesome/work/awesome-3.4.10/dbus.c:33:
/opt/local/var/macports/build/_opt_local_var_macports_sources_rsync.macports.org_release_ports_x11_awesome/work/awesome-3.4.10/client.h: At top level:
/opt/local/var/macports/build/_opt_local_var_macports_sources_rsync.macports.org_release_ports_x11_awesome/work/awesome-3.4.10/client.h:126: error: expected specifier-qualifier-list before 'xcb_get_wm_protocols_reply_t'
/opt/local/var/macports/build/_opt_local_var_macports_sources_rsync.macports.org_release_ports_x11_awesome/work/awesome-3.4.10/client.c: In function 'client_set_pid':
/opt/local/var/macports/build/_opt_local_var_macports_sources_rsync.macports.org_release_ports_x11_awesome/work/awesome-3.4.10/client.c:147: error: 'client_t' has no member named 'pid'
/opt/local/var/macports/build/_opt_local_var_macports_sources_rsync.macports.org_release_ports_x11_awesome/work/awesome-3.4.10/client.c:149: error: 'client_t' has no member named 'pid'
/opt/local/var/macports/build/_opt_local_var_macports_sources_rsync.macports.org_release_ports_x11_awesome/work/awesome-3.4.10/client.c: In function 'client_set_role':
/opt/local/var/macports/build/_opt_local_var_macports_sources_rsync.macports.org_release_ports_x11_awesome/work/awesome-3.4.10/client.c:178: error: 'client_t' has no member named 'role'
/opt/local/var/macports/build/_opt_local_var_macports_sources_rsync.macports.org_release_ports_x11_awesome/work/awesome-3.4.10/client.c:178: warning: type defaults to 'int' in declaration of '__ptr'
/opt/local/var/macports/build/_opt_local_var_macports_sources_rsync.macports.org_release_ports_x11_awesome/work/awesome-3.4.10/client.c:178: error: 'client_t' has no member named 'role'
/opt/local/var/macports/build/_opt_local_var_macports_sources_rsync.macports.org_release_ports_x11_awesome/work/awesome-3.4.10/client.c:179: error: 'client_t' has no member named 'role'
/opt/local/var/macports/build/_opt_local_var_macports_sources_rsync.macports.org_release_ports_x11_awesome/work/awesome-3.4.10/client.c: In function 'client_set_machine':
/opt/local/var/macports/build/_opt_local_var_macports_sources_rsync.macports.org_release_ports_x11_awesome/work/awesome-3.4.10/client.c:187: error: 'client_t' has no member named 'machine'
/opt/local/var/macports/build/_opt_local_var_macports_sources_rsync.macports.org_release_ports_x11_awesome/work/awesome-3.4.10/client.c:187: warning: type defaults to 'int' in declaration of '__ptr'
/opt/local/var/macports/build/_opt_local_var_macports_sources_rsync.macports.org_release_ports_x11_awesome/work/awesome-3.4.10/client.c:187: error: 'client_t' has no member named 'machine'
/opt/local/var/macports/build/_opt_local_var_macports_sources_rsync.macports.org_release_ports_x11_awesome/work/awesome-3.4.10/client.c:188: error: 'client_t' has no member named 'machine'
/opt/local/var/macports/build/_opt_local_var_macports_sources_rsync.macports.org_release_ports_x11_awesome/work/awesome-3.4.10/client.c: In function 'client_set_transient_for':
/opt/local/var/macports/build/_opt_local_var_macports_sources_rsync.macports.org_release_ports_x11_awesome/work/awesome-3.4.10/client.c:209: error: 'client_t' has no member named 'transient_for'
/opt/local/var/macports/build/_opt_local_var_macports_sources_rsync.macports.org_release_ports_x11_awesome/work/awesome-3.4.10/client.c:211: error: 'client_t' has no member named 'transient_for'
/opt/local/var/macports/build/_opt_local_var_macports_sources_rsync.macports.org_release_ports_x11_awesome/work/awesome-3.4.10/client.c: In function 'client_maybevisible':
/opt/local/var/macports/build/_opt_local_var_macports_sources_rsync.macports.org_release_ports_x11_awesome/work/awesome-3.4.10/client.c:245: error: 'client_t' has no member named 'screen'
/opt/local/var/macports/build/_opt_local_var_macports_sources_rsync.macports.org_release_ports_x11_awesome/work/awesome-3.4.10/client.h: In function 'client_raise':
/opt/local/var/macports/build/_opt_local_var_macports_sources_rsync.macports.org_release_ports_x11_awesome/work/awesome-3.4.10/client.h:227: error: 'client_t' has no member named 'transient_for'
/opt/local/var/macports/build/_opt_local_var_macports_sources_rsync.macports.org_release_ports_x11_awesome/work/awesome-3.4.10/client.h:228: error: 'client_t' has no member named 'transient_for'
/opt/local/var/macports/build/_opt_local_var_macports_sources_rsync.macports.org_release_ports_x11_awesome/work/awesome-3.4.10/client.h:235: error: 'client_t' has no member named 'transient_for'
/opt/local/var/macports/build/_opt_local_var_macports_sources_rsync.macports.org_release_ports_x11_awesome/work/awesome-3.4.10/client.c: In function 'client_unfocus_update':
/opt/local/var/macports/build/_opt_local_var_macports_sources_rsync.macports.org_release_ports_x11_awesome/work/awesome-3.4.10/client.c:277: error: 'client_t' has no member named 'phys_screen'
/opt/local/var/macports/build/_opt_local_var_macports_sources_rsync.macports.org_release_ports_x11_awesome/work/awesome-3.4.10/client.c:278: error: 'client_t' has no member named 'phys_screen'
/opt/local/var/macports/build/_opt_local_var_macports_sources_rsync.macports.org_release_ports_x11_awesome/work/awesome-3.4.10/client.h: In function 'client_isfixed':
/opt/local/var/macports/build/_opt_local_var_macports_sources_rsync.macports.org_release_ports_x11_awesome/work/awesome-3.4.10/client.h:251: error: 'client_t' has no member named 'size_hints'
/opt/local/var/macports/build/_opt_local_var_macports_sources_rsync.macports.org_release_ports_x11_awesome/work/awesome-3.4.10/client.h:251: error: 'XCB_SIZE_HINT_P_MAX_SIZE' undeclared (first use in this function)
/opt/local/var/macports/build/_opt_local_var_macports_sources_rsync.macports.org_release_ports_x11_awesome/work/awesome-3.4.10/client.h:251: error: (Each undeclared identifier is reported only once
/opt/local/var/macports/build/_opt_local_var_macports_sources_rsync.macports.org_release_ports_x11_awesome/work/awesome-3.4.10/client.h:251: error: for each function it appears in.)
/opt/local/var/macports/build/_opt_local_var_macports_sources_rsync.macports.org_release_ports_x11_awesome/work/awesome-3.4.10/client.h:252: error: 'client_t' has no member named 'size_hints'
/opt/local/var/macports/build/_opt_local_var_macports_sources_rsync.macports.org_release_ports_x11_awesome/work/awesome-3.4.10/client.h:252: error: 'XCB_SIZE_HINT_P_MIN_SIZE' undeclared (first use in this function)
/opt/local/var/macports/build/_opt_local_var_macports_sources_rsync.macports.org_release_ports_x11_awesome/work/awesome-3.4.10/client.h:253: error: 'client_t' has no member named 'size_hints'
/opt/local/var/macports/build/_opt_local_var_macports_sources_rsync.macports.org_release_ports_x11_awesome/work/awesome-3.4.10/client.h:253: error: 'client_t' has no member named 'size_hints'
/opt/local/var/macports/build/_opt_local_var_macports_sources_rsync.macports.org_release_ports_x11_awesome/work/awesome-3.4.10/client.h:254: error: 'client_t' has no member named 'size_hints'
/opt/local/var/macports/build/_opt_local_var_macports_sources_rsync.macports.org_release_ports_x11_awesome/work/awesome-3.4.10/client.h:254: error: 'client_t' has no member named 'size_hints'
/opt/local/var/macports/build/_opt_local_var_macports_sources_rsync.macports.org_release_ports_x11_awesome/work/awesome-3.4.10/client.h:255: error: 'client_t' has no member named 'size_hints'
/opt/local/var/macports/build/_opt_local_var_macports_sources_rsync.macports.org_release_ports_x11_awesome/work/awesome-3.4.10/client.h:256: error: 'client_t' has no member named 'size_hints'
/opt/local/var/macports/build/_opt_local_var_macports_sources_rsync.macports.org_release_ports_x11_awesome/work/awesome-3.4.10/client.h:257: error: 'client_t' has no member named 'size_hints_honor'
/opt/local/var/macports/build/_opt_local_var_macports_sources_rsync.macports.org_release_ports_x11_awesome/work/awesome-3.4.10/client.c: In function 'client_unfocus':
/opt/local/var/macports/build/_opt_local_var_macports_sources_rsync.macports.org_release_ports_x11_awesome/work/awesome-3.4.10/client.c:298: error: 'client_t' has no member named 'phys_screen'
/opt/local/var/macports/build/_opt_local_var_macports_sources_rsync.macports.org_release_ports_x11_awesome/work/awesome-3.4.10/client.c: In function 'client_hasproto':
/opt/local/var/macports/build/_opt_local_var_macports_sources_rsync.macports.org_release_ports_x11_awesome/work/awesome-3.4.10/client.c:317: error: 'client_t' has no member named 'protocols'
/opt/local/var/macports/build/_opt_local_var_macports_sources_rsync.macports.org_release_ports_x11_awesome/work/awesome-3.4.10/client.c:318: error: 'client_t' has no member named 'protocols'
/opt/local/var/macports/build/_opt_local_var_macports_sources_rsync.macports.org_release_ports_x11_awesome/work/awesome-3.4.10/client.c: In function 'client_ban_unfocus':
/opt/local/var/macports/build/_opt_local_var_macports_sources_rsync.macports.org_release_ports_x11_awesome/work/awesome-3.4.10/client.c:343: error: 'client_t' has no member named 'phys_screen'
/opt/local/var/macports/build/_opt_local_var_macports_sources_rsync.macports.org_release_ports_x11_awesome/work/awesome-3.4.10/client.c:344: error: 'client_t' has no member named 'phys_screen'
/opt/local/var/macports/build/_opt_local_var_macports_sources_rsync.macports.org_release_ports_x11_awesome/work/awesome-3.4.10/client.c:347: error: 'client_t' has no member named 'phys_screen'
/opt/local/var/macports/build/_opt_local_var_macports_sources_rsync.macports.org_release_ports_x11_awesome/work/awesome-3.4.10/client.c: In function 'client_focus_update':
/opt/local/var/macports/build/_opt_local_var_macports_sources_rsync.macports.org_release_ports_x11_awesome/work/awesome-3.4.10/client.c:396: error: 'client_t' has no member named 'screen'
/opt/local/var/macports/build/_opt_local_var_macports_sources_rsync.macports.org_release_ports_x11_awesome/work/awesome-3.4.10/client.c:413: error: 'client_t' has no member named 'phys_screen'
/opt/local/var/macports/build/_opt_local_var_macports_sources_rsync.macports.org_release_ports_x11_awesome/work/awesome-3.4.10/client.c:421: error: 'client_t' has no member named 'phys_screen'
/opt/local/var/macports/build/_opt_local_var_macports_sources_rsync.macports.org_release_ports_x11_awesome/work/awesome-3.4.10/client.c: In function 'client_focus':
/opt/local/var/macports/build/_opt_local_var_macports_sources_rsync.macports.org_release_ports_x11_awesome/work/awesome-3.4.10/client.c:443: error: 'client_t' has no member named 'screen'
/opt/local/var/macports/build/_opt_local_var_macports_sources_rsync.macports.org_release_ports_x11_awesome/work/awesome-3.4.10/client.c: In function 'client_stack_above':
/opt/local/var/macports/build/_opt_local_var_macports_sources_rsync.macports.org_release_ports_x11_awesome/work/awesome-3.4.10/client.c:474: error: 'client_t' has no member named 'titlebar'
/opt/local/var/macports/build/_opt_local_var_macports_sources_rsync.macports.org_release_ports_x11_awesome/work/awesome-3.4.10/client.c:477: error: 'client_t' has no member named 'titlebar'
/opt/local/var/macports/build/_opt_local_var_macports_sources_rsync.macports.org_release_ports_x11_awesome/work/awesome-3.4.10/client.c:480: error: 'client_t' has no member named 'titlebar'
/opt/local/var/macports/build/_opt_local_var_macports_sources_rsync.macports.org_release_ports_x11_awesome/work/awesome-3.4.10/client.c:487: error: 'client_t' has no member named 'transient_for'
/opt/local/var/macports/build/_opt_local_var_macports_sources_rsync.macports.org_release_ports_x11_awesome/work/awesome-3.4.10/client.c: In function 'client_layer_translator':
/opt/local/var/macports/build/_opt_local_var_macports_sources_rsync.macports.org_release_ports_x11_awesome/work/awesome-3.4.10/client.c:526: error: 'client_t' has no member named 'transient_for'
/opt/local/var/macports/build/_opt_local_var_macports_sources_rsync.macports.org_release_ports_x11_awesome/work/awesome-3.4.10/client.c: In function 'client_manage':
/opt/local/var/macports/build/_opt_local_var_macports_sources_rsync.macports.org_release_ports_x11_awesome/work/awesome-3.4.10/client.c:641: error: 'client_t' has no member named 'phys_screen'
/opt/local/var/macports/build/_opt_local_var_macports_sources_rsync.macports.org_release_ports_x11_awesome/work/awesome-3.4.10/client.c:673: error: 'client_t' has no member named 'size_hints_honor'
/opt/local/var/macports/build/_opt_local_var_macports_sources_rsync.macports.org_release_ports_x11_awesome/work/awesome-3.4.10/client.c:706: error: 'client_t' has no member named 'phys_screen'
/opt/local/var/macports/build/_opt_local_var_macports_sources_rsync.macports.org_release_ports_x11_awesome/work/awesome-3.4.10/client.c:724: error: 'XCB_WM_STATE_NORMAL' undeclared (first use in this function)
[ 44%] /opt/local/var/macports/build/_opt_local_var_macports_sources_rsync.macports.org_release_ports_x11_awesome/work/awesome-3.4.10/client.c: In function 'client_geometry_hints':
/opt/local/var/macports/build/_opt_local_var_macports_sources_rsync.macports.org_release_ports_x11_awesome/work/awesome-3.4.10/client.c:770: error: 'client_t' has no member named 'size_hints'
/opt/local/var/macports/build/_opt_local_var_macports_sources_rsync.macports.org_release_ports_x11_awesome/work/awesome-3.4.10/client.c:770: error: 'XCB_SIZE_HINT_P_SIZE' undeclared (first use in this function)
In file included from /opt/local/var/macports/build/_opt_local_var_macports_sources_rsync.macports.org_release_ports_x11_awesome/work/awesome-3.4.10/awesome.c:38:
/opt/local/var/macports/build/_opt_local_var_macports_sources_rsync.macports.org_release_ports_x11_awesome/work/awesome-3.4.10/client.h: At top level:
/opt/local/var/macports/build/_opt_local_var_macports_sources_rsync.macports.org_release_ports_x11_awesome/work/awesome-3.4.10/client.h:126: error: expected specifier-qualifier-list before 'xcb_get_wm_protocols_reply_t'
/opt/local/var/macports/build/_opt_local_var_macports_sources_rsync.macports.org_release_ports_x11_awesome/work/awesome-3.4.10/client.c:772: error: 'client_t' has no member named 'size_hints'
/opt/local/var/macports/build/_opt_local_var_macports_sources_rsync.macports.org_release_ports_x11_awesome/work/awesome-3.4.10/client.c:773: error: 'client_t' has no member named 'size_hints'
/opt/local/var/macports/build/_opt_local_var_macports_sources_rsync.macports.org_release_ports_x11_awesome/work/awesome-3.4.10/client.c:777: error: 'client_t' has no member named 'size_hints'/opt/local/var/macports/build/_opt_local_var_macports_sources_rsync.macports.org_release_ports_x11_awesome/work/awesome-3.4.10/client.h: In function 'client_raise':
/opt/local/var/macports/build/_opt_local_var_macports_sources_rsync.macports.org_release_ports_x11_awesome/work/awesome-3.4.10/client.h:227: error: 'client_t' has no member named 'transient_for'
/opt/local/var/macports/build/_opt_local_var_macports_sources_rsync.macports.org_release_ports_x11_awesome/work/awesome-3.4.10/client.h:228: error: 'client_t' has no member named 'transient_for'
/opt/local/var/macports/build/_opt_local_var_macports_sources_rsync.macports.org_release_ports_x11_awesome/work/awesome-3.4.10/client.h:235: error: 'client_t' has no member named 'transient_for'
/opt/local/var/macports/build/_opt_local_var_macports_sources_rsync.macports.org_release_ports_x11_awesome/work/awesome-3.4.10/client.h: In function 'client_isfixed':
/opt/local/var/macports/build/_opt_local_var_macports_sources_rsync.macports.org_release_ports_x11_awesome/work/awesome-3.4.10/client.h:251: error: 'client_t' has no member named 'size_hints'
/opt/local/var/macports/build/_opt_local_var_macports_sources_rsync.macports.org_release_ports_x11_awesome/work/awesome-3.4.10/client.h:251: error: 'XCB_SIZE_HINT_P_MAX_SIZE' undeclared (first use in this function)
/opt/local/var/macports/build/_opt_local_var_macports_sources_rsync.macports.org_release_ports_x11_awesome/work/awesome-3.4.10/client.h:251: error: (Each undeclared identifier is reported only once

/opt/local/var/macports/build/_opt_local_var_macports_sources_rsync.macports.org_release_ports_x11_awesome/work/awesome-3.4.10/client.c:777: error: 'XCB_SIZE_HINT_P_MIN_SIZE' undeclared (first use in this function)
/opt/local/var/macports/build/_opt_local_var_macports_sources_rsync.macports.org_release_ports_x11_awesome/work/awesome-3.4.10/client.c:779: error: 'client_t' has no member named 'size_hints'
/opt/local/var/macports/build/_opt_local_var_macports_sources_rsync.macports.org_release_ports_x11_awesome/work/awesome-3.4.10/client.c:780: error: 'client_t' has no member named 'size_hints'
/opt/local/var/macports/build/_opt_local_var_macports_sources_rsync.macports.org_release_ports_x11_awesome/work/awesome-3.4.10/client.c:786: error: 'client_t' has no member named 'size_hints'
/opt/local/var/macports/build/_opt_local_var_macports_sources_rsync.macports.org_release_ports_x11_awesome/work/awesome-3.4.10/client.c:788: error: 'client_t' has no member named 'size_hints'
/opt/local/var/macports/build/_opt_local_var_macports_sources_rsync.macports.org_release_ports_x11_awesome/work/awesome-3.4.10/client.c:789: error: 'client_t' has no member named 'size_hints'
/opt/local/var/macports/build/_opt_local_var_macports_sources_rsync.macports.org_release_ports_x11_awesome/work/awesome-3.4.10/client.c:791: error: 'client_t' has no member named 'size_hints'
/opt/local/var/macports/build/_opt_local_var_macports_sources_rsync.macports.org_release_ports_x11_awesome/work/awesome-3.4.10/client.c:793: error: 'client_t' has no member named 'size_hints'
/opt/local/var/macports/build/_opt_local_var_macports_sources_rsync.macports.org_release_ports_x11_awesome/work/awesome-3.4.10/client.c:794: error: 'client_t' has no member named 'size_hints'
/opt/local/var/macports/build/_opt_local_var_macports_sources_rsync.macports.org_release_ports_x11_awesome/work/awesome-3.4.10/client.c:799: error: 'client_t' has no member named 'size_hints'
/opt/local/var/macports/build/_opt_local_var_macports_sources_rsync.macports.org_release_ports_x11_awesome/work/awesome-3.4.10/client.c:799: error: 'XCB_SIZE_HINT_P_ASPECT' undeclared (first use in this function)
/opt/local/var/macports/build/_opt_local_var_macports_sources_rsync.macports.org_release_ports_x11_awesome/work/awesome-3.4.10/client.c:800: error: 'client_t' has no member named 'size_hints'
/opt/local/var/macports/build/_opt_local_var_macports_sources_rsync.macports.org_release_ports_x11_awesome/work/awesome-3.4.10/client.c:801: error: 'client_t' has no member named 'size_hints'
/opt/local/var/macports/build/_opt_local_var_macports_sources_rsync.macports.org_release_ports_x11_awesome/work/awesome-3.4.10/client.c:813: error: 'client_t' has no member named 'size_hints'
/opt/local/var/macports/build/_opt_local_var_macports_sources_rsync.macports.org_release_ports_x11_awesome/work/awesome-3.4.10/client.c:813: error: 'client_t' has no member named 'size_hints'
/opt/local/var/macports/build/_opt_local_var_macports_sources_rsync.macports.org_release_ports_x11_awesome/work/awesome-3.4.10/client.c:814: error: 'client_t' has no member named 'size_hints'
/opt/local/var/macports/build/_opt_local_var_macports_sources_rsync.macports.org_release_ports_x11_awesome/work/awesome-3.4.10/client.c:814: error: 'client_t' has no member named 'size_hints'
/opt/local/var/macports/build/_opt_local_var_macports_sources_rsync.macports.org_release_ports_x11_awesome/work/awesome-3.4.10/client.c:841: error: 'client_t' has no member named 'size_hints'
/opt/local/var/macports/build/_opt_local_var_macports_sources_rsync.macports.org_release_ports_x11_awesome/work/awesome-3.4.10/client.c:841: error: 'XCB_SIZE_HINT_P_MAX_SIZE' undeclared (first use in this function)
/opt/local/var/macports/build/_opt_local_var_macports_sources_rsync.macports.org_release_ports_x11_awesome/work/awesome-3.4.10/client.c:843: error: 'client_t' has no member named 'size_hints'
/opt/local/var/macports/build/_opt_local_var_macports_sources_rsync.macports.org_release_ports_x11_awesome/work/awesome-3.4.10/client.c:844: error: 'client_t' has no member named 'size_hints'
/opt/local/var/macports/build/_opt_local_var_macports_sources_rsync.macports.org_release_ports_x11_awesome/work/awesome-3.4.10/client.c:844: error: 'client_t' has no member named 'size_hints'
/opt/local/var/macports/build/_opt_local_var_macports_sources_rsync.macports.org_release_ports_x11_awesome/work/awesome-3.4.10/client.c:845: error: 'client_t' has no member named 'size_hints'
/opt/local/var/macports/build/_opt_local_var_macports_sources_rsync.macports.org_release_ports_x11_awesome/work/awesome-3.4.10/client.h:251: error: for each function it appears in.)
/opt/local/var/macports/build/_opt_local_var_macports_sources_rsync.macports.org_release_ports_x11_awesome/work/awesome-3.4.10/client.c:846: error: 'client_t' has no member named 'size_hints'
/opt/local/var/macports/build/_opt_local_var_macports_sources_rsync.macports.org_release_ports_x11_awesome/work/awesome-3.4.10/client.h:252: error: 'client_t' has no member named 'size_hints'
/opt/local/var/macports/build/_opt_local_var_macports_sources_rsync.macports.org_release_ports_x11_awesome/work/awesome-3.4.10/client.c:846: error: 'client_t' has no member named 'size_hints'
/opt/local/var/macports/build/_opt_local_var_macports_sources_rsync.macports.org_release_ports_x11_awesome/work/awesome-3.4.10/client.h:252: error: 'XCB_SIZE_HINT_P_MIN_SIZE' undeclared (first use in this function)
/opt/local/var/macports/build/_opt_local_var_macports_sources_rsync.macports.org_release_ports_x11_awesome/work/awesome-3.4.10/client.c:849: error: 'client_t' has no member named 'size_hints'/opt/local/var/macports/build/_opt_local_var_macports_sources_rsync.macports.org_release_ports_x11_awesome/work/awesome-3.4.10/client.h:253: error: 'client_t' has no member named 'size_hints'
/opt/local/var/macports/build/_opt_local_var_macports_sources_rsync.macports.org_release_ports_x11_awesome/work/awesome-3.4.10/client.h:253: error: 'client_t' has no member named 'size_hints'

/opt/local/var/macports/build/_opt_local_var_macports_sources_rsync.macports.org_release_ports_x11_awesome/work/awesome-3.4.10/client.h:254: error: 'client_t' has no member named 'size_hints'
/opt/local/var/macports/build/_opt_local_var_macports_sources_rsync.macports.org_release_ports_x11_awesome/work/awesome-3.4.10/client.c:849: error: 'XCB_SIZE_HINT_P_RESIZE_INC' undeclared (first use in this function)
/opt/local/var/macports/build/_opt_local_var_macports_sources_rsync.macports.org_release_ports_x11_awesome/work/awesome-3.4.10/client.c:849: error: 'XCB_SIZE_HINT_BASE_SIZE' undeclared (first use in this function)
/opt/local/var/macports/build/_opt_local_var_macports_sources_rsync.macports.org_release_ports_x11_awesome/work/awesome-3.4.10/client.c:850: error: 'client_t' has no member named 'size_hints'
/opt/local/var/macports/build/_opt_local_var_macports_sources_rsync.macports.org_release_ports_x11_awesome/work/awesome-3.4.10/client.c:850: error: 'client_t' has no member named 'size_hints'
/opt/local/var/macports/build/_opt_local_var_macports_sources_rsync.macports.org_release_ports_x11_awesome/work/awesome-3.4.10/client.c:855: error: 'client_t' has no member named 'size_hints'
/opt/local/var/macports/build/_opt_local_var_macports_sources_rsync.macports.org_release_ports_x11_awesome/work/awesome-3.4.10/client.c:856: error: 'client_t' has no member named 'size_hints'
/opt/local/var/macports/build/_opt_local_var_macports_sources_rsync.macports.org_release_ports_x11_awesome/work/awesome-3.4.10/client.c: In function 'client_resize':
/opt/local/var/macports/build/_opt_local_var_macports_sources_rsync.macports.org_release_ports_x11_awesome/work/awesome-3.4.10/client.c:876: error: 'client_t' has no member named 'phys_screen'
/opt/local/var/macports/build/_opt_local_var_macports_sources_rsync.macports.org_release_ports_x11_awesome/work/awesome-3.4.10/client.c:889: error: 'client_t' has no member named 'titlebar'
/opt/local/var/macports/build/_opt_local_var_macports_sources_rsync.macports.org_release_ports_x11_awesome/work/awesome-3.4.10/client.c:901: error: 'client_t' has no member named 'titlebar'
/opt/local/var/macports/build/_opt_local_var_macports_sources_rsync.macports.org_release_ports_x11_awesome/work/awesome-3.4.10/client.h:254: error: 'client_t' has no member named 'size_hints'
/opt/local/var/macports/build/_opt_local_var_macports_sources_rsync.macports.org_release_ports_x11_awesome/work/awesome-3.4.10/client.h:255: error: 'client_t' has no member named 'size_hints'
/opt/local/var/macports/build/_opt_local_var_macports_sources_rsync.macports.org_release_ports_x11_awesome/work/awesome-3.4.10/client.h:256: error: 'client_t' has no member named 'size_hints'
/opt/local/var/macports/build/_opt_local_var_macports_sources_rsync.macports.org_release_ports_x11_awesome/work/awesome-3.4.10/client.h:257: error: 'client_t' has no member named 'size_hints_honor'
/opt/local/var/macports/build/_opt_local_var_macports_sources_rsync.macports.org_release_ports_x11_awesome/work/awesome-3.4.10/client.c:910: error: 'client_t' has no member named 'screen'
/opt/local/var/macports/build/_opt_local_var_macports_sources_rsync.macports.org_release_ports_x11_awesome/work/awesome-3.4.10/client.c: In function 'client_set_minimized':
/opt/local/var/macports/build/_opt_local_var_macports_sources_rsync.macports.org_release_ports_x11_awesome/work/awesome-3.4.10/client.c:970: error: 'client_t' has no member named 'screen'
/opt/local/var/macports/build/_opt_local_var_macports_sources_rsync.macports.org_release_ports_x11_awesome/work/awesome-3.4.10/client.c:972: error: 'XCB_WM_STATE_ICONIC' undeclared (first use in this function)
/opt/local/var/macports/build/_opt_local_var_macports_sources_rsync.macports.org_release_ports_x11_awesome/work/awesome-3.4.10/client.c:974: error: 'XCB_WM_STATE_NORMAL' undeclared (first use in this function)
/opt/local/var/macports/build/_opt_local_var_macports_sources_rsync.macports.org_release_ports_x11_awesome/work/awesome-3.4.10/client.c:977: error: 'client_t' has no member named 'screen'
/opt/local/var/macports/build/_opt_local_var_macports_sources_rsync.macports.org_release_ports_x11_awesome/work/awesome-3.4.10/client.c: In function 'client_set_sticky':
/opt/local/var/macports/build/_opt_local_var_macports_sources_rsync.macports.org_release_ports_x11_awesome/work/awesome-3.4.10/client.c:997: error: 'client_t' has no member named 'screen'
/opt/local/var/macports/build/_opt_local_var_macports_sources_rsync.macports.org_release_ports_x11_awesome/work/awesome-3.4.10/client.c: In function 'client_set_fullscreen':
/opt/local/var/macports/build/_opt_local_var_macports_sources_rsync.macports.org_release_ports_x11_awesome/work/awesome-3.4.10/client.c:1022: error: 'client_t' has no member named 'titlebar'
/opt/local/var/macports/build/_opt_local_var_macports_sources_rsync.macports.org_release_ports_x11_awesome/work/awesome-3.4.10/client.c:1031: error: 'client_t' has no member named 'screen'
/opt/local/var/macports/build/_opt_local_var_macports_sources_rsync.macports.org_release_ports_x11_awesome/work/awesome-3.4.10/client.c:1040: error: 'client_t' has no member named 'titlebar'
/opt/local/var/macports/build/_opt_local_var_macports_sources_rsync.macports.org_release_ports_x11_awesome/work/awesome-3.4.10/client.c:1041: error: 'client_t' has no member named 'titlebar'
/opt/local/var/macports/build/_opt_local_var_macports_sources_rsync.macports.org_release_ports_x11_awesome/work/awesome-3.4.10/client.c: In function 'client_set_maximized_horizontal':
/opt/local/var/macports/build/_opt_local_var_macports_sources_rsync.macports.org_release_ports_x11_awesome/work/awesome-3.4.10/client.c:1072: error: 'client_t' has no member named 'screen'
/opt/local/var/macports/build/_opt_local_var_macports_sources_rsync.macports.org_release_ports_x11_awesome/work/awesome-3.4.10/client.c:1085: error: 'client_t' has no member named 'size_hints_honor'
/opt/local/var/macports/build/_opt_local_var_macports_sources_rsync.macports.org_release_ports_x11_awesome/work/awesome-3.4.10/client.c: In function 'client_set_maximized_vertical':
/opt/local/var/macports/build/_opt_local_var_macports_sources_rsync.macports.org_release_ports_x11_awesome/work/awesome-3.4.10/client.c:1112: error: 'client_t' has no member named 'screen'
/opt/local/var/macports/build/_opt_local_var_macports_sources_rsync.macports.org_release_ports_x11_awesome/work/awesome-3.4.10/client.c:1125: error: 'client_t' has no member named 'size_hints_honor'
/opt/local/var/macports/build/_opt_local_var_macports_sources_rsync.macports.org_release_ports_x11_awesome/work/awesome-3.4.10/client.c: In function 'client_unmanage':
/opt/local/var/macports/build/_opt_local_var_macports_sources_rsync.macports.org_release_ports_x11_awesome/work/awesome-3.4.10/client.c:1280: error: 'client_t' has no member named 'screen'
/opt/local/var/macports/build/_opt_local_var_macports_sources_rsync.macports.org_release_ports_x11_awesome/work/awesome-3.4.10/client.c:1286: error: 'client_t' has no member named 'transient_for'
/opt/local/var/macports/build/_opt_local_var_macports_sources_rsync.macports.org_release_ports_x11_awesome/work/awesome-3.4.10/client.c:1287: error: 'client_t' has no member named 'transient_for'
/opt/local/var/macports/build/_opt_local_var_macports_sources_rsync.macports.org_release_ports_x11_awesome/work/awesome-3.4.10/client.c:1290: error: 'client_t' has no member named 'phys_screen'
/opt/local/var/macports/build/_opt_local_var_macports_sources_rsync.macports.org_release_ports_x11_awesome/work/awesome-3.4.10/client.c:1291: error: 'client_t' has no member named 'phys_screen'
/opt/local/var/macports/build/_opt_local_var_macports_sources_rsync.macports.org_release_ports_x11_awesome/work/awesome-3.4.10/client.c:1293: error: 'client_t' has no member named 'phys_screen'
/opt/local/var/macports/build/_opt_local_var_macports_sources_rsync.macports.org_release_ports_x11_awesome/work/awesome-3.4.10/client.c:1324: error: 'client_t' has no member named 'screen'
/opt/local/var/macports/build/_opt_local_var_macports_sources_rsync.macports.org_release_ports_x11_awesome/work/awesome-3.4.10/client.c:1328: error: 'client_t' has no member named 'phys_screen'
/opt/local/var/macports/build/_opt_local_var_macports_sources_rsync.macports.org_release_ports_x11_awesome/work/awesome-3.4.10/client.c:1336: error: 'XCB_WM_STATE_WITHDRAWN' undeclared (first use in this function)
/opt/local/var/macports/build/_opt_local_var_macports_sources_rsync.macports.org_release_ports_x11_awesome/work/awesome-3.4.10/client.c: In function 'luaA_client_get':
/opt/local/var/macports/build/_opt_local_var_macports_sources_rsync.macports.org_release_ports_x11_awesome/work/awesome-3.4.10/client.c:1398: error: 'client_t' has no member named 'screen'
/opt/local/var/macports/build/_opt_local_var_macports_sources_rsync.macports.org_release_ports_x11_awesome/work/awesome-3.4.10/client.c: In function 'luaA_client_isvisible':
/opt/local/var/macports/build/_opt_local_var_macports_sources_rsync.macports.org_release_ports_x11_awesome/work/awesome-3.4.10/client.c:1419: error: 'client_t' has no member named 'screen'
/opt/local/var/macports/build/_opt_local_var_macports_sources_rsync.macports.org_release_ports_x11_awesome/work/awesome-3.4.10/client.c: In function 'client_set_icon':
/opt/local/var/macports/build/_opt_local_var_macports_sources_rsync.macports.org_release_ports_x11_awesome/work/awesome-3.4.10/client.c:1478: error: 'client_t' has no member named 'icon'
/opt/local/var/macports/build/_opt_local_var_macports_sources_rsync.macports.org_release_ports_x11_awesome/work/awesome-3.4.10/client.c:1479: error: 'client_t' has no member named 'icon'
/opt/local/var/macports/build/_opt_local_var_macports_sources_rsync.macports.org_release_ports_x11_awesome/work/awesome-3.4.10/client.c: In function 'luaA_client_tags':
/opt/local/var/macports/build/_opt_local_var_macports_sources_rsync.macports.org_release_ports_x11_awesome/work/awesome-3.4.10/client.c:1547: error: 'client_t' has no member named 'screen'
In file included from /opt/local/var/macports/build/_opt_local_var_macports_sources_rsync.macports.org_release_ports_x11_awesome/work/awesome-3.4.10/awesome.c:46:
/opt/local/var/macports/build/_opt_local_var_macports_sources_rsync.macports.org_release_ports_x11_awesome/work/awesome-3.4.10/titlebar.h: In function 'titlebar_isvisible':
/opt/local/var/macports/build/_opt_local_var_macports_sources_rsync.macports.org_release_ports_x11_awesome/work/awesome-3.4.10/titlebar.h:48: error: 'client_t' has no member named 'titlebar'
/opt/local/var/macports/build/_opt_local_var_macports_sources_rsync.macports.org_release_ports_x11_awesome/work/awesome-3.4.10/titlebar.h:48: error: 'client_t' has no member named 'titlebar'
/opt/local/var/macports/build/_opt_local_var_macports_sources_rsync.macports.org_release_ports_x11_awesome/work/awesome-3.4.10/titlebar.h: In function 'titlebar_update_geometry':
/opt/local/var/macports/build/_opt_local_var_macports_sources_rsync.macports.org_release_ports_x11_awesome/work/awesome-3.4.10/titlebar.h:145: error: 'client_t' has no member named 'titlebar'
/opt/local/var/macports/build/_opt_local_var_macports_sources_rsync.macports.org_release_ports_x11_awesome/work/awesome-3.4.10/titlebar.h:149: error: 'client_t' has no member named 'titlebar'
/opt/local/var/macports/build/_opt_local_var_macports_sources_rsync.macports.org_release_ports_x11_awesome/work/awesome-3.4.10/titlebar.h:150: error: 'client_t' has no member named 'titlebar'
make[3]: *** [CMakeFiles/awesome.dir/dbus.c.o] Error 1
make[3]: *** Waiting for unfinished jobs....
/opt/local/var/macports/build/_opt_local_var_macports_sources_rsync.macports.org_release_ports_x11_awesome/work/awesome-3.4.10/client.c: In function 'luaA_client_lower':
/opt/local/var/macports/build/_opt_local_var_macports_sources_rsync.macports.org_release_ports_x11_awesome/work/awesome-3.4.10/client.c:1617: error: 'client_t' has no member named 'transient_for'
/opt/local/var/macports/build/_opt_local_var_macports_sources_rsync.macports.org_release_ports_x11_awesome/work/awesome-3.4.10/client.c:1617: error: 'client_t' has no member named 'transient_for'
/opt/local/var/macports/build/_opt_local_var_macports_sources_rsync.macports.org_release_ports_x11_awesome/work/awesome-3.4.10/client.c: In function 'luaA_client_geometry':
/opt/local/var/macports/build/_opt_local_var_macports_sources_rsync.macports.org_release_ports_x11_awesome/work/awesome-3.4.10/client.c:1695: error: 'client_t' has no member named 'size_hints_honor'
/opt/local/var/macports/build/_opt_local_var_macports_sources_rsync.macports.org_release_ports_x11_awesome/work/awesome-3.4.10/client.c: In function 'luaA_client_struts':
/opt/local/var/macports/build/_opt_local_var_macports_sources_rsync.macports.org_release_ports_x11_awesome/work/awesome-3.4.10/client.c:1719: error: 'client_t' has no member named 'screen'
/opt/local/var/macports/build/_opt_local_var_macports_sources_rsync.macports.org_release_ports_x11_awesome/work/awesome-3.4.10/client.c: In function 'luaA_client_set_hidden':
/opt/local/var/macports/build/_opt_local_var_macports_sources_rsync.macports.org_release_ports_x11_awesome/work/awesome-3.4.10/client.c:1744: error: 'client_t' has no member named 'screen'
/opt/local/var/macports/build/_opt_local_var_macports_sources_rsync.macports.org_release_ports_x11_awesome/work/awesome-3.4.10/client.c:1747: error: 'client_t' has no member named 'screen'
/opt/local/var/macports/build/_opt_local_var_macports_sources_rsync.macports.org_release_ports_x11_awesome/work/awesome-3.4.10/client.c: In function 'luaA_client_set_size_hints_honor':
/opt/local/var/macports/build/_opt_local_var_macports_sources_rsync.macports.org_release_ports_x11_awesome/work/awesome-3.4.10/client.c:1815: error: 'client_t' has no member named 'size_hints_honor'
/opt/local/var/macports/build/_opt_local_var_macports_sources_rsync.macports.org_release_ports_x11_awesome/work/awesome-3.4.10/client.c: In function 'luaA_client_get_machine':
/opt/local/var/macports/build/_opt_local_var_macports_sources_rsync.macports.org_release_ports_x11_awesome/work/awesome-3.4.10/client.c:1904: error: 'client_t' has no member named 'machine'
/opt/local/var/macports/build/_opt_local_var_macports_sources_rsync.macports.org_release_ports_x11_awesome/work/awesome-3.4.10/client.c: In function 'luaA_client_get_role':
/opt/local/var/macports/build/_opt_local_var_macports_sources_rsync.macports.org_release_ports_x11_awesome/work/awesome-3.4.10/client.c:1905: error: 'client_t' has no member named 'role'
/opt/local/var/macports/build/_opt_local_var_macports_sources_rsync.macports.org_release_ports_x11_awesome/work/awesome-3.4.10/client.c: In function 'luaA_client_get_transient_for':
/opt/local/var/macports/build/_opt_local_var_macports_sources_rsync.macports.org_release_ports_x11_awesome/work/awesome-3.4.10/client.c:1906: error: 'client_t' has no member named 'transient_for'
/opt/local/var/macports/build/_opt_local_var_macports_sources_rsync.macports.org_release_ports_x11_awesome/work/awesome-3.4.10/client.c: In function 'luaA_client_get_pid':
/opt/local/var/macports/build/_opt_local_var_macports_sources_rsync.macports.org_release_ports_x11_awesome/work/awesome-3.4.10/client.c:1911: error: 'client_t' has no member named 'pid'
/opt/local/var/macports/build/_opt_local_var_macports_sources_rsync.macports.org_release_ports_x11_awesome/work/awesome-3.4.10/client.c: In function 'luaA_client_get_size_hints_honor':
/opt/local/var/macports/build/_opt_local_var_macports_sources_rsync.macports.org_release_ports_x11_awesome/work/awesome-3.4.10/client.c:1921: error: 'client_t' has no member named 'size_hints_honor'
/opt/local/var/macports/build/_opt_local_var_macports_sources_rsync.macports.org_release_ports_x11_awesome/work/awesome-3.4.10/client.c: In function 'luaA_client_get_opacity':
/opt/local/var/macports/build/_opt_local_var_macports_sources_rsync.macports.org_release_ports_x11_awesome/work/awesome-3.4.10/client.c:1924: error: 'client_t' has no member named 'opacity'
/opt/local/var/macports/build/_opt_local_var_macports_sources_rsync.macports.org_release_ports_x11_awesome/work/awesome-3.4.10/client.c: In function 'luaA_client_get_screen':
/opt/local/var/macports/build/_opt_local_var_macports_sources_rsync.macports.org_release_ports_x11_awesome/work/awesome-3.4.10/client.c:2014: error: 'client_t' has no member named 'screen'
/opt/local/var/macports/build/_opt_local_var_macports_sources_rsync.macports.org_release_ports_x11_awesome/work/awesome-3.4.10/client.c:2016: error: 'client_t' has no member named 'screen'
/opt/local/var/macports/build/_opt_local_var_macports_sources_rsync.macports.org_release_ports_x11_awesome/work/awesome-3.4.10/client.c: In function 'luaA_client_get_icon':
/opt/local/var/macports/build/_opt_local_var_macports_sources_rsync.macports.org_release_ports_x11_awesome/work/awesome-3.4.10/client.c:2023: error: 'client_t' has no member named 'icon'
/opt/local/var/macports/build/_opt_local_var_macports_sources_rsync.macports.org_release_ports_x11_awesome/work/awesome-3.4.10/client.c: In function 'luaA_client_get_titlebar':
/opt/local/var/macports/build/_opt_local_var_macports_sources_rsync.macports.org_release_ports_x11_awesome/work/awesome-3.4.10/client.c:2029: error: 'client_t' has no member named 'titlebar'
/opt/local/var/macports/build/_opt_local_var_macports_sources_rsync.macports.org_release_ports_x11_awesome/work/awesome-3.4.10/client.c: In function 'luaA_client_get_size_hints':
/opt/local/var/macports/build/_opt_local_var_macports_sources_rsync.macports.org_release_ports_x11_awesome/work/awesome-3.4.10/client.c:2055: error: 'client_t' has no member named 'size_hints'
/opt/local/var/macports/build/_opt_local_var_macports_sources_rsync.macports.org_release_ports_x11_awesome/work/awesome-3.4.10/client.c:2055: error: 'XCB_SIZE_HINT_US_POSITION' undeclared (first use in this function)
/opt/local/var/macports/build/_opt_local_var_macports_sources_rsync.macports.org_release_ports_x11_awesome/work/awesome-3.4.10/client.c:2057: error: 'client_t' has no member named 'size_hints'
/opt/local/var/macports/build/_opt_local_var_macports_sources_rsync.macports.org_release_ports_x11_awesome/work/awesome-3.4.10/client.c:2057: error: 'XCB_SIZE_HINT_P_POSITION' undeclared (first use in this function)
/opt/local/var/macports/build/_opt_local_var_macports_sources_rsync.macports.org_release_ports_x11_awesome/work/awesome-3.4.10/client.c:2063: error: 'client_t' has no member named 'size_hints'
/opt/local/var/macports/build/_opt_local_var_macports_sources_rsync.macports.org_release_ports_x11_awesome/work/awesome-3.4.10/client.c:2065: error: 'client_t' has no member named 'size_hints'
/opt/local/var/macports/build/_opt_local_var_macports_sources_rsync.macports.org_release_ports_x11_awesome/work/awesome-3.4.10/client.c:2071: error: 'client_t' has no member named 'size_hints'
/opt/local/var/macports/build/_opt_local_var_macports_sources_rsync.macports.org_release_ports_x11_awesome/work/awesome-3.4.10/client.c:2071: error: 'XCB_SIZE_HINT_US_SIZE' undeclared (first use in this function)
/opt/local/var/macports/build/_opt_local_var_macports_sources_rsync.macports.org_release_ports_x11_awesome/work/awesome-3.4.10/client.c:2073: error: 'client_t' has no member named 'size_hints'
/opt/local/var/macports/build/_opt_local_var_macports_sources_rsync.macports.org_release_ports_x11_awesome/work/awesome-3.4.10/client.c:2073: error: 'XCB_SIZE_HINT_P_SIZE' undeclared (first use in this function)
/opt/local/var/macports/build/_opt_local_var_macports_sources_rsync.macports.org_release_ports_x11_awesome/work/awesome-3.4.10/client.c:2079: error: 'client_t' has no member named 'size_hints'
/opt/local/var/macports/build/_opt_local_var_macports_sources_rsync.macports.org_release_ports_x11_awesome/work/awesome-3.4.10/client.c:2081: error: 'client_t' has no member named 'size_hints'
/opt/local/var/macports/build/_opt_local_var_macports_sources_rsync.macports.org_release_ports_x11_awesome/work/awesome-3.4.10/client.c:2086: error: 'client_t' has no member named 'size_hints'
/opt/local/var/macports/build/_opt_local_var_macports_sources_rsync.macports.org_release_ports_x11_awesome/work/awesome-3.4.10/client.c:2086: error: 'XCB_SIZE_HINT_P_MIN_SIZE' undeclared (first use in this function)
/opt/local/var/macports/build/_opt_local_var_macports_sources_rsync.macports.org_release_ports_x11_awesome/work/awesome-3.4.10/client.c:2088: error: 'client_t' has no member named 'size_hints'
/opt/local/var/macports/build/_opt_local_var_macports_sources_rsync.macports.org_release_ports_x11_awesome/work/awesome-3.4.10/client.c:2090: error: 'client_t' has no member named 'size_hints'
/opt/local/var/macports/build/_opt_local_var_macports_sources_rsync.macports.org_release_ports_x11_awesome/work/awesome-3.4.10/client.c:2094: error: 'client_t' has no member named 'size_hints'
/opt/local/var/macports/build/_opt_local_var_macports_sources_rsync.macports.org_release_ports_x11_awesome/work/awesome-3.4.10/client.c:2094: error: 'XCB_SIZE_HINT_P_MAX_SIZE' undeclared (first use in this function)
/opt/local/var/macports/build/_opt_local_var_macports_sources_rsync.macports.org_release_ports_x11_awesome/work/awesome-3.4.10/client.c:2096: error: 'client_t' has no member named 'size_hints'
/opt/local/var/macports/build/_opt_local_var_macports_sources_rsync.macports.org_release_ports_x11_awesome/work/awesome-3.4.10/client.c:2098: error: 'client_t' has no member named 'size_hints'
/opt/local/var/macports/build/_opt_local_var_macports_sources_rsync.macports.org_release_ports_x11_awesome/work/awesome-3.4.10/client.c:2102: error: 'client_t' has no member named 'size_hints'
/opt/local/var/macports/build/_opt_local_var_macports_sources_rsync.macports.org_release_ports_x11_awesome/work/awesome-3.4.10/client.c:2102: error: 'XCB_SIZE_HINT_P_RESIZE_INC' undeclared (first use in this function)
/opt/local/var/macports/build/_opt_local_var_macports_sources_rsync.macports.org_release_ports_x11_awesome/work/awesome-3.4.10/client.c:2104: error: 'client_t' has no member named 'size_hints'
/opt/local/var/macports/build/_opt_local_var_macports_sources_rsync.macports.org_release_ports_x11_awesome/work/awesome-3.4.10/client.c:2106: error: 'client_t' has no member named 'size_hints'
/opt/local/var/macports/build/_opt_local_var_macports_sources_rsync.macports.org_release_ports_x11_awesome/work/awesome-3.4.10/client.c:2110: error: 'client_t' has no member named 'size_hints'
/opt/local/var/macports/build/_opt_local_var_macports_sources_rsync.macports.org_release_ports_x11_awesome/work/awesome-3.4.10/client.c:2110: error: 'XCB_SIZE_HINT_P_ASPECT' undeclared (first use in this function)
/opt/local/var/macports/build/_opt_local_var_macports_sources_rsync.macports.org_release_ports_x11_awesome/work/awesome-3.4.10/client.c:2112: error: 'client_t' has no member named 'size_hints'
/opt/local/var/macports/build/_opt_local_var_macports_sources_rsync.macports.org_release_ports_x11_awesome/work/awesome-3.4.10/client.c:2114: error: 'client_t' has no member named 'size_hints'
/opt/local/var/macports/build/_opt_local_var_macports_sources_rsync.macports.org_release_ports_x11_awesome/work/awesome-3.4.10/client.c:2116: error: 'client_t' has no member named 'size_hints'
/opt/local/var/macports/build/_opt_local_var_macports_sources_rsync.macports.org_release_ports_x11_awesome/work/awesome-3.4.10/client.c:2118: error: 'client_t' has no member named 'size_hints'
/opt/local/var/macports/build/_opt_local_var_macports_sources_rsync.macports.org_release_ports_x11_awesome/work/awesome-3.4.10/client.c:2122: error: 'client_t' has no member named 'size_hints'
/opt/local/var/macports/build/_opt_local_var_macports_sources_rsync.macports.org_release_ports_x11_awesome/work/awesome-3.4.10/client.c:2122: error: 'XCB_SIZE_HINT_BASE_SIZE' undeclared (first use in this function)
/opt/local/var/macports/build/_opt_local_var_macports_sources_rsync.macports.org_release_ports_x11_awesome/work/awesome-3.4.10/client.c:2124: error: 'client_t' has no member named 'size_hints'
/opt/local/var/macports/build/_opt_local_var_macports_sources_rsync.macports.org_release_ports_x11_awesome/work/awesome-3.4.10/client.c:2126: error: 'client_t' has no member named 'size_hints'
/opt/local/var/macports/build/_opt_local_var_macports_sources_rsync.macports.org_release_ports_x11_awesome/work/awesome-3.4.10/client.c:2130: error: 'client_t' has no member named 'size_hints'
/opt/local/var/macports/build/_opt_local_var_macports_sources_rsync.macports.org_release_ports_x11_awesome/work/awesome-3.4.10/client.c:2130: error: 'XCB_SIZE_HINT_P_WIN_GRAVITY' undeclared (first use in this function)
/opt/local/var/macports/build/_opt_local_var_macports_sources_rsync.macports.org_release_ports_x11_awesome/work/awesome-3.4.10/client.c:2132: error: 'client_t' has no member named 'size_hints'
/opt/local/var/macports/build/_opt_local_var_macports_sources_rsync.macports.org_release_ports_x11_awesome/work/awesome-3.4.10/client.c: In function 'luaA_client_buttons':
/opt/local/var/macports/build/_opt_local_var_macports_sources_rsync.macports.org_release_ports_x11_awesome/work/awesome-3.4.10/client.c:2183: error: 'client_t' has no member named 'buttons'
/opt/local/var/macports/build/_opt_local_var_macports_sources_rsync.macports.org_release_ports_x11_awesome/work/awesome-3.4.10/client.c:2189: error: 'client_t' has no member named 'buttons'
/opt/local/var/macports/build/_opt_local_var_macports_sources_rsync.macports.org_release_ports_x11_awesome/work/awesome-3.4.10/client.c: In function 'luaA_client_keys':
/opt/local/var/macports/build/_opt_local_var_macports_sources_rsync.macports.org_release_ports_x11_awesome/work/awesome-3.4.10/client.c:2207: error: 'client_t' has no member named 'keys'
/opt/local/var/macports/build/_opt_local_var_macports_sources_rsync.macports.org_release_ports_x11_awesome/work/awesome-3.4.10/awesome.c: In function 'scan':
/opt/local/var/macports/build/_opt_local_var_macports_sources_rsync.macports.org_release_ports_x11_awesome/work/awesome-3.4.10/awesome.c:157: error: 'XCB_WM_STATE_WITHDRAWN' undeclared (first use in this function)
Building C object CMakeFiles/awesome.dir/root.c.o
make[3]: *** [CMakeFiles/awesome.dir/awesome.c.o] Error 1
make[3]: *** [CMakeFiles/awesome.dir/client.c.o] Error 1
In file included from /opt/local/var/macports/build/_opt_local_var_macports_sources_rsync.macports.org_release_ports_x11_awesome/work/awesome-3.4.10/globalconf.h:28,
                 from /opt/local/var/macports/build/_opt_local_var_macports_sources_rsync.macports.org_release_ports_x11_awesome/work/awesome-3.4.10/root.c:24:
/opt/local/include/ev.h: In function 'ev_is_default_loop':
/opt/local/include/ev.h:495: warning: redundant redeclaration of 'ev_default_loop_ptr'
/opt/local/include/ev.h:449: warning: previous declaration of 'ev_default_loop_ptr' was here
In file included from /opt/local/var/macports/build/_opt_local_var_macports_sources_rsync.macports.org_release_ports_x11_awesome/work/awesome-3.4.10/globalconf.h:28,
                 from /opt/local/var/macports/build/_opt_local_var_macports_sources_rsync.macports.org_release_ports_x11_awesome/work/awesome-3.4.10/root.c:24:
/opt/local/include/ev.h:547:6: warning: "EV_MINIMAL" is not defined
make[2]: *** [CMakeFiles/awesome.dir/all] Error 2
make[1]: *** [all] Error 2
make: *** [cmake-build] Error 2
shell command " cd "/opt/local/var/macports/build/_opt_local_var_macports_sources_rsync.macports.org_release_ports_x11_awesome/work/awesome-3.4.10" && /usr/bin/make -j4 all CMAKE_ARGS=" -DCMAKE_INSTALL_PREFIX=/opt/local -DPREFIX=/opt/local -DAWESOME_DOC_PATH=/opt/local/share/doc/awesome -DAWESOME_MAN_PATH=/opt/local/share/man -DAWESOME_XSESSION_PATH=/opt/local/share/xsessions -DSYSCONFDIR=/opt/local/etc -DXDG_CONFIG_HOME=/opt/local/etc/xdg" " returned error 2
Error: Target org.macports.build returned: shell command failed (see log for details)
Warning: the following items did not execute (for awesome): org.macports.activate org.macports.build org.macports.destroot org.macports.install
Log for awesome is at: /opt/local/var/macports/logs/_opt_local_var_macports_sources_rsync.macports.org_release_ports_x11_awesome/main.log
Error: Status 1 encountered during processing.
To report a bug, see <http://guide.macports.org/#project.tickets>

comment:3 Changed 8 years ago by jwatzman@…

Something looks very wrong with your setup. Although it isn't the error the build is failing on, the complaints about ev.h:495 and ev.h:449 are strange, given that, on my system, those two lines which "declare" ev_default_loop_ptr are actually inside two different functions and shouldn't conflict.

The build is actually failing because "xcb_get_xm_protocols_reply_t" is not defined (the rest of the errors look to stem from that). That's defined in /opt/local/xcb/xcb_icccm.h:853 on my system -- is that declaration missing on your system or did that file manage to not get included?

Also, did you build cairo with +x11_xcb?

comment:4 Changed 8 years ago by jwatzman@…

The stuff about ev_default_loop_ptr is a red herring, ignore that. Make sure you did build cairo with +x11_xcb.

The recent update of xorg-xcb-util from 0.3.6 to 0.3.8 did break this build (though the failure is in a different place than the log above). I'll look into it.

Changed 8 years ago by jwatzman@…

Attachment: patch-CMakeLists.txt.diff added

new source code diff

Changed 8 years ago by jwatzman@…

Attachment: patch-upstream-xcb.diff added

upstream diff to fix with xcb-util 0.3.8

comment:5 Changed 8 years ago by jwatzman@…

xorg-xcb-util 0.3.8 breaks awesome. I attached a new Portfile diff and a diff taken from upstream to fix the problem.

http://git.naquadah.org/?p=awesome.git;a=commit;h=c9f6b65c19e3e8ebd1bd4ca860a0e1fd66931e65

comment:6 Changed 8 years ago by jeremyhu (Jeremy Huddleston Sequoia)

Cc: jeremyhu@… added

Cc Me!

Changed 8 years ago by jwatzman@…

Attachment: Portfile.diff added

portfile diff 3.4.4 -> 3.4.10

comment:7 Changed 8 years ago by jwatzman@…

Updated Portfile.diff to add a missing dependency on dbus.

What's the next step to getting this update committed to Macports? (Is anyone watching this report?)

comment:8 Changed 8 years ago by jeremyhu (Jeremy Huddleston Sequoia)

I'm watching it, but I can't install-test awesome since lua is not building:

--->  Applying /opt/local/var/macports/distfiles/lua/patch-lua-5.1.4-3
patching file lcode.c
patching file ldblib.c
patching file liolib.c
patching file llex.c
patching file loadlib.c
patching file lstrlib.c
patching file lvm.c
--->  Applying /Users/jeremy/src/macports/trunk/dports/lang/lua/files/patch-Makefile.diff
/usr/bin/patch: **** rejecting file name with ".." component: ../Makefile
shell command " cd "/opt/local/var/macports/build/_Users_jeremy_src_macports_trunk_dports_lang_lua/lua/work/lua-5.1.4/src" && /usr/bin/patch -p0 < '/Users/jeremy/src/macports/trunk/dports/lang/lua/files/patch-Makefile.diff'" returned error 2
Error: Target org.macports.patch returned: shell command failed (see log for details)
Warning: the following items did not execute (for lua): org.macports.activate org.macports.patch org.macports.configure org.macports.build org.macports.destroot org.macports.install
Log for lua is at: /opt/local/var/macports/logs/_Users_jeremy_src_macports_trunk_dports_lang_lua/lua/main.log
Error: Status 1 encountered during processing.
To report a bug, see <http://guide.macports.org/#project.tickets>

I'll look later, but if you want this in, you might want to fix lua too...

comment:9 Changed 8 years ago by jeremyhu (Jeremy Huddleston Sequoia)

Actually, I found a system with lua... looking at this now...

comment:10 Changed 8 years ago by jeremyhu (Jeremy Huddleston Sequoia)

Resolution: fixed
Status: newclosed
Note: See TracTickets for help on using tickets.