Opened 9 years ago

Closed 9 years ago

#33825 closed defect (invalid)

can't install libglade2

Reported by: der_loewe@… Owned by: macports-tickets@…
Priority: Normal Milestone:
Component: ports Version: 2.0.4
Keywords: Cc:
Port: libglade2

Description (last modified by ryandesign (Ryan Schmidt))

Getting this

sudo port install libglade2
--->  Computing dependencies for libglade2
--->  Building libglade2
Error: Target org.macports.build returned: shell command failed (see log for details)

port version 2.0.4
os 10.7.3

excerpt from main.log with errors:

:info:build glade-init.c:27:10: fatal error: 'glib.h' file not found
:info:build #include <glib.h>
:info:build          ^
:info:build 1 error generated.
:info:build glade-gtk.c:36:10: fatal error: 'gtk/gtk.h' file not found
:info:build #include <gtk/gtk.h>
:info:build          ^
:info:build In file included from glade-xml.c:28:
:info:build ../glade/glade-xml.h:25:10: fatal error: 'glib.h' file not found
:info:build #include <glib.h>
:info:build          ^
:info:build make[2]: *** [glade-init.lo] Error 1
:info:build make[2]: *** Waiting for unfinished jobs....
:info:build glade-parser.c:37:10: fatal error: 'libxml/parser.h' file not found
:info:build #include <libxml/parser.h>
:info:build          ^
:info:build 1 error generated.
:info:build 1 error generated.
:info:build 1 error generated.
:info:build make[2]: *** [glade-parser.lo] Error 1
:info:build make[2]: *** [glade-xml.lo] Error 1
:info:build make[2]: *** [glade-gtk.lo] Error 1
:info:build make[2]: Leaving directory `/opt/local/var/macports/build/_opt_local_var_macports_sources_rsync.macports.org_release_tarballs_ports_gnome_libglade2/libglade2/work/libglade-2.6.4/glade'
:info:build make[1]: *** [all-recursive] Error 1
:info:build make[1]: Leaving directory `/opt/local/var/macports/build/_opt_local_var_macports_sources_rsync.macports.org_release_tarballs_ports_gnome_libglade2/libglade2/work/libglade-2.6.4'
:info:build make: *** [all] Error 2
:info:build make: Leaving directory `/opt/local/var/macports/build/_opt_local_var_macports_sources_rsync.macports.org_release_tarballs_ports_gnome_libglade2/libglade2/work/libglade-2.6.4'
:info:build shell command " cd "/opt/local/var/macports/build/_opt_local_var_macports_sources_rsync.macports.org_release_tarballs_ports_gnome_libglade2/libglade2/work/libglade-2.6.4" && /usr/bin/make -j16 -w all " returned error 2
:error:build Target org.macports.build returned: shell command failed (see log for details)
:debug:build Backtrace: shell command failed (see log for details)

Change History (3)

comment:1 Changed 9 years ago by ryandesign (Ryan Schmidt)

Description: modified (diff)
Port: libglade2 added

Please "sudo port clean libglade2" and try again, and attach the entire main.log file if it fails again.

comment:2 Changed 9 years ago by der_loewe@…

Thanks, it worked, stupid me did a clean on about everything else except libglade2....

comment:3 Changed 9 years ago by mf2k (Frank Schima)

Resolution: invalid
Status: newclosed
Note: See TracTickets for help on using tickets.