Opened 10 years ago

Closed 10 years ago

Last modified 10 years ago

#34024 closed defect (invalid)

Scribus 1.4.0 error "LONG_BIT definition appears wrong for platform (bad gcc/glibc config?)

Reported by: jovo@… Owned by: macports-tickets@…
Priority: Normal Milestone:
Component: ports Version: 2.0.4
Keywords: Cc:
Port: scribus

Description

Scribus install fails on intel iMac with OS X 10.6.8, details in the log attached.

:info:build In file included from /Library/Frameworks/Python.framework/Headers/Python.h:57,
:info:build                  from /opt/local/var/macports/build/_opt_local_var_macports_sources_rsync.macports.org_release_ports_print_scribus/scribus/work/scribus-1.4.0/scribus/plugins/scriptplugin/cmdvar.h:22,
:info:build                  from /opt/local/var/macports/build/_opt_local_var_macports_sources_rsync.macports.org_release_ports_print_scribus/scribus/work/scribus-1.4.0/scribus/plugins/scriptplugin/cmdcolor.h:11,
:info:build                  from /opt/local/var/macports/build/_opt_local_var_macports_sources_rsync.macports.org_release_ports_print_scribus/scribus/work/scribus-1.4.0/scribus/plugins/scriptplugin/cmdcolor.cpp:7:
:info:build /Library/Frameworks/Python.framework/Headers/pyport.h:761:2: error: #error "LONG_BIT definition appears wrong for platform (bad gcc/glibc config?)."
:info:build make[2]: *** [scribus/plugins/scriptplugin/CMakeFiles/scriptplugin.dir/cmdcolor.cpp.o] Error 1
:info:build make[2]: Leaving directory `/opt/local/var/macports/build/_opt_local_var_macports_sources_rsync.macports.org_release_ports_print_scribus/scribus/work/scribus-1.4.0'
:info:build make[1]: *** [scribus/plugins/scriptplugin/CMakeFiles/scriptplugin.dir/all] Error 2
:info:build make[1]: Leaving directory `/opt/local/var/macports/build/_opt_local_var_macports_sources_rsync.macports.org_release_ports_print_scribus/scribus/work/scribus-1.4.0'
:info:build make: *** [all] Error 2
:info:build make: Leaving directory `/opt/local/var/macports/build/_opt_local_var_macports_sources_rsync.macports.org_release_ports_print_scribus/scribus/work/scribus-1.4.0'
:info:build shell command " cd "/opt/local/var/macports/build/_opt_local_var_macports_sources_rsync.macports.org_release_ports_print_scribus/scribus/work/scribus-1.4.0" && /usr/bin/make -w all " returned error 2
:error:build Target org.macports.build returned: shell command failed (see log for details)
:debug:build Backtrace: shell command failed (see log for details)
    while executing
"command_exec build"
    (procedure "portbuild::build_main" line 8)
    invoked from within
"$procedure $targetname"
:info:build Warning: the following items did not execute (for scribus): org.macports.activate org.macports.build org.macports.destroot org.macports.install
:notice:build Log for scribus is at: /opt/local/var/macports/logs/_opt_local_var_macports_sources_rsync.macports.org_release_ports_print_scribus/scribus/main.log

Attachments (1)

main.log (2.6 MB) - added by jovo@… 10 years ago.

Change History (4)

Changed 10 years ago by jovo@…

Attachment: main.log added

comment:1 Changed 10 years ago by jovo@…

Installed the OS X DMG from http://www.scribus.net/canvas/Scribus instead.

comment:2 Changed 10 years ago by ryandesign (Ryan Schmidt)

Cc: nomaintainer@… removed
Resolution: invalid
Status: newclosed

Remove /Library/Frameworks/Python.framework; it is interfering.

comment:3 in reply to:  2 Changed 10 years ago by jovo@…

Replying to ryandesign@…:

Remove /Library/Frameworks/Python.framework; it is interfering.

Thanks, that works! Don't really know where that came from, I guess the framework came from a non-Macports Python installation I tried last year.

Regards, Jo

Note: See TracTickets for help on using tickets.