Opened 15 years ago

Closed 14 years ago

#3536 closed defect (wontfix)

BUG: growl 7 has issues with XCode 2.1

Reported by: paulbeard@… Owned by: mww@…
Priority: Normal Milestone:
Component: ports Version: 1.0
Keywords: Cc:
Port:

Description

In the wake of rebuilding my entire array of installed ports, I find growl won't rebuild.

---> Building Growl with target all xcodebuild -project Growl.xcode -target Growl.framework -buildstyle Development build deprecated option: -buildstyle is no longer supported in xcodebuild. Use -configuration instead. (NOTE: project Growl was written by an older version of Xcode (39) -- temporarily upgrading it to version 42 (without modifying project file))

BUILDING NATIVE TARGET Growl.framework WITH CONFIGURATION Development

PhaseScriptExecution /opt/local/var/db/dports/build/ file._Users_paul_Documents_src_dports_aqua_Growl/work/Growl-0.7-src/build/Growl.build/ Development/Growl.framework.build/Script-34F6105E078E4D4B00CECA86.sh

cd /opt/local/var/db/dports/build/file._Users_paul_Documents_src_dports_aqua_Growl/work/

Growl-0.7-src

setenv ACTION build setenv APPLE_INTERNAL_DEVELOPER_DIR /AppleInternal/Developer setenv APPLE_INTERNAL_DIR /AppleInternal setenv APPLE_INTERNAL_DOCUMENTATION_DIR /AppleInternal/Documentation setenv APPLE_INTERNAL_LIBRARY_DIR /AppleInternal/Library setenv APPLE_INTERNAL_TOOLS /AppleInternal/Developer/Tools setenv ARCHS ppc setenv BUILD_COMPONENTS "headers build" setenv BUILD_DIR /opt/local/var/db/dports/build/

file._Users_paul_Documents_src_dports_aqua_Growl/work/Growl-0.7-src/build

setenv BUILD_ROOT /opt/local/var/db/dports/build/

file._Users_paul_Documents_src_dports_aqua_Growl/work/Growl-0.7-src/build

setenv BUILD_STYLE Development setenv BUILD_VARIANTS normal setenv BUILT_PRODUCTS_DIR /opt/local/var/db/dports/build/

file._Users_paul_Documents_src_dports_aqua_Growl/work/Growl-0.7-src/build/Development

setenv CACHE_ROOT /Library/Caches/com.apple.Xcode.0 setenv CCHROOT /Library/Caches/com.apple.Xcode.0 setenv CHMOD /bin/chmod setenv CHOWN /usr/sbin/chown setenv CLASS_FILE_DIR /opt/local/var/db/dports/build/

file._Users_paul_Documents_src_dports_aqua_Growl/work/Growl-0.7-src/build/Growl.build/ Development/Growl.framework.build/JavaClasses

setenv CLEAN_PRECOMPS YES setenv CLONE_HEADERS NO setenv CONFIGURATION Development setenv CONFIGURATION_BUILD_DIR /opt/local/var/db/dports/build/

file._Users_paul_Documents_src_dports_aqua_Growl/work/Growl-0.7-src/build/Development

setenv CONFIGURATION_TEMP_DIR /opt/local/var/db/dports/build/

file._Users_paul_Documents_src_dports_aqua_Growl/work/Growl-0.7-src/build/Growl.build/ Development

setenv CONTENTS_FOLDER_PATH Growl.framework/Versions/A setenv COPY_PHASE_STRIP NO setenv COPY_RESOURCES_FROM_STATIC_FRAMEWORKS YES setenv CP /bin/cp setenv CURRENT_PROJECT_VERSION setenv CURRENT_VERSION Current setenv DEBUGGING_SYMBOLS YES setenv DEPLOYMENT_LOCATION NO setenv DERIVED_FILES_DIR /opt/local/var/db/dports/build/

file._Users_paul_Documents_src_dports_aqua_Growl/work/Growl-0.7-src/build/Growl.build/ Development/Growl.framework.build/DerivedSources

setenv DERIVED_FILE_DIR /opt/local/var/db/dports/build/

file._Users_paul_Documents_src_dports_aqua_Growl/work/Growl-0.7-src/build/Growl.build/ Development/Growl.framework.build/DerivedSources

setenv DERIVED_PATHS setenv DERIVED_SOURCES_DIR /opt/local/var/db/dports/build/

file._Users_paul_Documents_src_dports_aqua_Growl/work/Growl-0.7-src/build/Growl.build/ Development/Growl.framework.build/DerivedSources

setenv DEVELOPMENT_LANGUAGE English setenv DOCUMENTATION_FOLDER_PATH Growl.framework/Versions/A/Resources/English.lproj/

Documentation

setenv DSTROOT /tmp/Growl.dst setenv DYLIB_COMPATIBILITY_VERSION 1 setenv DYLIB_CURRENT_VERSION 1 setenv DYLIB_INSTALL_NAME_BASE "@executable_path/../Frameworks" setenv ENABLE_HEADER_DEPENDENCIES YES setenv EXCLUDED_RECURSIVE_SEARCH_PATH_SUBDIRECTORIES "*.nib *.lproj *.framework *.gch

*.xcode (*) CVS .svn"

setenv EXECUTABLES_FOLDER_PATH Growl.framework/Versions/A/Resources/English.lproj setenv EXECUTABLE_EXTENSION setenv EXECUTABLE_FOLDER_PATH Growl.framework/Versions/A setenv EXECUTABLE_NAME Growl setenv EXECUTABLE_PATH Growl.framework/Versions/A/Growl setenv EXECUTABLE_PREFIX setenv EXECUTABLE_SUFFIX setenv EXECUTABLE_VARIANT_SUFFIX setenv FRAMEWORKS_FOLDER_PATH Growl.framework/Versions/A/Frameworks setenv FRAMEWORK_FLAG_PREFIX -framework setenv FRAMEWORK_SEARCH_PATHS /opt/local/var/db/dports/build/

file._Users_paul_Documents_src_dports_aqua_Growl/work/Growl-0.7-src/build/Development

setenv FRAMEWORK_VERSION A setenv FULL_PRODUCT_NAME Growl.framework setenv GCC_AUTO_PCH_HEADER_c setenv GCC_AUTO_PCH_HEADER_c++ setenv GCC_AUTO_PCH_HEADER_objective-c setenv GCC_AUTO_PCH_HEADER_objective-c++ setenv GCC_C_LANGUAGE_STANDARD gnu99 setenv GCC_DYNAMIC_NO_PIC NO setenv GCC_ENABLE_AUTO_PCH NO setenv GCC_ENABLE_FIX_AND_CONTINUE NO setenv GCC_GENERATE_DEBUGGING_SYMBOLS YES setenv GCC_OPTIMIZATION_LEVEL 0 setenv GCC_PFE_FILE_C_DIALECTS "c objective-c c++ objective-c++" setenv GCC_PRECOMPILE_PREFIX_HEADER YES setenv GCC_PREFIX_HEADER Framework/Source/GrowlFramework_Prefix.pch setenv GCC_TREAT_WARNINGS_AS_ERRORS NO setenv GCC_USE_GCC3_PFE_SUPPORT setenv GCC_VERSION 4.0 setenv GCC_WARN_ABOUT_MISSING_PROTOTYPES YES setenv GCC_WARN_ABOUT_RETURN_TYPE YES setenv GCC_WARN_CHECK_SWITCH_STATEMENTS YES setenv GCC_WARN_INITIALIZER_NOT_FULLY_BRACKETED YES setenv GCC_WARN_MISSING_PARENTHESES YES setenv GCC_WARN_SHADOW YES setenv GCC_WARN_SIGN_COMPARE YES setenv GCC_WARN_TYPECHECK_CALLS_TO_PRINTF YES setenv GCC_WARN_UNINITIALIZED_AUTOS NO setenv GCC_WARN_UNKNOWN_PRAGMAS YES setenv GCC_WARN_UNUSED_FUNCTION YES setenv GCC_WARN_UNUSED_LABEL YES setenv GCC_WARN_UNUSED_PARAMETER YES setenv GCC_WARN_UNUSED_VALUE YES setenv GCC_WARN_UNUSED_VARIABLE YES setenv GENERATE_PKGINFO_FILE NO setenv GENERATE_PROFILING_CODE NO setenv GLOBAL_CFLAGS setenv GROUP wheel setenv HEADERMAP_INCLUDES_PROJECT_HEADERS YES setenv HEADER_SEARCH_PATHS /opt/local/var/db/dports/build/

file._Users_paul_Documents_src_dports_aqua_Growl/work/Growl-0.7-src/build/Development/include

setenv INCLUDED_RECURSIVE_SEARCH_PATH_SUBDIRECTORIES setenv INFOPLISTSTRINGS_PATH Growl.framework/Versions/A/Resources/English.lproj/

InfoPlist.strings

setenv INFOPLIST_FILE Framework/Resources/Growl.framework-Info.plist setenv INFOPLIST_PATH Growl.framework/Versions/A/Resources/Info.plist setenv INFOSTRINGS_PATH setenv INIT_ROUTINE setenv INSTALL_DIR "/tmp/Growl.dst@executable_path/../Frameworks" setenv INSTALL_GROUP wheel setenv INSTALL_MODE_FLAG a-w,a+rX setenv INSTALL_OWNER root setenv INSTALL_PATH "@executable_path/../Frameworks" setenv INSTALL_ROOT /tmp/Growl.dst setenv JAVAC_DEFAULT_FLAGS "-J-Xms64m -J-XX:NewSize=4M -J-Dfile.encoding=UTF8" setenv JAVA_APP_STUB /System/Library/Frameworks/JavaVM.framework/Resources/MacOS/

JavaApplicationStub

setenv JAVA_ARCHIVE_CLASSES YES setenv JAVA_ARCHIVE_TYPE JAR setenv JAVA_COMPILER /usr/bin/javac setenv JAVA_FOLDER_PATH Growl.framework/Versions/A/Resources/Java setenv JAVA_FRAMEWORK_JARS setenv JAVA_FRAMEWORK_RESOURCES_DIRS Resources setenv JAVA_JAR_FLAGS cv setenv JAVA_SOURCE_SUBDIR . setenv JAVA_USE_DEPENDENCIES YES setenv JAVA_ZIP_FLAGS -urg setenv JIKES_DEFAULT_FLAGS "+E +OLDCSO" setenv LD_FLAGS setenv LEX /usr/bin/lex setenv LEXFLAGS setenv LIBRARY_FLAG_NOSPACE YES setenv LIBRARY_FLAG_PREFIX -l setenv LIBRARY_SEARCH_PATHS /opt/local/var/db/dports/build/

file._Users_paul_Documents_src_dports_aqua_Growl/work/Growl-0.7-src/build/Development

setenv LIBRARY_STYLE DYNAMIC setenv LINKER_LIBRARY_FLAGS setenv LINK_FILE_LIST_normal_ppc /opt/local/var/db/dports/build/

file._Users_paul_Documents_src_dports_aqua_Growl/work/Growl-0.7-src/build/Growl.build/ Development/Growl.framework.build/Objects-normal/ppc/Growl.LinkFileList

setenv LOCALIZED_RESOURCES_FOLDER_PATH Growl.framework/Versions/A/Resources/English.lproj setenv LOCAL_ADMIN_APPS_DIR /Applications/Utilities setenv LOCAL_APPS_DIR /Applications setenv LOCAL_DEVELOPER_DIR /Library/Developer setenv LOCAL_DEVELOPER_EXECUTABLES_DIR setenv LOCAL_LIBRARY_DIR /Library setenv MACOSX_DEPLOYMENT_TARGET 10.2 setenv MACOS_CREATOR setenv MACOS_CREATOR_ARG setenv MACOS_TYPE setenv MACOS_TYPE_ARG setenv MAC_OS_X_VERSION_MAX_ALLOWED setenv MAC_OS_X_VERSION_MIN_REQUIRED setenv NATIVE_ARCH ppc setenv NO_COMMON YES setenv OBJECT_FILE_DIR /opt/local/var/db/dports/build/

file._Users_paul_Documents_src_dports_aqua_Growl/work/Growl-0.7-src/build/Growl.build/ Development/Growl.framework.build/Objects

setenv OBJECT_FILE_DIR_normal /opt/local/var/db/dports/build/

file._Users_paul_Documents_src_dports_aqua_Growl/work/Growl-0.7-src/build/Growl.build/ Development/Growl.framework.build/Objects-normal

setenv OBJROOT /opt/local/var/db/dports/build/

file._Users_paul_Documents_src_dports_aqua_Growl/work/Growl-0.7-src/build

setenv OPTIMIZATION_CFLAGS -O0 setenv OPTIMIZATION_LEVEL 0 setenv OS MACOS setenv OSAC /usr/bin/osacompile setenv OTHER_CFLAGS setenv OTHER_CPLUSPLUSFLAGS setenv OTHER_LDFLAGS "-lobjc -sub_library libobjc -seg1addr 0xC0000000" setenv OTHER_MIGFLAGS setenv OTHER_OSAFLAGS setenv OTHER_PRECOMP_CFLAGS setenv OTHER_RESMERGERFLAGS setenv OTHER_REZFLAGS setenv PACKAGE_TYPE com.apple.package-type.wrapper.framework setenv PASCAL_STRINGS YES setenv PATH_PREFIXES_EXCLUDED_FROM_HEADER_DEPENDENCIES "/usr/include /usr/local/include /

System/Library/Frameworks /System/Library/PrivateFrameworks /Developer/Headers"

setenv PBDEVELOPMENTPLIST_PATH Growl.framework/Versions/A/pbdevelopment.plist setenv PFE_FILE_C_DIALECTS "c objective-c" setenv PKGINFO_FILE_PATH /opt/local/var/db/dports/build/

file._Users_paul_Documents_src_dports_aqua_Growl/work/Growl-0.7-src/build/Growl.build/ Development/Growl.framework.build/PkgInfo

setenv PKGINFO_PATH Growl.framework/PkgInfo setenv PLUGINS_FOLDER_PATH Growl.framework/Versions/A/Resources setenv PREBINDING YES setenv PRECOMPILE_PREFIX_HEADER setenv PRECOMP_DESTINATION_DIR /opt/local/var/db/dports/build/

file._Users_paul_Documents_src_dports_aqua_Growl/work/Growl-0.7-src/build/Growl.build/ Development/Growl.framework.build/PrefixHeaders

setenv PREFIX_CFLAG_BASE setenv PREFIX_FLAGS setenv PREFIX_HEADER setenv PREFIX_REFERENCE setenv PRIVATE_HEADERS_FOLDER_PATH Growl.framework/Versions/A/PrivateHeaders setenv PRODUCT_NAME Growl setenv PRODUCT_SETTINGS_PATH /opt/local/var/db/dports/build/

file._Users_paul_Documents_src_dports_aqua_Growl/work/Growl-0.7-src/Framework/Resources/ Growl.framework-Info.plist

setenv PRODUCT_TYPE com.apple.product-type.framework setenv PRODUCT_TYPE_CFLAGS setenv PRODUCT_TYPE_CPLUSPLUSFLAGS setenv PRODUCT_TYPE_HEADER_SEARCH_PATHS setenv PROJECT Growl setenv PROJECT_DERIVED_FILE_DIR /opt/local/var/db/dports/build/

file._Users_paul_Documents_src_dports_aqua_Growl/work/Growl-0.7-src/build/Growl.build/ DerivedSources

setenv PROJECT_DIR /opt/local/var/db/dports/build/

file._Users_paul_Documents_src_dports_aqua_Growl/work/Growl-0.7-src

setenv PROJECT_FILE_PATH /opt/local/var/db/dports/build/

file._Users_paul_Documents_src_dports_aqua_Growl/work/Growl-0.7-src/Growl.xcode

setenv PROJECT_NAME Growl setenv PROJECT_TEMP_DIR /opt/local/var/db/dports/build/

file._Users_paul_Documents_src_dports_aqua_Growl/work/Growl-0.7-src/build/Growl.build

setenv PUBLIC_HEADERS_FOLDER_PATH Growl.framework/Versions/A/Headers setenv RECURSIVE_SEARCH_PATHS_FOLLOW_SYMLINKS YES setenv REMOVE_CVS_FROM_RESOURCES YES setenv REMOVE_SVN_FROM_RESOURCES YES setenv RETAIN_RAW_BINARIES setenv REZ_COLLECTOR_DIR /opt/local/var/db/dports/build/

file._Users_paul_Documents_src_dports_aqua_Growl/work/Growl-0.7-src/build/Growl.build/ Development/Growl.framework.build/ResourceManagerResources

setenv REZ_OBJECTS_DIR /opt/local/var/db/dports/build/

file._Users_paul_Documents_src_dports_aqua_Growl/work/Growl-0.7-src/build/Growl.build/ Development/Growl.framework.build/ResourceManagerResources/Objects

setenv REZ_SEARCH_PATHS /opt/local/var/db/dports/build/

file._Users_paul_Documents_src_dports_aqua_Growl/work/Growl-0.7-src/build/Development

setenv SCRIPTS_FOLDER_PATH Growl.framework/Versions/A/Resources/Scripts setenv SCRIPT_INPUT_FILE_COUNT 0 setenv SCRIPT_OUTPUT_FILE_COUNT 0 setenv SDKROOT setenv SECTORDER_FLAGS setenv SED /usr/bin/sed setenv SET_DIR_MODE_OWNER_GROUP YES setenv SET_FILE_MODE_OWNER_GROUP NO setenv SHARED_DERIVED_FILE_DIR /opt/local/var/db/dports/build/

file._Users_paul_Documents_src_dports_aqua_Growl/work/Growl-0.7-src/build/Development/ DerivedSources

setenv SHARED_FRAMEWORKS_FOLDER_PATH Growl.framework/Versions/A/SharedFrameworks setenv SHARED_PRECOMPS_DIR /Library/Caches/com.apple.Xcode.0/SharedPrecompiledHeaders setenv SHARED_SUPPORT_FOLDER_PATH Growl.framework/Versions/A/Resources setenv SKIP_INSTALL YES setenv SOURCE_ROOT /opt/local/var/db/dports/build/

file._Users_paul_Documents_src_dports_aqua_Growl/work/Growl-0.7-src

setenv SRCROOT /opt/local/var/db/dports/build/

file._Users_paul_Documents_src_dports_aqua_Growl/work/Growl-0.7-src

setenv STRIPFLAGS setenv STRIP_INSTALLED_PRODUCT YES setenv SYMBOL_HEADER setenv SYMBOL_REPOSITORY setenv SYMROOT /opt/local/var/db/dports/build/

file._Users_paul_Documents_src_dports_aqua_Growl/work/Growl-0.7-src/build

setenv SYSTEM_ADMIN_APPS_DIR /Applications/Utilities setenv SYSTEM_APPS_DIR /Applications setenv SYSTEM_CORE_SERVICES_DIR /System/Library/CoreServices setenv SYSTEM_DEMOS_DIR /Applications/Extras setenv SYSTEM_DEVELOPER_APPS_DIR /Developer/Applications setenv SYSTEM_DEVELOPER_DEMOS_DIR "/Developer/Applications/Utilities/Built Examples" setenv SYSTEM_DEVELOPER_DIR /Developer setenv SYSTEM_DEVELOPER_DOC_DIR "/Developer/ADC Reference Library" setenv SYSTEM_DEVELOPER_EXECUTABLES_DIR setenv SYSTEM_DEVELOPER_GRAPHICS_TOOLS_DIR "/Developer/Applications/Graphics Tools" setenv SYSTEM_DEVELOPER_JAVA_TOOLS_DIR "/Developer/Applications/Java Tools" setenv SYSTEM_DEVELOPER_PERFORMANCE_TOOLS_DIR "/Developer/Applications/Performance

Tools"

setenv SYSTEM_DEVELOPER_RELEASENOTES_DIR "/Developer/ADC Reference Library/releasenotes" setenv SYSTEM_DEVELOPER_TOOLS /Developer/Tools setenv SYSTEM_DEVELOPER_TOOLS_DOC_DIR "/Developer/ADC Reference Library/documentation/

DeveloperTools"

setenv SYSTEM_DEVELOPER_TOOLS_RELEASENOTES_DIR "/Developer/ADC Reference Library/

releasenotes/DeveloperTools"

setenv SYSTEM_DEVELOPER_UTILITIES_DIR /Developer/Applications/Utilities setenv SYSTEM_DOCUMENTATION_DIR /Library/Documentation setenv SYSTEM_LIBRARY_DIR /System/Library setenv SYSTEM_LIBRARY_EXECUTABLES_DIR setenv TARGETNAME Growl.framework setenv TARGET_BUILD_DIR /opt/local/var/db/dports/build/

file._Users_paul_Documents_src_dports_aqua_Growl/work/Growl-0.7-src/build/Development

setenv TARGET_NAME Growl.framework setenv TARGET_TEMP_DIR /opt/local/var/db/dports/build/

file._Users_paul_Documents_src_dports_aqua_Growl/work/Growl-0.7-src/build/Growl.build/ Development/Growl.framework.build

setenv TEMP_DIR /opt/local/var/db/dports/build/

file._Users_paul_Documents_src_dports_aqua_Growl/work/Growl-0.7-src/build/Growl.build/ Development/Growl.framework.build

setenv TEMP_FILES_DIR /opt/local/var/db/dports/build/

file._Users_paul_Documents_src_dports_aqua_Growl/work/Growl-0.7-src/build/Growl.build/ Development/Growl.framework.build

setenv TEMP_FILE_DIR /opt/local/var/db/dports/build/

file._Users_paul_Documents_src_dports_aqua_Growl/work/Growl-0.7-src/build/Growl.build/ Development/Growl.framework.build

setenv TEMP_ROOT /opt/local/var/db/dports/build/

file._Users_paul_Documents_src_dports_aqua_Growl/work/Growl-0.7-src/build

setenv UID 0 setenv UNLOCALIZED_RESOURCES_FOLDER_PATH Growl.framework/Versions/A/Resources setenv UNSTRIPPED_PRODUCT NO setenv USER root setenv USER_APPS_DIR /Users/paul/Applications setenv USER_LIBRARY_DIR /Users/paul/Library setenv USE_DYNAMIC_NO_PIC YES setenv USE_GCC3_PFE_SUPPORT setenv VALID_ARCHS "m68k i386 sparc hppa ppc ppc7400 ppc970 ppc64" setenv VERBOSE_PBXCP NO setenv VERSIONING_STUB setenv VERSIONING_SYSTEM setenv VERSIONPLIST_PATH Growl.framework/Versions/A/Resources/version.plist setenv VERSIONS_FOLDER_PATH Growl.framework/Versions setenv VERSION_INFO_BUILDER root setenv VERSION_INFO_EXPORT_DECL setenv VERSION_INFO_PREFIX setenv VERSION_INFO_STRING "\"@(#)PROGRAM:Growl PROJECT:Growl- DEVELOPER:root BUILT:\"

DATE \" \" TIME \"\""

setenv VERSION_INFO_SUFFIX setenv WARNING_CFLAGS "-W -Wall" setenv WARNING_LDFLAGS setenv WRAPPER_EXTENSION framework setenv WRAPPER_NAME Growl.framework setenv WRAPPER_PREFIX setenv WRAPPER_SUFFIX .framework setenv XCODE_APP_SUPPORT_DIR "/Library/Application Support/Apple/Developer Tools" setenv YACC /usr/bin/yacc setenv YACCFLAGS setenv ZERO_LINK NO /bin/sh -c /opt/local/var/db/dports/build/file._Users_paul_Documents_src_dports_aqua_Growl/

work/Growl-0.7-src/build/Growl.build/Development/Growl.framework.build/ Script-34F6105E078E4D4B00CECA86.sh find: /opt/local/var/db/dports/build/file._Users_paul_Documents_src_dports_aqua_Growl/work/ Growl-0.7-src/build/Growl.framework: No such file or directory BUILD SUCCEEDED xcodebuild -project Growl.xcode -alltargets -buildstyle Development build deprecated option: -buildstyle is no longer supported in xcodebuild. Use -configuration instead. (NOTE: project Growl was written by an older version of Xcode (39) -- temporarily upgrading it to version 42 (without modifying project file))

BUILDING NATIVE TARGET Brushed WITH CONFIGURATION Development

BUILDING NATIVE TARGET Bubbles WITH CONFIGURATION Development

BUILDING NATIVE TARGET Bezel WITH CONFIGURATION Development

BUILDING NATIVE TARGET Speech WITH CONFIGURATION Development

BUILDING NATIVE TARGET Smoke WITH CONFIGURATION Development

BUILDING NATIVE TARGET MailMe WITH CONFIGURATION Development

BUILDING NATIVE TARGET MusicVideo WITH CONFIGURATION Development

BUILDING NATIVE TARGET GrowlHelperApp WITH CONFIGURATION Development

PhaseScriptExecution /opt/local/var/db/dports/build/ file._Users_paul_Documents_src_dports_aqua_Growl/work/Growl-0.7-src/build/Growl.build/ Development/GrowlHelperApp.build/Script-95EF44ED083A583E003CBF77.sh

cd /opt/local/var/db/dports/build/file._Users_paul_Documents_src_dports_aqua_Growl/work/

Growl-0.7-src

setenv ACTION build setenv APPLE_INTERNAL_DEVELOPER_DIR /AppleInternal/Developer setenv APPLE_INTERNAL_DIR /AppleInternal setenv APPLE_INTERNAL_DOCUMENTATION_DIR /AppleInternal/Documentation setenv APPLE_INTERNAL_LIBRARY_DIR /AppleInternal/Library setenv APPLE_INTERNAL_TOOLS /AppleInternal/Developer/Tools setenv ARCHS ppc setenv BUILD_COMPONENTS "headers build" setenv BUILD_DIR /opt/local/var/db/dports/build/

file._Users_paul_Documents_src_dports_aqua_Growl/work/Growl-0.7-src/build

setenv BUILD_ROOT /opt/local/var/db/dports/build/

file._Users_paul_Documents_src_dports_aqua_Growl/work/Growl-0.7-src/build

setenv BUILD_STYLE Development setenv BUILD_VARIANTS normal setenv BUILT_PRODUCTS_DIR /opt/local/var/db/dports/build/

file._Users_paul_Documents_src_dports_aqua_Growl/work/Growl-0.7-src/build/Development

setenv CACHE_ROOT /Library/Caches/com.apple.Xcode.0 setenv CCHROOT /Library/Caches/com.apple.Xcode.0 setenv CHMOD /bin/chmod setenv CHOWN /usr/sbin/chown setenv CLASS_FILE_DIR /opt/local/var/db/dports/build/

file._Users_paul_Documents_src_dports_aqua_Growl/work/Growl-0.7-src/build/Growl.build/ Development/GrowlHelperApp.build/JavaClasses

setenv CLEAN_PRECOMPS YES setenv CLONE_HEADERS NO setenv CONFIGURATION Development setenv CONFIGURATION_BUILD_DIR /opt/local/var/db/dports/build/

file._Users_paul_Documents_src_dports_aqua_Growl/work/Growl-0.7-src/build/Development

setenv CONFIGURATION_TEMP_DIR /opt/local/var/db/dports/build/

file._Users_paul_Documents_src_dports_aqua_Growl/work/Growl-0.7-src/build/Growl.build/ Development

setenv CONTENTS_FOLDER_PATH GrowlHelperApp.app/Contents setenv COPY_PHASE_STRIP NO setenv COPY_RESOURCES_FROM_STATIC_FRAMEWORKS YES setenv CP /bin/cp setenv CURRENT_PROJECT_VERSION setenv DEBUGGING_SYMBOLS YES setenv DEPLOYMENT_LOCATION NO setenv DERIVED_FILES_DIR /opt/local/var/db/dports/build/

file._Users_paul_Documents_src_dports_aqua_Growl/work/Growl-0.7-src/build/Growl.build/ Development/GrowlHelperApp.build/DerivedSources

setenv DERIVED_FILE_DIR /opt/local/var/db/dports/build/

file._Users_paul_Documents_src_dports_aqua_Growl/work/Growl-0.7-src/build/Growl.build/ Development/GrowlHelperApp.build/DerivedSources

setenv DERIVED_PATHS setenv DERIVED_SOURCES_DIR /opt/local/var/db/dports/build/

file._Users_paul_Documents_src_dports_aqua_Growl/work/Growl-0.7-src/build/Growl.build/ Development/GrowlHelperApp.build/DerivedSources

setenv DEVELOPMENT_LANGUAGE English setenv DOCUMENTATION_FOLDER_PATH /Documentation setenv DSTROOT /tmp/Growl.dst setenv DYLIB_COMPATIBILITY_VERSION setenv DYLIB_CURRENT_VERSION setenv DYLIB_INSTALL_NAME_BASE setenv ENABLE_HEADER_DEPENDENCIES YES setenv EXCLUDED_RECURSIVE_SEARCH_PATH_SUBDIRECTORIES "*.nib *.lproj *.framework *.gch

*.xcode (*) CVS .svn"

setenv EXECUTABLES_FOLDER_PATH GrowlHelperApp.app/Contents/Executables setenv EXECUTABLE_EXTENSION setenv EXECUTABLE_FOLDER_PATH GrowlHelperApp.app/Contents/MacOS setenv EXECUTABLE_NAME GrowlHelperApp setenv EXECUTABLE_PATH GrowlHelperApp.app/Contents/MacOS/GrowlHelperApp setenv EXECUTABLE_PREFIX setenv EXECUTABLE_SUFFIX setenv EXECUTABLE_VARIANT_SUFFIX setenv FRAMEWORKS_FOLDER_PATH GrowlHelperApp.app/Contents/Frameworks setenv FRAMEWORK_FLAG_PREFIX -framework setenv FRAMEWORK_SEARCH_PATHS /opt/local/var/db/dports/build/

file._Users_paul_Documents_src_dports_aqua_Growl/work/Growl-0.7-src/build/Development

setenv FRAMEWORK_VERSION A setenv FULL_PRODUCT_NAME GrowlHelperApp.app setenv GCC_AUTO_PCH_HEADER_c setenv GCC_AUTO_PCH_HEADER_c++ setenv GCC_AUTO_PCH_HEADER_objective-c setenv GCC_AUTO_PCH_HEADER_objective-c++ setenv GCC_C_LANGUAGE_STANDARD gnu99 setenv GCC_DYNAMIC_NO_PIC NO setenv GCC_ENABLE_AUTO_PCH NO setenv GCC_ENABLE_FIX_AND_CONTINUE NO setenv GCC_ENABLE_OBJC_EXCEPTIONS YES setenv GCC_GENERATE_DEBUGGING_SYMBOLS YES setenv GCC_OPTIMIZATION_LEVEL 0 setenv GCC_PFE_FILE_C_DIALECTS "c objective-c c++ objective-c++" setenv GCC_PRECOMPILE_PREFIX_HEADER YES setenv GCC_PREFIX_HEADER Core/Source/Growl_Prefix.pch setenv GCC_SYMBOLS_PRIVATE_EXTERN YES setenv GCC_TREAT_WARNINGS_AS_ERRORS NO setenv GCC_USE_GCC3_PFE_SUPPORT setenv GCC_VERSION setenv GCC_WARN_ABOUT_MISSING_NEWLINE YES setenv GCC_WARN_ABOUT_MISSING_PROTOTYPES YES setenv GCC_WARN_ABOUT_RETURN_TYPE YES setenv GCC_WARN_CHECK_SWITCH_STATEMENTS YES setenv GCC_WARN_INITIALIZER_NOT_FULLY_BRACKETED YES setenv GCC_WARN_MISSING_PARENTHESES YES setenv GCC_WARN_SHADOW YES setenv GCC_WARN_SIGN_COMPARE YES setenv GCC_WARN_TYPECHECK_CALLS_TO_PRINTF YES setenv GCC_WARN_UNINITIALIZED_AUTOS NO setenv GCC_WARN_UNKNOWN_PRAGMAS YES setenv GCC_WARN_UNUSED_FUNCTION YES setenv GCC_WARN_UNUSED_LABEL YES setenv GCC_WARN_UNUSED_PARAMETER YES setenv GCC_WARN_UNUSED_VALUE YES setenv GCC_WARN_UNUSED_VARIABLE YES setenv GENERATE_PKGINFO_FILE YES setenv GENERATE_PROFILING_CODE NO setenv GLOBAL_CFLAGS setenv GROUP wheel setenv HEADERMAP_INCLUDES_PROJECT_HEADERS YES setenv HEADER_SEARCH_PATHS /opt/local/var/db/dports/build/

file._Users_paul_Documents_src_dports_aqua_Growl/work/Growl-0.7-src/build/Development/include

setenv INCLUDED_RECURSIVE_SEARCH_PATH_SUBDIRECTORIES setenv INFOPLIST_FILE Core/Resources/GrowlHelperApp-Info.plist setenv INFOPLIST_PATH GrowlHelperApp.app/Contents/Info.plist setenv INFOSTRINGS_PATH /InfoPlist.strings setenv INIT_ROUTINE setenv INSTALL_DIR /tmp/Growl.dst/Users/paul/Applications setenv INSTALL_GROUP wheel setenv INSTALL_MODE_FLAG a-w,a+rX setenv INSTALL_OWNER root setenv INSTALL_PATH /Users/paul/Applications setenv INSTALL_ROOT /tmp/Growl.dst setenv JAVAC_DEFAULT_FLAGS "-J-Xms64m -J-XX:NewSize=4M -J-Dfile.encoding=UTF8" setenv JAVA_APP_STUB /System/Library/Frameworks/JavaVM.framework/Resources/MacOS/

JavaApplicationStub

setenv JAVA_ARCHIVE_CLASSES YES setenv JAVA_ARCHIVE_TYPE JAR setenv JAVA_COMPILER /usr/bin/javac setenv JAVA_FOLDER_PATH GrowlHelperApp.app/Contents/Resources/Java setenv JAVA_FRAMEWORK_JARS setenv JAVA_FRAMEWORK_RESOURCES_DIRS Resources setenv JAVA_JAR_FLAGS cv setenv JAVA_SOURCE_SUBDIR . setenv JAVA_USE_DEPENDENCIES YES setenv JAVA_ZIP_FLAGS -urg setenv JIKES_DEFAULT_FLAGS "+E +OLDCSO" setenv LD_FLAGS setenv LEX /usr/bin/lex setenv LEXFLAGS setenv LIBRARY_FLAG_NOSPACE YES setenv LIBRARY_FLAG_PREFIX -l setenv LIBRARY_SEARCH_PATHS /opt/local/var/db/dports/build/

file._Users_paul_Documents_src_dports_aqua_Growl/work/Growl-0.7-src/build/Development

setenv LINKER_LIBRARY_FLAGS setenv LINK_FILE_LIST_normal_ppc /opt/local/var/db/dports/build/

file._Users_paul_Documents_src_dports_aqua_Growl/work/Growl-0.7-src/build/Growl.build/ Development/GrowlHelperApp.build/Objects-normal/ppc/GrowlHelperApp.LinkFileList

setenv LOCAL_ADMIN_APPS_DIR /Applications/Utilities setenv LOCAL_APPS_DIR /Applications setenv LOCAL_DEVELOPER_DIR /Library/Developer setenv LOCAL_DEVELOPER_EXECUTABLES_DIR setenv LOCAL_LIBRARY_DIR /Library setenv MACOSX_DEPLOYMENT_TARGET 10.3 setenv MACOS_CREATOR setenv MACOS_CREATOR_ARG setenv MACOS_TYPE setenv MACOS_TYPE_ARG setenv MAC_OS_X_VERSION_MAX_ALLOWED setenv MAC_OS_X_VERSION_MIN_REQUIRED setenv NATIVE_ARCH ppc setenv NO_COMMON YES setenv OBJECT_FILE_DIR /opt/local/var/db/dports/build/

file._Users_paul_Documents_src_dports_aqua_Growl/work/Growl-0.7-src/build/Growl.build/ Development/GrowlHelperApp.build/Objects

setenv OBJECT_FILE_DIR_normal /opt/local/var/db/dports/build/

file._Users_paul_Documents_src_dports_aqua_Growl/work/Growl-0.7-src/build/Growl.build/ Development/GrowlHelperApp.build/Objects-normal

setenv OBJROOT /opt/local/var/db/dports/build/

file._Users_paul_Documents_src_dports_aqua_Growl/work/Growl-0.7-src/build

setenv OPTIMIZATION_CFLAGS -O0 setenv OPTIMIZATION_LEVEL 0 setenv OS MACOS setenv OSAC /usr/bin/osacompile setenv OTHER_CFLAGS setenv OTHER_CPLUSPLUSFLAGS setenv OTHER_LDFLAGS setenv OTHER_MIGFLAGS setenv OTHER_OSAFLAGS setenv OTHER_PRECOMP_CFLAGS setenv OTHER_RESMERGERFLAGS setenv OTHER_REZFLAGS setenv PACKAGE_TYPE com.apple.package-type.wrapper.application setenv PASCAL_STRINGS YES setenv PATH_PREFIXES_EXCLUDED_FROM_HEADER_DEPENDENCIES "/usr/include /usr/local/include /

System/Library/Frameworks /System/Library/PrivateFrameworks /Developer/Headers"

setenv PBDEVELOPMENTPLIST_PATH GrowlHelperApp.app/Contents/pbdevelopment.plist setenv PFE_FILE_C_DIALECTS "c objective-c" setenv PKGINFO_FILE_PATH /opt/local/var/db/dports/build/

file._Users_paul_Documents_src_dports_aqua_Growl/work/Growl-0.7-src/build/Growl.build/ Development/GrowlHelperApp.build/PkgInfo

setenv PKGINFO_PATH GrowlHelperApp.app/Contents/PkgInfo setenv PLUGINS_FOLDER_PATH GrowlHelperApp.app/Contents/PlugIns setenv PREBINDING YES setenv PRECOMPILE_PREFIX_HEADER setenv PRECOMP_DESTINATION_DIR /opt/local/var/db/dports/build/

file._Users_paul_Documents_src_dports_aqua_Growl/work/Growl-0.7-src/build/Growl.build/ Development/GrowlHelperApp.build/PrefixHeaders

setenv PREFIX_CFLAG_BASE setenv PREFIX_FLAGS setenv PREFIX_HEADER setenv PREFIX_REFERENCE setenv PRIVATE_HEADERS_FOLDER_PATH GrowlHelperApp.app/Contents/PrivateHeaders setenv PRODUCT_NAME GrowlHelperApp setenv PRODUCT_SETTINGS_PATH /opt/local/var/db/dports/build/

file._Users_paul_Documents_src_dports_aqua_Growl/work/Growl-0.7-src/Core/Resources/ GrowlHelperApp-Info.plist

setenv PRODUCT_TYPE com.apple.product-type.application setenv PRODUCT_TYPE_CFLAGS setenv PRODUCT_TYPE_CPLUSPLUSFLAGS setenv PRODUCT_TYPE_HEADER_SEARCH_PATHS setenv PROJECT Growl setenv PROJECT_DERIVED_FILE_DIR /opt/local/var/db/dports/build/

file._Users_paul_Documents_src_dports_aqua_Growl/work/Growl-0.7-src/build/Growl.build/ DerivedSources

setenv PROJECT_DIR /opt/local/var/db/dports/build/

file._Users_paul_Documents_src_dports_aqua_Growl/work/Growl-0.7-src

setenv PROJECT_FILE_PATH /opt/local/var/db/dports/build/

file._Users_paul_Documents_src_dports_aqua_Growl/work/Growl-0.7-src/Growl.xcode

setenv PROJECT_NAME Growl setenv PROJECT_TEMP_DIR /opt/local/var/db/dports/build/

file._Users_paul_Documents_src_dports_aqua_Growl/work/Growl-0.7-src/build/Growl.build

setenv PUBLIC_HEADERS_FOLDER_PATH GrowlHelperApp.app/Contents/Headers setenv RECURSIVE_SEARCH_PATHS_FOLLOW_SYMLINKS YES setenv REMOVE_CVS_FROM_RESOURCES YES setenv REMOVE_SVN_FROM_RESOURCES YES setenv RETAIN_RAW_BINARIES setenv REZ_COLLECTOR_DIR /opt/local/var/db/dports/build/

file._Users_paul_Documents_src_dports_aqua_Growl/work/Growl-0.7-src/build/Growl.build/ Development/GrowlHelperApp.build/ResourceManagerResources

setenv REZ_OBJECTS_DIR /opt/local/var/db/dports/build/

file._Users_paul_Documents_src_dports_aqua_Growl/work/Growl-0.7-src/build/Growl.build/ Development/GrowlHelperApp.build/ResourceManagerResources/Objects

setenv REZ_RESOURCE_MAP_READ_ONLY YES setenv REZ_SEARCH_PATHS /opt/local/var/db/dports/build/

file._Users_paul_Documents_src_dports_aqua_Growl/work/Growl-0.7-src/build/Development

setenv SCRIPTS_FOLDER_PATH GrowlHelperApp.app/Contents/Resources/Scripts setenv SCRIPT_INPUT_FILE_COUNT 0 setenv SCRIPT_OUTPUT_FILE_COUNT 0 setenv SDKROOT setenv SECTORDER_FLAGS setenv SED /usr/bin/sed setenv SET_DIR_MODE_OWNER_GROUP YES setenv SET_FILE_MODE_OWNER_GROUP NO setenv SHARED_DERIVED_FILE_DIR /opt/local/var/db/dports/build/

file._Users_paul_Documents_src_dports_aqua_Growl/work/Growl-0.7-src/build/Development/ DerivedSources

setenv SHARED_FRAMEWORKS_FOLDER_PATH GrowlHelperApp.app/Contents/SharedFrameworks setenv SHARED_PRECOMPS_DIR /Library/Caches/com.apple.Xcode.0/SharedPrecompiledHeaders setenv SHARED_SUPPORT_FOLDER_PATH GrowlHelperApp.app/Contents/SharedSupport setenv SOURCE_ROOT /opt/local/var/db/dports/build/

file._Users_paul_Documents_src_dports_aqua_Growl/work/Growl-0.7-src

setenv SRCROOT /opt/local/var/db/dports/build/

file._Users_paul_Documents_src_dports_aqua_Growl/work/Growl-0.7-src

setenv STRIPFLAGS setenv STRIP_INSTALLED_PRODUCT YES setenv SYMBOL_HEADER setenv SYMBOL_REPOSITORY setenv SYMROOT /opt/local/var/db/dports/build/

file._Users_paul_Documents_src_dports_aqua_Growl/work/Growl-0.7-src/build

setenv SYSTEM_ADMIN_APPS_DIR /Applications/Utilities setenv SYSTEM_APPS_DIR /Applications setenv SYSTEM_CORE_SERVICES_DIR /System/Library/CoreServices setenv SYSTEM_DEMOS_DIR /Applications/Extras setenv SYSTEM_DEVELOPER_APPS_DIR /Developer/Applications setenv SYSTEM_DEVELOPER_DEMOS_DIR "/Developer/Applications/Utilities/Built Examples" setenv SYSTEM_DEVELOPER_DIR /Developer setenv SYSTEM_DEVELOPER_DOC_DIR "/Developer/ADC Reference Library" setenv SYSTEM_DEVELOPER_EXECUTABLES_DIR setenv SYSTEM_DEVELOPER_GRAPHICS_TOOLS_DIR "/Developer/Applications/Graphics Tools" setenv SYSTEM_DEVELOPER_JAVA_TOOLS_DIR "/Developer/Applications/Java Tools" setenv SYSTEM_DEVELOPER_PERFORMANCE_TOOLS_DIR "/Developer/Applications/Performance

Tools"

setenv SYSTEM_DEVELOPER_RELEASENOTES_DIR "/Developer/ADC Reference Library/releasenotes" setenv SYSTEM_DEVELOPER_TOOLS /Developer/Tools setenv SYSTEM_DEVELOPER_TOOLS_DOC_DIR "/Developer/ADC Reference Library/documentation/

DeveloperTools"

setenv SYSTEM_DEVELOPER_TOOLS_RELEASENOTES_DIR "/Developer/ADC Reference Library/

releasenotes/DeveloperTools"

setenv SYSTEM_DEVELOPER_UTILITIES_DIR /Developer/Applications/Utilities setenv SYSTEM_DOCUMENTATION_DIR /Library/Documentation setenv SYSTEM_LIBRARY_DIR /System/Library setenv SYSTEM_LIBRARY_EXECUTABLES_DIR setenv TARGETNAME GrowlHelperApp setenv TARGET_BUILD_DIR /opt/local/var/db/dports/build/

file._Users_paul_Documents_src_dports_aqua_Growl/work/Growl-0.7-src/build/Development

setenv TARGET_NAME GrowlHelperApp setenv TARGET_TEMP_DIR /opt/local/var/db/dports/build/

file._Users_paul_Documents_src_dports_aqua_Growl/work/Growl-0.7-src/build/Growl.build/ Development/GrowlHelperApp.build

setenv TEMP_DIR /opt/local/var/db/dports/build/

file._Users_paul_Documents_src_dports_aqua_Growl/work/Growl-0.7-src/build/Growl.build/ Development/GrowlHelperApp.build

setenv TEMP_FILES_DIR /opt/local/var/db/dports/build/

file._Users_paul_Documents_src_dports_aqua_Growl/work/Growl-0.7-src/build/Growl.build/ Development/GrowlHelperApp.build

setenv TEMP_FILE_DIR /opt/local/var/db/dports/build/

file._Users_paul_Documents_src_dports_aqua_Growl/work/Growl-0.7-src/build/Growl.build/ Development/GrowlHelperApp.build

setenv TEMP_ROOT /opt/local/var/db/dports/build/

file._Users_paul_Documents_src_dports_aqua_Growl/work/Growl-0.7-src/build

setenv UID 0 setenv UNLOCALIZED_RESOURCES_FOLDER_PATH GrowlHelperApp.app/Contents/Resources setenv UNSTRIPPED_PRODUCT NO setenv USER root setenv USER_APPS_DIR /Users/paul/Applications setenv USER_LIBRARY_DIR /Users/paul/Library setenv USE_DYNAMIC_NO_PIC YES setenv USE_GCC3_PFE_SUPPORT setenv VALID_ARCHS "m68k i386 sparc hppa ppc ppc7400 ppc970 ppc64" setenv VERBOSE_PBXCP NO setenv VERSIONING_STUB setenv VERSIONING_SYSTEM setenv VERSIONPLIST_PATH GrowlHelperApp.app/Contents/version.plist setenv VERSION_INFO_BUILDER root setenv VERSION_INFO_EXPORT_DECL setenv VERSION_INFO_PREFIX setenv VERSION_INFO_STRING "\"@(#)PROGRAM:GrowlHelperApp PROJECT:Growl- DEVELOPER:root

BUILT:\" DATE \" \" TIME \"\""

setenv VERSION_INFO_SUFFIX setenv WARNING_CFLAGS "-W -Wall" setenv WARNING_LDFLAGS setenv WRAPPER_EXTENSION app setenv WRAPPER_NAME GrowlHelperApp.app setenv WRAPPER_PREFIX setenv WRAPPER_SUFFIX .app setenv XCODE_APP_SUPPORT_DIR "/Library/Application Support/Apple/Developer Tools" setenv YACC /usr/bin/yacc setenv YACCFLAGS setenv ZERO_LINK NO /bin/sh -c /opt/local/var/db/dports/build/file._Users_paul_Documents_src_dports_aqua_Growl/

work/Growl-0.7-src/build/Growl.build/Development/GrowlHelperApp.build/ Script-95EF44ED083A583E003CBF77.sh deprecated option: -buildstyle is no longer supported in xcodebuild. Use -configuration instead. (NOTE: project GrowlImporter was written by an older version of Xcode (39) -- temporarily upgrading it to version 42 (without modifying project file))

BUILDING NATIVE TARGET GrowlImporter WITH CONFIGURATION Development

BUILD SUCCEEDED deprecated option: -buildstyle is no longer supported in xcodebuild. Use -configuration instead. (NOTE: project GrowlAction was written by an older version of Xcode (39) -- temporarily upgrading it to version 42 (without modifying project file))

BUILDING NATIVE TARGET GrowlAction WITH CONFIGURATION Development

BUILD SUCCEEDED

CompileC build/Growl.build/Development/GrowlHelperApp.build/Objects-normal/ppc/ GrowlController.o Core/Source/GrowlController.m normal ppc objective-c com.apple.compilers.gcc.4_0

mkdir /opt/local/var/db/dports/build/file._Users_paul_Documents_src_dports_aqua_Growl/work/

Growl-0.7-src/build/Growl.build/Development/GrowlHelperApp.build/Objects-normal/ppc

cd /opt/local/var/db/dports/build/file._Users_paul_Documents_src_dports_aqua_Growl/work/

Growl-0.7-src

setenv MACOSX_DEPLOYMENT_TARGET 10.3 /usr/bin/gcc-4.0 -x objective-c -arch ppc -pipe -std=gnu99 -Wno-trigraphs -fobjc-exceptions -

fpascal-strings -fasm-blocks -g -O0 -Wmissing-prototypes -Wreturn-type -Wformat -Wmissing- braces -Wparentheses -Wswitch -Wunused-function -Wunused-label -Wunused-parameter -Wunused- variable -Wunused-value -Wunknown-pragmas -Wshadow -Wsign-compare -Wnewline-eof - fmessage-length=0 -mtune=G4 -fvisibility=hidden -I/opt/local/var/db/dports/build/ file._Users_paul_Documents_src_dports_aqua_Growl/work/Growl-0.7-src/build/Growl.build/ Development/GrowlHelperApp.build/GrowlHelperApp.hmap -W -Wall -O0 -F/opt/local/var/db/dports/ build/file._Users_paul_Documents_src_dports_aqua_Growl/work/Growl-0.7-src/build/Development -I/ opt/local/var/db/dports/build/file._Users_paul_Documents_src_dports_aqua_Growl/work/Growl-0.7- src/build/Development/include -I/opt/local/var/db/dports/build/ file._Users_paul_Documents_src_dports_aqua_Growl/work/Growl-0.7-src/build/Growl.build/ Development/GrowlHelperApp.build/DerivedSources -include /Library/Caches/com.apple.Xcode.0/ SharedPrecompiledHeaders/Growl_Prefix-bicmgaxqrnjvkodrhieoturmoykd/Growl_Prefix.pch -c /opt/ local/var/db/dports/build/file._Users_paul_Documents_src_dports_aqua_Growl/work/Growl-0.7-src/ Core/Source/GrowlController.m -o /opt/local/var/db/dports/build/ file._Users_paul_Documents_src_dports_aqua_Growl/work/Growl-0.7-src/build/Growl.build/ Development/GrowlHelperApp.build/Objects-normal/ppc/GrowlController.o /opt/local/var/db/dports/build/file._Users_paul_Documents_src_dports_aqua_Growl/work/Growl-0.7- src/Core/Source/GrowlController.m:26:24: error: SVNRevision.h: No such file or directory /opt/local/var/db/dports/build/file._Users_paul_Documents_src_dports_aqua_Growl/work/Growl-0.7- src/Core/Source/GrowlController.m: In function '-[GrowlController versionDictionary]': /opt/local/var/db/dports/build/file._Users_paul_Documents_src_dports_aqua_Growl/work/Growl-0.7- src/Core/Source/GrowlController.m:557: error: 'SVN_REVISION' undeclared (first use in this function) /opt/local/var/db/dports/build/file._Users_paul_Documents_src_dports_aqua_Growl/work/Growl-0.7- src/Core/Source/GrowlController.m:557: error: (Each undeclared identifier is reported only once /opt/local/var/db/dports/build/file._Users_paul_Documents_src_dports_aqua_Growl/work/Growl-0.7- src/Core/Source/GrowlController.m:557: error: for each function it appears in.) BUILD FAILED make: * [all] Error 1 Error: Target com.apple.build returned: shell command "cd "/opt/local/var/db/dports/build/ file._Users_paul_Documents_src_dports_aqua_Growl/work/Growl-0.7-src" && make all" returned error 2 Command output: setenv WRAPPER_PREFIX

setenv WRAPPER_SUFFIX .app setenv XCODE_APP_SUPPORT_DIR "/Library/Application Support/Apple/Developer Tools" setenv YACC /usr/bin/yacc setenv YACCFLAGS setenv ZERO_LINK NO /bin/sh -c /opt/local/var/db/dports/build/file._Users_paul_Documents_src_dports_aqua_Growl/

work/Growl-0.7-src/build/Growl.build/Development/GrowlHelperApp.build/ Script-95EF44ED083A583E003CBF77.sh deprecated option: -buildstyle is no longer supported in xcodebuild. Use -configuration instead. (NOTE: project GrowlImporter was written by an older version of Xcode (39) -- temporarily upgrading it to version 42 (without modifying project file))

BUILDING NATIVE TARGET GrowlImporter WITH CONFIGURATION Development

BUILD SUCCEEDED deprecated option: -buildstyle is no longer supported in xcodebuild. Use -configuration instead. (NOTE: project GrowlAction was written by an older version of Xcode (39) -- temporarily upgrading it to version 42 (without modifying project file))

BUILDING NATIVE TARGET GrowlAction WITH CONFIGURATION Development

BUILD SUCCEEDED

CompileC build/Growl.build/Development/GrowlHelperApp.build/Objects-normal/ppc/ GrowlController.o Core/Source/GrowlController.m normal ppc objective-c com.apple.compilers.gcc.4_0

mkdir /opt/local/var/db/dports/build/file._Users_paul_Documents_src_dports_aqua_Growl/work/

Growl-0.7-src/build/Growl.build/Development/GrowlHelperApp.build/Objects-normal/ppc

cd /opt/local/var/db/dports/build/file._Users_paul_Documents_src_dports_aqua_Growl/work/

Growl-0.7-src

setenv MACOSX_DEPLOYMENT_TARGET 10.3 /usr/bin/gcc-4.0 -x objective-c -arch ppc -pipe -std=gnu99 -Wno-trigraphs -fobjc-exceptions -

fpascal-strings -fasm-blocks -g -O0 -Wmissing-prototypes -Wreturn-type -Wformat -Wmissing- braces -Wparentheses -Wswitch -Wunused-function -Wunused-label -Wunused-parameter -Wunused- variable -Wunused-value -Wunknown-pragmas -Wshadow -Wsign-compare -Wnewline-eof - fmessage-length=0 -mtune=G4 -fvisibility=hidden -I/opt/local/var/db/dports/build/ file._Users_paul_Documents_src_dports_aqua_Growl/work/Growl-0.7-src/build/Growl.build/ Development/GrowlHelperApp.build/GrowlHelperApp.hmap -W -Wall -O0 -F/opt/local/var/db/dports/ build/file._Users_paul_Documents_src_dports_aqua_Growl/work/Growl-0.7-src/build/Development -I/ opt/local/var/db/dports/build/file._Users_paul_Documents_src_dports_aqua_Growl/work/Growl-0.7- src/build/Development/include -I/opt/local/var/db/dports/build/ file._Users_paul_Documents_src_dports_aqua_Growl/work/Growl-0.7-src/build/Growl.build/ Development/GrowlHelperApp.build/DerivedSources -include /Library/Caches/com.apple.Xcode.0/ SharedPrecompiledHeaders/Growl_Prefix-bicmgaxqrnjvkodrhieoturmoykd/Growl_Prefix.pch -c /opt/ local/var/db/dports/build/file._Users_paul_Documents_src_dports_aqua_Growl/work/Growl-0.7-src/ Core/Source/GrowlController.m -o /opt/local/var/db/dports/build/ file._Users_paul_Documents_src_dports_aqua_Growl/work/Growl-0.7-src/build/Growl.build/ Development/GrowlHelperApp.build/Objects-normal/ppc/GrowlController.o /opt/local/var/db/dports/build/file._Users_paul_Documents_src_dports_aqua_Growl/work/Growl-0.7- src/Core/Source/GrowlController.m:26:24: error: SVNRevision.h: No such file or directory /opt/local/var/db/dports/build/file._Users_paul_Documents_src_dports_aqua_Growl/work/Growl-0.7- src/Core/Source/GrowlController.m: In function '-[GrowlController versionDictionary]': /opt/local/var/db/dports/build/file._Users_paul_Documents_src_dports_aqua_Growl/work/Growl-0.7- src/Core/Source/GrowlController.m:557: error: 'SVN_REVISION' undeclared (first use in this function) /opt/local/var/db/dports/build/file._Users_paul_Documents_src_dports_aqua_Growl/work/Growl-0.7- src/Core/Source/GrowlController.m:557: error: (Each undeclared identifier is reported only once /opt/local/var/db/dports/build/file._Users_paul_Documents_src_dports_aqua_Growl/work/Growl-0.7- src/Core/Source/GrowlController.m:557: error: for each function it appears in.) BUILD FAILED make: * [all] Error 1

Warning: the following items did not execute (for Growl): com.apple.build

Change History (2)

comment:1 Changed 15 years ago by mww@…

Summary: [bug] growl 7 has issues with XCode 2.1BUG: growl 7 has issues with XCode 2.1

this is a known problem with the growl people - have to wait for a fix meanwhile;

comment:2 Changed 14 years ago by pguyot (Paul Guyot)

Resolution: wontfix
Status: newclosed

We need to update growl to 0.7.6 anyway.

Note: See TracTickets for help on using tickets.