Opened 9 years ago

Closed 9 years ago

Last modified 9 years ago

#35366 closed defect (duplicate)

installing dsniff failed

Reported by: Jeffreygrimmie@… Owned by: macports-tickets@…
Priority: Normal Milestone:
Component: ports Version: 2.1.2
Keywords: Cc:
Port: dsniff

Description (last modified by ryandesign (Ryan Schmidt))

version:1
:debug:main epoch: in tree: 0 installed: 0
:debug:main libnids 1.24_0 exists in the ports tree
:debug:main libnids 1.24_0 +libnet11 is the latest installed
:debug:main libnids 1.24_0 +libnet11 is active
:debug:main Merging existing variants '+libnet11' into variants
:debug:main new fully merged portvariants: libnet11 +
:debug:main Changing to port directory: /opt/local/var/macports/sources/rsync.macports.org/release/tarballs/ports/net/libnids
:debug:main OS darwin/12.0.0 (Mac OS X 10.8) arch i386
:debug:main org.macports.load registered provides 'load', a pre-existing procedure. Target override will not be provided
:debug:main org.macports.unload registered provides 'unload', a pre-existing procedure. Target override will not be provided
:debug:main org.macports.distfiles registered provides 'distfiles', a pre-existing procedure. Target override will not be provided
:debug:main adding the default universal variant
:debug:main Reading variant descriptions from /opt/local/var/macports/sources/rsync.macports.org/release/tarballs/ports/_resources/port1.0/variant_descriptions.conf
:debug:main Executing variant libnet11 provides libnet11
:debug:main No need to upgrade! libnids 1.24_0 >= libnids 1.24_0
:debug:main epoch: in tree: 0 installed: 0
:debug:main libpcap 1.2.1_0 exists in the ports tree
:debug:main libpcap 1.2.1_0  is the latest installed
:debug:main libpcap 1.2.1_0  is active
:debug:main Merging existing variants '' into variants
:debug:main new fully merged portvariants: 
:debug:main Changing to port directory: /opt/local/var/macports/sources/rsync.macports.org/release/tarballs/ports/net/libpcap
:debug:main OS darwin/12.0.0 (Mac OS X 10.8) arch i386
:debug:main org.macports.load registered provides 'load', a pre-existing procedure. Target override will not be provided
:debug:main org.macports.unload registered provides 'unload', a pre-existing procedure. Target override will not be provided
:debug:main org.macports.distfiles registered provides 'distfiles', a pre-existing procedure. Target override will not be provided
:debug:main adding the default universal variant
:debug:main Reading variant descriptions from /opt/local/var/macports/sources/rsync.macports.org/release/tarballs/ports/_resources/port1.0/variant_descriptions.conf
:debug:main No need to upgrade! libpcap 1.2.1_0 >= libpcap 1.2.1_0
:debug:main epoch: in tree: 0 installed: 0
:debug:main libnet11 1.1.6_1 exists in the ports tree
:debug:main libnet11 1.1.6_1  is the latest installed
:debug:main libnet11 1.1.6_1  is active
:debug:main Merging existing variants '' into variants
:debug:main new fully merged portvariants: 
:debug:main Changing to port directory: /opt/local/var/macports/sources/rsync.macports.org/release/tarballs/ports/net/libnet11
:debug:main OS darwin/12.0.0 (Mac OS X 10.8) arch i386
:debug:main org.macports.load registered provides 'load', a pre-existing procedure. Target override will not be provided
:debug:main org.macports.unload registered provides 'unload', a pre-existing procedure. Target override will not be provided
:debug:main org.macports.distfiles registered provides 'distfiles', a pre-existing procedure. Target override will not be provided
:debug:main adding the default universal variant
:debug:main Reading variant descriptions from /opt/local/var/macports/sources/rsync.macports.org/release/tarballs/ports/_resources/port1.0/variant_descriptions.conf
:debug:main No need to upgrade! libnet11 1.1.6_1 >= libnet11 1.1.6_1
:debug:main epoch: in tree: 1 installed: 1
:debug:main openssl 1.0.1c_0 exists in the ports tree
:debug:main openssl 1.0.1c_0  is the latest installed
:debug:main openssl 1.0.1c_0  is active
:debug:main Merging existing variants '' into variants
:debug:main new fully merged portvariants: 
:debug:main Changing to port directory: /opt/local/var/macports/sources/rsync.macports.org/release/tarballs/ports/devel/openssl
:debug:main OS darwin/12.0.0 (Mac OS X 10.8) arch i386
:debug:main org.macports.load registered provides 'load', a pre-existing procedure. Target override will not be provided
:debug:main org.macports.unload registered provides 'unload', a pre-existing procedure. Target override will not be provided
:debug:main org.macports.distfiles registered provides 'distfiles', a pre-existing procedure. Target override will not be provided
:debug:main Using group file /opt/local/var/macports/sources/rsync.macports.org/release/tarballs/ports/_resources/port1.0/group/muniversal-1.0.tcl
:debug:main Reading variant descriptions from /opt/local/var/macports/sources/rsync.macports.org/release/tarballs/ports/_resources/port1.0/variant_descriptions.conf
:debug:main universal variant already exists, so not adding the default one
:debug:main No need to upgrade! openssl 1.0.1c_0 >= openssl 1.0.1c_0
:debug:main epoch: in tree: 0 installed: 0
:debug:main zlib 1.2.7_0 exists in the ports tree
:debug:main zlib 1.2.7_0  is the latest installed
:debug:main zlib 1.2.7_0  is active
:debug:main Merging existing variants '' into variants
:debug:main new fully merged portvariants: 
:debug:main Changing to port directory: /opt/local/var/macports/sources/rsync.macports.org/release/tarballs/ports/archivers/zlib
:debug:main OS darwin/12.0.0 (Mac OS X 10.8) arch i386
:debug:main org.macports.load registered provides 'load', a pre-existing procedure. Target override will not be provided
:debug:main org.macports.unload registered provides 'unload', a pre-existing procedure. Target override will not be provided
:debug:main org.macports.distfiles registered provides 'distfiles', a pre-existing procedure. Target override will not be provided
:debug:main Using group file /opt/local/var/macports/sources/rsync.macports.org/release/tarballs/ports/_resources/port1.0/group/xcodeversion-1.0.tcl
:debug:main adding the default universal variant
:debug:main Reading variant descriptions from /opt/local/var/macports/sources/rsync.macports.org/release/tarballs/ports/_resources/port1.0/variant_descriptions.conf
:debug:main No need to upgrade! zlib 1.2.7_0 >= zlib 1.2.7_0
:debug:main epoch: in tree: 0 installed: 0
:debug:main xorg-libXmu 1.1.1_0 exists in the ports tree
:debug:main xorg-libXmu 1.1.1_0  is the latest installed
:debug:main xorg-libXmu 1.1.1_0  is active
:debug:main Merging existing variants '' into variants
:debug:main new fully merged portvariants: 
:debug:main Changing to port directory: /opt/local/var/macports/sources/rsync.macports.org/release/tarballs/ports/x11/xorg-libXmu
:debug:main OS darwin/12.0.0 (Mac OS X 10.8) arch i386
:debug:main org.macports.load registered provides 'load', a pre-existing procedure. Target override will not be provided
:debug:main org.macports.unload registered provides 'unload', a pre-existing procedure. Target override will not be provided
:debug:main org.macports.distfiles registered provides 'distfiles', a pre-existing procedure. Target override will not be provided
:debug:main adding the default universal variant
:debug:main Reading variant descriptions from /opt/local/var/macports/sources/rsync.macports.org/release/tarballs/ports/_resources/port1.0/variant_descriptions.conf
:debug:main No need to upgrade! xorg-libXmu 1.1.1_0 >= xorg-libXmu 1.1.1_0
:debug:main epoch: in tree: 0 installed: 0
:debug:main xorg-libXext 1.3.1_0 exists in the ports tree
:debug:main xorg-libXext 1.3.1_0  is the latest installed
:debug:main xorg-libXext 1.3.1_0  is active
:debug:main Merging existing variants '' into variants
:debug:main new fully merged portvariants: 
:debug:main Changing to port directory: /opt/local/var/macports/sources/rsync.macports.org/release/tarballs/ports/x11/xorg-libXext
:debug:main OS darwin/12.0.0 (Mac OS X 10.8) arch i386
:debug:main org.macports.load registered provides 'load', a pre-existing procedure. Target override will not be provided
:debug:main org.macports.unload registered provides 'unload', a pre-existing procedure. Target override will not be provided
:debug:main org.macports.distfiles registered provides 'distfiles', a pre-existing procedure. Target override will not be provided
:debug:main adding the default universal variant
:debug:main Reading variant descriptions from /opt/local/var/macports/sources/rsync.macports.org/release/tarballs/ports/_resources/port1.0/variant_descriptions.conf
:debug:main No need to upgrade! xorg-libXext 1.3.1_0 >= xorg-libXext 1.3.1_0
:debug:main epoch: in tree: 0 installed: 0
:debug:main xorg-libX11 1.5.0_0 exists in the ports tree
:debug:main xorg-libX11 1.5.0_0  is the latest installed
:debug:main xorg-libX11 1.5.0_0  is active
:debug:main Merging existing variants '' into variants
:debug:main new fully merged portvariants: 
:debug:main Changing to port directory: /opt/local/var/macports/sources/rsync.macports.org/release/tarballs/ports/x11/xorg-libX11
:debug:main OS darwin/12.0.0 (Mac OS X 10.8) arch i386
:debug:main org.macports.load registered provides 'load', a pre-existing procedure. Target override will not be provided
:debug:main org.macports.unload registered provides 'unload', a pre-existing procedure. Target override will not be provided
:debug:main org.macports.distfiles registered provides 'distfiles', a pre-existing procedure. Target override will not be provided
:debug:main adding the default universal variant
:debug:main Reading variant descriptions from /opt/local/var/macports/sources/rsync.macports.org/release/tarballs/ports/_resources/port1.0/variant_descriptions.conf
:debug:main No need to upgrade! xorg-libX11 1.5.0_0 >= xorg-libX11 1.5.0_0
:debug:main epoch: in tree: 0 installed: 0
:debug:main xorg-libXdmcp 1.1.1_0 exists in the ports tree
:debug:main xorg-libXdmcp 1.1.1_0  is the latest installed
:debug:main xorg-libXdmcp 1.1.1_0  is active
:debug:main Merging existing variants '' into variants
:debug:main new fully merged portvariants: 
:debug:main Changing to port directory: /opt/local/var/macports/sources/rsync.macports.org/release/tarballs/ports/x11/xorg-libXdmcp
:debug:main OS darwin/12.0.0 (Mac OS X 10.8) arch i386
:debug:main org.macports.load registered provides 'load', a pre-existing procedure. Target override will not be provided
:debug:main org.macports.unload registered provides 'unload', a pre-existing procedure. Target override will not be provided
:debug:main org.macports.distfiles registered provides 'distfiles', a pre-existing procedure. Target override will not be provided
:debug:main adding the default universal variant
:debug:main Reading variant descriptions from /opt/local/var/macports/sources/rsync.macports.org/release/tarballs/ports/_resources/port1.0/variant_descriptions.conf
:debug:main No need to upgrade! xorg-libXdmcp 1.1.1_0 >= xorg-libXdmcp 1.1.1_0
:debug:main epoch: in tree: 0 installed: 0
:debug:main xorg-libXau 1.0.7_0 exists in the ports tree
:debug:main xorg-libXau 1.0.7_0  is the latest installed
:debug:main xorg-libXau 1.0.7_0  is active
:debug:main Merging existing variants '' into variants
:debug:main new fully merged portvariants: 
:debug:main Changing to port directory: /opt/local/var/macports/sources/rsync.macports.org/release/tarballs/ports/x11/xorg-libXau
:debug:main OS darwin/12.0.0 (Mac OS X 10.8) arch i386
:debug:main org.macports.load registered provides 'load', a pre-existing procedure. Target override will not be provided
:debug:main org.macports.unload registered provides 'unload', a pre-existing procedure. Target override will not be provided
:debug:main org.macports.distfiles registered provides 'distfiles', a pre-existing procedure. Target override will not be provided
:debug:main adding the default universal variant
:debug:main Reading variant descriptions from /opt/local/var/macports/sources/rsync.macports.org/release/tarballs/ports/_resources/port1.0/variant_descriptions.conf
:debug:main No need to upgrade! xorg-libXau 1.0.7_0 >= xorg-libXau 1.0.7_0
:debug:main epoch: in tree: 0 installed: 0
:debug:main xorg-xproto 7.0.23_0 exists in the ports tree
:debug:main xorg-xproto 7.0.23_0  is the latest installed
:debug:main xorg-xproto 7.0.23_0  is active
:debug:main Merging existing variants '' into variants
:debug:main new fully merged portvariants: 
:debug:main Changing to port directory: /opt/local/var/macports/sources/rsync.macports.org/release/tarballs/ports/x11/xorg-xproto
:debug:main OS darwin/12.0.0 (Mac OS X 10.8) arch i386
:debug:main org.macports.load registered provides 'load', a pre-existing procedure. Target override will not be provided
:debug:main org.macports.unload registered provides 'unload', a pre-existing procedure. Target override will not be provided
:debug:main org.macports.distfiles registered provides 'distfiles', a pre-existing procedure. Target override will not be provided
:debug:main only one arch supported, so not adding the default universal variant
:debug:main No need to upgrade! xorg-xproto 7.0.23_0 >= xorg-xproto 7.0.23_0
:debug:main epoch: in tree: 0 installed: 0
:debug:main xorg-libxcb 1.8.1_2 exists in the ports tree
:debug:main xorg-libxcb 1.8.1_2 +python27 is the latest installed
:debug:main xorg-libxcb 1.8.1_2 +python27 is active
:debug:main Merging existing variants '+python27' into variants
:debug:main new fully merged portvariants: python27 +
:debug:main Changing to port directory: /opt/local/var/macports/sources/rsync.macports.org/release/tarballs/ports/x11/xorg-libxcb
:debug:main OS darwin/12.0.0 (Mac OS X 10.8) arch i386
:debug:main org.macports.load registered provides 'load', a pre-existing procedure. Target override will not be provided
:debug:main org.macports.unload registered provides 'unload', a pre-existing procedure. Target override will not be provided
:debug:main org.macports.distfiles registered provides 'distfiles', a pre-existing procedure. Target override will not be provided
:debug:main adding the default universal variant
:debug:main Reading variant descriptions from /opt/local/var/macports/sources/rsync.macports.org/release/tarballs/ports/_resources/port1.0/variant_descriptions.conf
:debug:main Executing variant python27 provides python27
:debug:main No need to upgrade! xorg-libxcb 1.8.1_2 >= xorg-libxcb 1.8.1_2
:debug:main epoch: in tree: 0 installed: 0
:debug:main xorg-xcb-proto 1.7.1_0 exists in the ports tree
:debug:main xorg-xcb-proto 1.7.1_0 +python27 is the latest installed
:debug:main xorg-xcb-proto 1.7.1_0 +python27 is active
:debug:main Merging existing variants '+python27' into variants
:debug:main new fully merged portvariants: python27 +
:debug:main Changing to port directory: /opt/local/var/macports/sources/rsync.macports.org/release/tarballs/ports/x11/xorg-xcb-proto
:debug:main OS darwin/12.0.0 (Mac OS X 10.8) arch i386
:debug:main org.macports.load registered provides 'load', a pre-existing procedure. Target override will not be provided
:debug:main org.macports.unload registered provides 'unload', a pre-existing procedure. Target override will not be provided
:debug:main org.macports.distfiles registered provides 'distfiles', a pre-existing procedure. Target override will not be provided
:debug:main only one arch supported, so not adding the default universal variant
:debug:main Executing variant python27 provides python27
:debug:main No need to upgrade! xorg-xcb-proto 1.7.1_0 >= xorg-xcb-proto 1.7.1_0
:debug:main epoch: in tree: 0 installed: 0
:debug:main libxml2 2.7.8_0 exists in the ports tree
:debug:main libxml2 2.7.8_0  is the latest installed
:debug:main libxml2 2.7.8_0  is active
:debug:main Merging existing variants '' into variants
:debug:main new fully merged portvariants: 
:debug:main Changing to port directory: /opt/local/var/macports/sources/rsync.macports.org/release/tarballs/ports/textproc/libxml2
:debug:main OS darwin/12.0.0 (Mac OS X 10.8) arch i386
:debug:main org.macports.load registered provides 'load', a pre-existing procedure. Target override will not be provided
:debug:main org.macports.unload registered provides 'unload', a pre-existing procedure. Target override will not be provided
:debug:main org.macports.distfiles registered provides 'distfiles', a pre-existing procedure. Target override will not be provided
:debug:main adding the default universal variant
:debug:main Reading variant descriptions from /opt/local/var/macports/sources/rsync.macports.org/release/tarballs/ports/_resources/port1.0/variant_descriptions.conf
:debug:main No need to upgrade! libxml2 2.7.8_0 >= libxml2 2.7.8_0
:debug:main epoch: in tree: 0 installed: 0
:debug:main libiconv 1.14_0 exists in the ports tree
:debug:main libiconv 1.14_0  is the latest installed
:debug:main libiconv 1.14_0  is active
:debug:main Merging existing variants '' into variants
:debug:main new fully merged portvariants: 
:debug:main Changing to port directory: /opt/local/var/macports/sources/rsync.macports.org/release/tarballs/ports/textproc/libiconv
:debug:main OS darwin/12.0.0 (Mac OS X 10.8) arch i386
:debug:main org.macports.load registered provides 'load', a pre-existing procedure. Target override will not be provided
:debug:main org.macports.unload registered provides 'unload', a pre-existing procedure. Target override will not be provided
:debug:main org.macports.distfiles registered provides 'distfiles', a pre-existing procedure. Target override will not be provided
:debug:main Using group file /opt/local/var/macports/sources/rsync.macports.org/release/tarballs/ports/_resources/port1.0/group/muniversal-1.0.tcl
:debug:main Reading variant descriptions from /opt/local/var/macports/sources/rsync.macports.org/release/tarballs/ports/_resources/port1.0/variant_descriptions.conf
:debug:main universal variant already exists, so not adding the default one
:debug:main No need to upgrade! libiconv 1.14_0 >= libiconv 1.14_0
:debug:main epoch: in tree: 2 installed: 2
:debug:main python27 2.7.3_0 exists in the ports tree
:debug:main python27 2.7.3_0  is the latest installed
:debug:main python27 2.7.3_0  is active
:debug:main Merging existing variants '' into variants
:debug:main new fully merged portvariants: 
:debug:main Changing to port directory: /opt/local/var/macports/sources/rsync.macports.org/release/tarballs/ports/lang/python27
:debug:main OS darwin/12.0.0 (Mac OS X 10.8) arch i386
:debug:main org.macports.load registered provides 'load', a pre-existing procedure. Target override will not be provided
:debug:main org.macports.unload registered provides 'unload', a pre-existing procedure. Target override will not be provided
:debug:main org.macports.distfiles registered provides 'distfiles', a pre-existing procedure. Target override will not be provided
:debug:main Using group file /opt/local/var/macports/sources/rsync.macports.org/release/tarballs/ports/_resources/port1.0/group/select-1.0.tcl
:debug:main Reading variant descriptions from /opt/local/var/macports/sources/rsync.macports.org/release/tarballs/ports/_resources/port1.0/variant_descriptions.conf
:debug:main universal variant already exists, so not adding the default one
:debug:main No need to upgrade! python27 2.7.3_0 >= python27 2.7.3_0
:debug:main epoch: in tree: 0 installed: 0
:debug:main gettext 0.18.1.1_2 exists in the ports tree
:debug:main gettext 0.18.1.1_2  is the latest installed
:debug:main gettext 0.18.1.1_2  is active
:debug:main Merging existing variants '' into variants
:debug:main new fully merged portvariants: 
:debug:main Changing to port directory: /opt/local/var/macports/sources/rsync.macports.org/release/tarballs/ports/devel/gettext
:debug:main OS darwin/12.0.0 (Mac OS X 10.8) arch i386
:debug:main org.macports.load registered provides 'load', a pre-existing procedure. Target override will not be provided
:debug:main org.macports.unload registered provides 'unload', a pre-existing procedure. Target override will not be provided
:debug:main org.macports.distfiles registered provides 'distfiles', a pre-existing procedure. Target override will not be provided
:debug:main Using group file /opt/local/var/macports/sources/rsync.macports.org/release/tarballs/ports/_resources/port1.0/group/muniversal-1.0.tcl
:debug:main Reading variant descriptions from /opt/local/var/macports/sources/rsync.macports.org/release/tarballs/ports/_resources/port1.0/variant_descriptions.conf
:debug:main Using group file /opt/local/var/macports/sources/rsync.macports.org/release/tarballs/ports/_resources/port1.0/group/archcheck-1.0.tcl
:debug:main universal variant already exists, so not adding the default one
:debug:main No need to upgrade! gettext 0.18.1.1_2 >= gettext 0.18.1.1_2
:debug:main epoch: in tree: 0 installed: 0
:debug:main ncurses 5.9_1 exists in the ports tree
:debug:main ncurses 5.9_1  is the latest installed
:debug:main ncurses 5.9_1  is active
:debug:main Merging existing variants '' into variants
:debug:main new fully merged portvariants: 
:debug:main Changing to port directory: /opt/local/var/macports/sources/rsync.macports.org/release/tarballs/ports/devel/ncurses
:debug:main OS darwin/12.0.0 (Mac OS X 10.8) arch i386
:debug:main org.macports.load registered provides 'load', a pre-existing procedure. Target override will not be provided
:debug:main org.macports.unload registered provides 'unload', a pre-existing procedure. Target override will not be provided
:debug:main org.macports.distfiles registered provides 'distfiles', a pre-existing procedure. Target override will not be provided
:debug:main adding the default universal variant
:debug:main Reading variant descriptions from /opt/local/var/macports/sources/rsync.macports.org/release/tarballs/ports/_resources/port1.0/variant_descriptions.conf
:debug:main No need to upgrade! ncurses 5.9_1 >= ncurses 5.9_1
:debug:main epoch: in tree: 0 installed: 0
:debug:main expat 2.1.0_0 exists in the ports tree
:debug:main expat 2.1.0_0  is the latest installed
:debug:main expat 2.1.0_0  is active
:debug:main Merging existing variants '' into variants
:debug:main new fully merged portvariants: 
:debug:main Changing to port directory: /opt/local/var/macports/sources/rsync.macports.org/release/tarballs/ports/textproc/expat
:debug:main OS darwin/12.0.0 (Mac OS X 10.8) arch i386
:debug:main org.macports.load registered provides 'load', a pre-existing procedure. Target override will not be provided
:debug:main org.macports.unload registered provides 'unload', a pre-existing procedure. Target override will not be provided
:debug:main org.macports.distfiles registered provides 'distfiles', a pre-existing procedure. Target override will not be provided
:debug:main adding the default universal variant
:debug:main Reading variant descriptions from /opt/local/var/macports/sources/rsync.macports.org/release/tarballs/ports/_resources/port1.0/variant_descriptions.conf
:debug:main No need to upgrade! expat 2.1.0_0 >= expat 2.1.0_0
:debug:main epoch: in tree: 0 installed: 0
:debug:main sqlite3 3.7.13_0 exists in the ports tree
:debug:main sqlite3 3.7.13_0  is the latest installed
:debug:main sqlite3 3.7.13_0  is active
:debug:main Merging existing variants '' into variants
:debug:main new fully merged portvariants: 
:debug:main Changing to port directory: /opt/local/var/macports/sources/rsync.macports.org/release/tarballs/ports/databases/sqlite3
:debug:main OS darwin/12.0.0 (Mac OS X 10.8) arch i386
:debug:main org.macports.load registered provides 'load', a pre-existing procedure. Target override will not be provided
:debug:main org.macports.unload registered provides 'unload', a pre-existing procedure. Target override will not be provided
:debug:main org.macports.distfiles registered provides 'distfiles', a pre-existing procedure. Target override will not be provided
:debug:main adding the default universal variant
:debug:main Reading variant descriptions from /opt/local/var/macports/sources/rsync.macports.org/release/tarballs/ports/_resources/port1.0/variant_descriptions.conf
:debug:main No need to upgrade! sqlite3 3.7.13_0 >= sqlite3 3.7.13_0
:debug:main epoch: in tree: 20090923 installed: 20090923
:debug:main libedit 20120601-3.0_0 exists in the ports tree
:debug:main libedit 20120601-3.0_0  is the latest installed
:debug:main libedit 20120601-3.0_0  is active
:debug:main Merging existing variants '' into variants
:debug:main new fully merged portvariants: 
:debug:main Changing to port directory: /opt/local/var/macports/sources/rsync.macports.org/release/tarballs/ports/devel/libedit
:debug:main OS darwin/12.0.0 (Mac OS X 10.8) arch i386
:debug:main org.macports.load registered provides 'load', a pre-existing procedure. Target override will not be provided
:debug:main org.macports.unload registered provides 'unload', a pre-existing procedure. Target override will not be provided
:debug:main org.macports.distfiles registered provides 'distfiles', a pre-existing procedure. Target override will not be provided
:debug:main Using group file /opt/local/var/macports/sources/rsync.macports.org/release/tarballs/ports/_resources/port1.0/group/muniversal-1.0.tcl
:debug:main Reading variant descriptions from /opt/local/var/macports/sources/rsync.macports.org/release/tarballs/ports/_resources/port1.0/variant_descriptions.conf
:debug:main universal variant already exists, so not adding the default one
:debug:main No need to upgrade! libedit 20120601-3.0_0 >= libedit 20120601-3.0_0
:debug:main epoch: in tree: 0 installed: 0
:debug:main db46 4.6.21_6 exists in the ports tree
:debug:main db46 4.6.21_6  is the latest installed
:debug:main db46 4.6.21_6  is active
:debug:main Merging existing variants '' into variants
:debug:main new fully merged portvariants: 
:debug:main Changing to port directory: /opt/local/var/macports/sources/rsync.macports.org/release/tarballs/ports/databases/db46
:debug:main OS darwin/12.0.0 (Mac OS X 10.8) arch i386
:debug:main org.macports.load registered provides 'load', a pre-existing procedure. Target override will not be provided
:debug:main org.macports.unload registered provides 'unload', a pre-existing procedure. Target override will not be provided
:debug:main org.macports.distfiles registered provides 'distfiles', a pre-existing procedure. Target override will not be provided
:debug:main Using group file /opt/local/var/macports/sources/rsync.macports.org/release/tarballs/ports/_resources/port1.0/group/muniversal-1.0.tcl
:debug:main Reading variant descriptions from /opt/local/var/macports/sources/rsync.macports.org/release/tarballs/ports/_resources/port1.0/variant_descriptions.conf
:debug:main universal variant already exists, so not adding the default one
:debug:main No need to upgrade! db46 4.6.21_6 >= db46 4.6.21_6
:debug:main epoch: in tree: 0 installed: 0
:debug:main bzip2 1.0.6_0 exists in the ports tree
:debug:main bzip2 1.0.6_0  is the latest installed
:debug:main bzip2 1.0.6_0  is active
:debug:main Merging existing variants '' into variants
:debug:main new fully merged portvariants: 
:debug:main Changing to port directory: /opt/local/var/macports/sources/rsync.macports.org/release/tarballs/ports/archivers/bzip2
:debug:main OS darwin/12.0.0 (Mac OS X 10.8) arch i386
:debug:main org.macports.load registered provides 'load', a pre-existing procedure. Target override will not be provided
:debug:main org.macports.unload registered provides 'unload', a pre-existing procedure. Target override will not be provided
:debug:main org.macports.distfiles registered provides 'distfiles', a pre-existing procedure. Target override will not be provided
:debug:main Reading variant descriptions from /opt/local/var/macports/sources/rsync.macports.org/release/tarballs/ports/_resources/port1.0/variant_descriptions.conf
:debug:main universal variant already exists, so not adding the default one
:debug:main No need to upgrade! bzip2 1.0.6_0 >= bzip2 1.0.6_0
:debug:main epoch: in tree: 0 installed: 0
:debug:main python_select 0.3_1 exists in the ports tree
:debug:main python_select 0.3_1  is the latest installed
:debug:main python_select 0.3_1  is active
:debug:main Merging existing variants '' into variants
:debug:main new fully merged portvariants: 
:debug:main Changing to port directory: /opt/local/var/macports/sources/rsync.macports.org/release/tarballs/ports/sysutils/python_select
:debug:main OS darwin/12.0.0 (Mac OS X 10.8) arch i386
:debug:main org.macports.load registered provides 'load', a pre-existing procedure. Target override will not be provided
:debug:main org.macports.unload registered provides 'unload', a pre-existing procedure. Target override will not be provided
:debug:main org.macports.distfiles registered provides 'distfiles', a pre-existing procedure. Target override will not be provided
:debug:main Using group file /opt/local/var/macports/sources/rsync.macports.org/release/tarballs/ports/_resources/port1.0/group/select-1.0.tcl
:debug:main universal_variant is false, so not adding the default universal variant
:debug:main No need to upgrade! python_select 0.3_1 >= python_select 0.3_1
:debug:main epoch: in tree: 0 installed: 0
:debug:main xorg-libpthread-stubs 0.3_0 exists in the ports tree
:debug:main xorg-libpthread-stubs 0.3_0  is the latest installed
:debug:main xorg-libpthread-stubs 0.3_0  is active
:debug:main Merging existing variants '' into variants
:debug:main new fully merged portvariants: 
:debug:main Changing to port directory: /opt/local/var/macports/sources/rsync.macports.org/release/tarballs/ports/x11/xorg-libpthread-stubs
:debug:main OS darwin/12.0.0 (Mac OS X 10.8) arch i386
:debug:main org.macports.load registered provides 'load', a pre-existing procedure. Target override will not be provided
:debug:main org.macports.unload registered provides 'unload', a pre-existing procedure. Target override will not be provided
:debug:main org.macports.distfiles registered provides 'distfiles', a pre-existing procedure. Target override will not be provided
:debug:main only one arch supported, so not adding the default universal variant
:debug:main No need to upgrade! xorg-libpthread-stubs 0.3_0 >= xorg-libpthread-stubs 0.3_0
:debug:main epoch: in tree: 0 installed: 0
:debug:main xorg-kbproto 1.0.6_0 exists in the ports tree
:debug:main xorg-kbproto 1.0.6_0  is the latest installed
:debug:main xorg-kbproto 1.0.6_0  is active
:debug:main Merging existing variants '' into variants
:debug:main new fully merged portvariants: 
:debug:main Changing to port directory: /opt/local/var/macports/sources/rsync.macports.org/release/tarballs/ports/x11/xorg-kbproto
:debug:main OS darwin/12.0.0 (Mac OS X 10.8) arch i386
:debug:main org.macports.load registered provides 'load', a pre-existing procedure. Target override will not be provided
:debug:main org.macports.unload registered provides 'unload', a pre-existing procedure. Target override will not be provided
:debug:main org.macports.distfiles registered provides 'distfiles', a pre-existing procedure. Target override will not be provided
:debug:main only one arch supported, so not adding the default universal variant
:debug:main No need to upgrade! xorg-kbproto 1.0.6_0 >= xorg-kbproto 1.0.6_0
:debug:main epoch: in tree: 0 installed: 0
:debug:main xorg-xextproto 7.2.1_0 exists in the ports tree
:debug:main xorg-xextproto 7.2.1_0  is the latest installed
:debug:main xorg-xextproto 7.2.1_0  is active
:debug:main Merging existing variants '' into variants
:debug:main new fully merged portvariants: 
:debug:main Changing to port directory: /opt/local/var/macports/sources/rsync.macports.org/release/tarballs/ports/x11/xorg-xextproto
:debug:main OS darwin/12.0.0 (Mac OS X 10.8) arch i386
:debug:main org.macports.load registered provides 'load', a pre-existing procedure. Target override will not be provided
:debug:main org.macports.unload registered provides 'unload', a pre-existing procedure. Target override will not be provided
:debug:main org.macports.distfiles registered provides 'distfiles', a pre-existing procedure. Target override will not be provided
:debug:main only one arch supported, so not adding the default universal variant
:debug:main No need to upgrade! xorg-xextproto 7.2.1_0 >= xorg-xextproto 7.2.1_0
:debug:main epoch: in tree: 0 installed: 0
:debug:main xorg-libXt 1.1.3_0 exists in the ports tree
:debug:main xorg-libXt 1.1.3_0  is the latest installed
:debug:main xorg-libXt 1.1.3_0  is active
:debug:main Merging existing variants '' into variants
:debug:main new fully merged portvariants: 
:debug:main Changing to port directory: /opt/local/var/macports/sources/rsync.macports.org/release/tarballs/ports/x11/xorg-libXt
:debug:main OS darwin/12.0.0 (Mac OS X 10.8) arch i386
:debug:main org.macports.load registered provides 'load', a pre-existing procedure. Target override will not be provided
:debug:main org.macports.unload registered provides 'unload', a pre-existing procedure. Target override will not be provided
:debug:main org.macports.distfiles registered provides 'distfiles', a pre-existing procedure. Target override will not be provided
:debug:main adding the default universal variant
:debug:main Reading variant descriptions from /opt/local/var/macports/sources/rsync.macports.org/release/tarballs/ports/_resources/port1.0/variant_descriptions.conf
:debug:main No need to upgrade! xorg-libXt 1.1.3_0 >= xorg-libXt 1.1.3_0
:debug:main epoch: in tree: 0 installed: 0
:debug:main xorg-libsm 1.2.1_0 exists in the ports tree
:debug:main xorg-libsm 1.2.1_0  is the latest installed
:debug:main xorg-libsm 1.2.1_0  is active
:debug:main Merging existing variants '' into variants
:debug:main new fully merged portvariants: 
:debug:main Changing to port directory: /opt/local/var/macports/sources/rsync.macports.org/release/tarballs/ports/x11/xorg-libsm
:debug:main OS darwin/12.0.0 (Mac OS X 10.8) arch i386
:debug:main org.macports.load registered provides 'load', a pre-existing procedure. Target override will not be provided
:debug:main org.macports.unload registered provides 'unload', a pre-existing procedure. Target override will not be provided
:debug:main org.macports.distfiles registered provides 'distfiles', a pre-existing procedure. Target override will not be provided
:debug:main adding the default universal variant
:debug:main Reading variant descriptions from /opt/local/var/macports/sources/rsync.macports.org/release/tarballs/ports/_resources/port1.0/variant_descriptions.conf
:debug:main No need to upgrade! xorg-libsm 1.2.1_0 >= xorg-libsm 1.2.1_0
:debug:main epoch: in tree: 0 installed: 0
:debug:main xorg-libice 1.0.8_0 exists in the ports tree
:debug:main xorg-libice 1.0.8_0  is the latest installed
:debug:main xorg-libice 1.0.8_0  is active
:debug:main Merging existing variants '' into variants
:debug:main new fully merged portvariants: 
:debug:main Changing to port directory: /opt/local/var/macports/sources/rsync.macports.org/release/tarballs/ports/x11/xorg-libice
:debug:main OS darwin/12.0.0 (Mac OS X 10.8) arch i386
:debug:main org.macports.load registered provides 'load', a pre-existing procedure. Target override will not be provided
:debug:main org.macports.unload registered provides 'unload', a pre-existing procedure. Target override will not be provided
:debug:main org.macports.distfiles registered provides 'distfiles', a pre-existing procedure. Target override will not be provided
:debug:main adding the default universal variant
:debug:main Reading variant descriptions from /opt/local/var/macports/sources/rsync.macports.org/release/tarballs/ports/_resources/port1.0/variant_descriptions.conf
:debug:main No need to upgrade! xorg-libice 1.0.8_0 >= xorg-libice 1.0.8_0
:msg:main --->  Computing dependencies for dsniff:info:main .:debug:main Checking for conflicts against dsniff
:debug:main Searching for dependency: dsniff-devel
:debug:main Didn't find receipt, going to depspec regex for: dsniff-devel
:debug:main Searching for dependency: libnids
:debug:main Found Dependency: receipt exists for libnids
:debug:main Searching for dependency: libpcap
:debug:main Found Dependency: receipt exists for libpcap
:debug:main Searching for dependency: openssl
:debug:main Found Dependency: receipt exists for openssl
:debug:main Searching for dependency: xorg-libXmu
:debug:main Found Dependency: receipt exists for xorg-libXmu
:msg:main 
:debug:main Executing org.macports.main (dsniff)
:debug:main changing euid/egid - current euid: 0 - current egid: 0
:debug:main egid changed to: 501
:debug:main euid changed to: 502
:debug:archivefetch archivefetch phase started at Fri Jul 27 10:35:54 PDT 2012
:msg:archivefetch --->  Fetching archive for dsniff
:debug:archivefetch Executing org.macports.archivefetch (dsniff)
:debug:archivefetch euid/egid changed to: 0/0
:debug:archivefetch chowned /opt/local/var/macports/incoming to macports
:debug:archivefetch euid/egid changed to: 502/501
:info:archivefetch --->  dsniff-2.3_5.darwin_12.x86_64.tbz2 doesn't seem to exist in /opt/local/var/macports/incoming/verified
:msg:archivefetch --->  Attempting to fetch dsniff-2.3_5.darwin_12.x86_64.tbz2 from http://packages.macports.org/dsniff
:debug:archivefetch Fetching archive failed:: The requested URL returned error: 404
:debug:archivefetch Privilege de-escalation not attempted as not running as root.
:debug:fetch fetch phase started at Fri Jul 27 10:35:54 PDT 2012
:notice:fetch --->  Fetching distfiles for dsniff
:debug:fetch Executing org.macports.fetch (dsniff)
:debug:fetch Privilege de-escalation not attempted as not running as root.
:debug:checksum checksum phase started at Fri Jul 27 10:35:54 PDT 2012
:notice:checksum --->  Verifying checksum(s) for dsniff
:debug:checksum Executing org.macports.checksum (dsniff)
:info:checksum --->  Checksumming dsniff-2.3.tar.gz
:debug:checksum Correct (md5) checksum for dsniff-2.3.tar.gz
:debug:checksum Privilege de-escalation not attempted as not running as root.
:debug:extract extract phase started at Fri Jul 27 10:35:54 PDT 2012
:notice:extract --->  Extracting dsniff
:debug:extract Executing org.macports.extract (dsniff)
:info:extract --->  Extracting dsniff-2.3.tar.gz
:debug:extract setting option extract.args to '/opt/local/var/macports/distfiles/dsniff/dsniff-2.3.tar.gz'
:debug:extract Environment: CPATH='/opt/local/include' CC_PRINT_OPTIONS_FILE='/opt/local/var/macports/build/_opt_local_var_macports_sources_rsync.macports.org_release_tarballs_ports_net_dsniff/dsniff/work/.CC_PRINT_OPTIONS' LIBRARY_PATH='/opt/local/lib' CC_PRINT_OPTIONS='YES' MACOSX_DEPLOYMENT_TARGET='10.8'
:debug:extract Assembled command: 'cd "/opt/local/var/macports/build/_opt_local_var_macports_sources_rsync.macports.org_release_tarballs_ports_net_dsniff/dsniff/work" && /usr/bin/gzip -dc '/opt/local/var/macports/distfiles/dsniff/dsniff-2.3.tar.gz' | /usr/bin/gnutar --no-same-owner -xf -'
:debug:extract Executing command line:  cd "/opt/local/var/macports/build/_opt_local_var_macports_sources_rsync.macports.org_release_tarballs_ports_net_dsniff/dsniff/work" && /usr/bin/gzip -dc '/opt/local/var/macports/distfiles/dsniff/dsniff-2.3.tar.gz' | /usr/bin/gnutar --no-same-owner -xf - 
:debug:extract euid/egid changed to: 0/0
:debug:extract chowned /opt/local/var/macports/build/_opt_local_var_macports_sources_rsync.macports.org_release_tarballs_ports_net_dsniff/dsniff/work to macports
:debug:extract euid/egid changed to: 502/501
:debug:extract Privilege de-escalation not attempted as not running as root.
:debug:patch patch phase started at Fri Jul 27 10:35:54 PDT 2012
:debug:patch Executing org.macports.patch (dsniff)
:notice:patch --->  Applying patches to dsniff
:info:patch --->  Applying patch-pcaputil.c
:debug:patch Environment: CPATH='/opt/local/include' CC_PRINT_OPTIONS_FILE='/opt/local/var/macports/build/_opt_local_var_macports_sources_rsync.macports.org_release_tarballs_ports_net_dsniff/dsniff/work/.CC_PRINT_OPTIONS' LIBRARY_PATH='/opt/local/lib' CC_PRINT_OPTIONS='YES' MACOSX_DEPLOYMENT_TARGET='10.8'
:debug:patch Assembled command: 'cd "/opt/local/var/macports/build/_opt_local_var_macports_sources_rsync.macports.org_release_tarballs_ports_net_dsniff/dsniff/work/dsniff-2.3" && /usr/bin/patch -p0'
:debug:patch Executing command line:  cd "/opt/local/var/macports/build/_opt_local_var_macports_sources_rsync.macports.org_release_tarballs_ports_net_dsniff/dsniff/work/dsniff-2.3" && /usr/bin/patch -p0 < '/opt/local/var/macports/sources/rsync.macports.org/release/tarballs/ports/net/dsniff/files/patch-pcaputil.c'
:info:patch patching file pcaputil.c
:info:patch --->  Applying patch-sshcrypto.c
:debug:patch Environment: CPATH='/opt/local/include' CC_PRINT_OPTIONS_FILE='/opt/local/var/macports/build/_opt_local_var_macports_sources_rsync.macports.org_release_tarballs_ports_net_dsniff/dsniff/work/.CC_PRINT_OPTIONS' LIBRARY_PATH='/opt/local/lib' CC_PRINT_OPTIONS='YES' MACOSX_DEPLOYMENT_TARGET='10.8'
:debug:patch Assembled command: 'cd "/opt/local/var/macports/build/_opt_local_var_macports_sources_rsync.macports.org_release_tarballs_ports_net_dsniff/dsniff/work/dsniff-2.3" && /usr/bin/patch -p0'
:debug:patch Executing command line:  cd "/opt/local/var/macports/build/_opt_local_var_macports_sources_rsync.macports.org_release_tarballs_ports_net_dsniff/dsniff/work/dsniff-2.3" && /usr/bin/patch -p0 < '/opt/local/var/macports/sources/rsync.macports.org/release/tarballs/ports/net/dsniff/files/patch-sshcrypto.c'
:info:patch patching file sshcrypto.c
:debug:patch Privilege de-escalation not attempted as not running as root.
:debug:configure configure phase started at Fri Jul 27 10:35:54 PDT 2012
:notice:configure --->  Configuring dsniff
:debug:configure Using compiler 'Mac OS X clang'
:debug:configure Executing org.macports.configure (dsniff)
:debug:configure Environment: CPATH='/opt/local/include' CFLAGS='-pipe -O2 -DBIND_8_COMPAT -arch x86_64' CPPFLAGS='-I/opt/local/include' CXXFLAGS='-pipe -O2 -arch x86_64' LIBRARY_PATH='/opt/local/lib' MACOSX_DEPLOYMENT_TARGET='10.8' CXX='/usr/bin/clang++' CC_PRINT_OPTIONS_FILE='/opt/local/var/macports/build/_opt_local_var_macports_sources_rsync.macports.org_release_tarballs_ports_net_dsniff/dsniff/work/.CC_PRINT_OPTIONS' F90FLAGS='-pipe -O2 -m64' LDFLAGS='-L/opt/local/lib -arch x86_64' OBJC='/usr/bin/clang' FCFLAGS='-pipe -O2 -m64' INSTALL='/usr/bin/install -c' OBJCFLAGS='-pipe -O2 -arch x86_64' FFLAGS='-pipe -O2 -m64' CC_PRINT_OPTIONS='YES' CC='/usr/bin/clang'
:debug:configure Assembled command: 'cd "/opt/local/var/macports/build/_opt_local_var_macports_sources_rsync.macports.org_release_tarballs_ports_net_dsniff/dsniff/work/dsniff-2.3" && ./configure --prefix=/opt/local --mandir=/opt/local/share/man'
:debug:configure Executing command line:  cd "/opt/local/var/macports/build/_opt_local_var_macports_sources_rsync.macports.org_release_tarballs_ports_net_dsniff/dsniff/work/dsniff-2.3" && ./configure --prefix=/opt/local --mandir=/opt/local/share/man 
:info:configure creating cache ./config.cache
:info:configure checking for gcc... /usr/bin/clang
:info:configure checking whether the C compiler (/usr/bin/clang -pipe -O2 -DBIND_8_COMPAT -arch x86_64 -L/opt/local/lib -arch x86_64) works... yes
:info:configure checking whether the C compiler (/usr/bin/clang -pipe -O2 -DBIND_8_COMPAT -arch x86_64 -L/opt/local/lib -arch x86_64) is a cross-compiler... no
:info:configure checking whether we are using GNU C... yes
:info:configure checking whether /usr/bin/clang accepts -g... yes
:info:configure checking for a BSD compatible install... /usr/bin/install -c
:info:configure checking for ranlib... ranlib
:info:configure checking how to run the C preprocessor... /usr/bin/clang -E
:info:configure checking for X... libraries , headers 
:info:configure checking for dnet_ntoa in -ldnet... no
:info:configure checking for dnet_ntoa in -ldnet_stub... no
:info:configure checking for gethostbyname... yes
:info:configure checking for connect... yes
:info:configure checking for remove... yes
:info:configure checking for shmat... yes
:info:configure checking for IceConnectionNumber in -lICE... yes
:info:configure checking for ANSI C header files... yes
:info:configure checking for err.h... yes
:info:configure checking for fcntl.h... yes
:info:configure checking for sys/ioctl.h... yes
:info:configure checking for sys/queue.h... yes
:info:configure checking for unistd.h... yes
:info:configure checking for libgen.h... yes
:info:configure checking for net/if_tun.h... no
:info:configure checking for MIN and MAX in sys/param.h... yes
:info:configure checking for working const... yes
:info:configure checking for size_t... yes
:info:configure checking whether struct tm is in sys/time.h or time.h... time.h
:info:configure checking for u_int32_t... yes
:info:configure checking for u_int64_t... yes
:info:configure checking for in_addr_t... yes
:info:configure checking whether /usr/bin/clang needs -traditional... no
:info:configure checking for 8-bit clean memcmp... yes
:info:configure checking return type of signal handlers... void
:info:configure checking for strftime... yes
:info:configure checking for gethostname... yes
:info:configure checking for socket... yes
:info:configure checking for strdup... yes
:info:configure checking for strstr... yes
:info:configure checking for xdr_fhstatus in -lrpcsvc... no
:info:configure checking for socket in -lsocket... no
:info:configure checking for gethostbyname in -lnsl... no
:info:configure checking for dn_expand in -lresolv... yes
:info:configure checking for dirname... yes
:info:configure checking for strlcpy... yes
:info:configure checking for strlcat... yes
:info:configure checking for strsep... yes
:info:configure checking for MD5Update... no
:info:configure checking for warnx... yes
:info:configure checking for ether_ntoa... yes
:info:configure checking for Berkeley DB with 1.85 compatibility... yes
:info:configure checking for libpcap... yes
:info:configure checking for libnet... yes
:info:configure checking for libnids... yes
:info:configure checking whether libnids version is good... yes
:info:configure checking for OpenSSL... yes
:info:configure updating cache ./config.cache
:info:configure creating ./config.status
:info:configure creating Makefile
:info:configure creating config.h
:debug:configure Privilege de-escalation not attempted as not running as root.
:debug:build build phase started at Fri Jul 27 10:35:57 PDT 2012
:notice:build --->  Building dsniff
:debug:build Executing org.macports.build (dsniff)
:debug:build Environment: CPATH='/opt/local/include' CC_PRINT_OPTIONS_FILE='/opt/local/var/macports/build/_opt_local_var_macports_sources_rsync.macports.org_release_tarballs_ports_net_dsniff/dsniff/work/.CC_PRINT_OPTIONS' LIBRARY_PATH='/opt/local/lib' CC_PRINT_OPTIONS='YES' MACOSX_DEPLOYMENT_TARGET='10.8'
:debug:build Assembled command: 'cd "/opt/local/var/macports/build/_opt_local_var_macports_sources_rsync.macports.org_release_tarballs_ports_net_dsniff/dsniff/work/dsniff-2.3" && /usr/bin/make -j4 -w all'
:debug:build Executing command line:  cd "/opt/local/var/macports/build/_opt_local_var_macports_sources_rsync.macports.org_release_tarballs_ports_net_dsniff/dsniff/work/dsniff-2.3" && /usr/bin/make -j4 -w all 
:info:build make: Entering directory `/opt/local/var/macports/build/_opt_local_var_macports_sources_rsync.macports.org_release_tarballs_ports_net_dsniff/dsniff/work/dsniff-2.3'
:info:build /usr/bin/clang -pipe -O2 -DBIND_8_COMPAT -arch x86_64 -D_BSD_SOURCE -DHAVE_SOCKADDR_SA_LEN -DLIBNET_BSDISH_OS -DLIBNET_BSD_BYTE_SWAP -DDSNIFF_LIBDIR=\"/opt/local/lib/\" -I. -I/opt/local/include -I/opt/local/include -I/opt/local/include  -I/opt/local/include  -I./missing -c ./missing/dummy.c
:info:build /usr/bin/clang -pipe -O2 -DBIND_8_COMPAT -arch x86_64 -D_BSD_SOURCE -DHAVE_SOCKADDR_SA_LEN -DLIBNET_BSDISH_OS -DLIBNET_BSD_BYTE_SWAP -DDSNIFF_LIBDIR=\"/opt/local/lib/\" -I. -I/opt/local/include -I/opt/local/include -I/opt/local/include  -I/opt/local/include  -I./missing -c ./missing/md5.c
:info:build /usr/bin/clang -pipe -O2 -DBIND_8_COMPAT -arch x86_64 -D_BSD_SOURCE -DHAVE_SOCKADDR_SA_LEN -DLIBNET_BSDISH_OS -DLIBNET_BSD_BYTE_SWAP -DDSNIFF_LIBDIR=\"/opt/local/lib/\" -I. -I/opt/local/include -I/opt/local/include -I/opt/local/include  -I/opt/local/include  -I./missing -c ./arpspoof.c
:info:build /usr/bin/clang -pipe -O2 -DBIND_8_COMPAT -arch x86_64 -D_BSD_SOURCE -DHAVE_SOCKADDR_SA_LEN -DLIBNET_BSDISH_OS -DLIBNET_BSD_BYTE_SWAP -DDSNIFF_LIBDIR=\"/opt/local/lib/\" -I. -I/opt/local/include -I/opt/local/include -I/opt/local/include  -I/opt/local/include  -I./missing -c ./arp.c
:info:build /usr/bin/clang -pipe -O2 -DBIND_8_COMPAT -arch x86_64 -D_BSD_SOURCE -DHAVE_SOCKADDR_SA_LEN -DLIBNET_BSDISH_OS -DLIBNET_BSD_BYTE_SWAP -DDSNIFF_LIBDIR=\"/opt/local/lib/\" -I. -I/opt/local/include -I/opt/local/include -I/opt/local/include  -I/opt/local/include  -I./missing -c ./dnsspoof.c
:info:build ./missing/md5.c:151:27: warning: argument to 'sizeof' in '__builtin___memset_chk' call is the same expression as the destination; did you mean to dereference it? [-Wsizeof-pointer-memaccess]
:info:build     memset(ctx, 0, sizeof(ctx));        /* In case it's sensitive */
:info:build     ~~~~~~~~~~~~~~~~~~~~~~^~~~~
:info:build /usr/include/secure/_string.h:77:41: note: expanded from macro 'memset'
:info:build    ? __builtin___memset_chk (dest, val, len, __darwin_obsz0 (dest))     \
:info:build                                         ^
:info:build ./arp.c:74:4: warning: implicitly declaring library function 'memcpy' with type 'void *(void *, const void *, unsigned long)'
:info:build                         memcpy(ether->ether_addr_octet, LLADDR(sdl),
:info:build                         ^
:info:build ./arp.c:74:4: note: please include the header <string.h> or explicitly provide a declaration for 'memcpy'
:info:build ./arpspoof.c:25:32: warning: declaration of 'struct ether_addr' will not be visible outside of this function [-Wvisibility]
:info:build extern char *ether_ntoa(struct ether_addr *);
:info:build                                ^
:info:build ./arpspoof.c:26:47: warning: declaration of 'struct ether_addr' will not be visible outside of this function [-Wvisibility]
:info:build extern int arp_cache_lookup(in_addr_t, struct ether_addr *);
:info:build                                               ^
:info:build ./arpspoof.c:29:26: warning: tentative definition of variable with internal linkage has incomplete non-array type 'struct ether_addr' [-Wtentative-definition-incomplete-type]
:info:build static struct ether_addr spoof_mac, target_mac;
:info:build                          ^
:info:build ./arpspoof.c:29:15: note: forward declaration of 'struct ether_addr'
:info:build static struct ether_addr spoof_mac, target_mac;
:info:build               ^
:info:build ./arpspoof.c:29:37: warning: tentative definition of variable with internal linkage has incomplete non-array type 'struct ether_addr' [-Wtentative-definition-incomplete-type]
:info:build static struct ether_addr spoof_mac, target_mac;
:info:build                                     ^
:info:build ./arpspoof.c:29:15: note: forward declaration of 'struct ether_addr'
:info:build static struct ether_addr spoof_mac, target_mac;
:info:build               ^
:info:build ./arpspoof.c:49:47: error: too many arguments to function call, expected 1, have 3
:info:build             (sha = (u_char *)libnet_get_hwaddr(llif, dev, ebuf)) == NULL) {
:info:build                              ~~~~~~~~~~~~~~~~~       ^~~~~~~~~
:info:build /opt/local/include/./libnet/libnet-functions.h:1906:1: note: 'libnet_get_hwaddr' declared here
:info:build struct libnet_ether_addr *
:info:build ^
:info:build ./arpspoof.c:53:14: warning: implicit declaration of function 'libnet_get_ipaddr' is invalid in C99 [-Wimplicit-function-declaration]
:info:build                 if ((spa = libnet_get_ipaddr(llif, dev, ebuf)) == 0)
:info:build                            ^
:info:build ./arpspoof.c:58:7: warning: assigning to 'u_char *' (aka 'unsigned char *') from 'char [7]' converts between pointers to integer types with different sign [-Wpointer-sign]
:info:build                 tha = "\xff\xff\xff\xff\xff\xff";
:info:build                     ^ ~~~~~~~~~~~~~~~~~~~~~~~~~~
:info:build ./arpspoof.c:60:61: error: too few arguments to function call, expected 7, have 6
:info:build         libnet_build_ethernet(tha, sha, ETHERTYPE_ARP, NULL, 0, pkt);
:info:build         ~~~~~~~~~~~~~~~~~~~~~                                      ^
:info:build /opt/local/include/./libnet/libnet-functions.h:497:1: note: 'libnet_build_ethernet' declared here
:info:build libnet_ptag_t
:info:build ^
:info:build ./arpspoof.c:64:20: error: use of undeclared identifier 'ETH_H'
:info:build                          NULL, 0, pkt + ETH_H);
:info:build                                         ^
:info:build ./arpspoof.c:67:14: warning: incompatible pointer types passing 'struct ether_addr *' to parameter of type 'struct ether_addr *' [-Wincompatible-pointer-types]
:info:build                 ether_ntoa((struct ether_addr *)sha));
:info:build                            ^~~~~~~~~~~~~~~~~~~~~~~~
:info:build ./arpspoof.c:25:44: note: passing argument to parameter here
:info:build extern char *ether_ntoa(struct ether_addr *);
:info:build                                            ^
:info:build ./arpspoof.c:71:15: warning: incompatible pointer types passing 'struct ether_addr *' to parameter of type 'struct ether_addr *' [-Wincompatible-pointer-types]
:info:build                         ether_ntoa((struct ether_addr *)tha),
:info:build                                    ^~~~~~~~~~~~~~~~~~~~~~~~
:info:build ./arpspoof.c:25:44: note: passing argument to parameter here
:info:build extern char *ether_ntoa(struct ether_addr *);
:info:build                                            ^
:info:build ./arpspoof.c:72:4: warning: implicit declaration of function 'libnet_host_lookup' is invalid in C99 [-Wimplicit-function-declaration]
:info:build                         libnet_host_lookup(tpa, 0),
:info:build                         ^
:info:build ./arpspoof.c:70:45: warning: format specifies type 'char *' but the argument has type 'int' [-Wformat]
:info:build                 fprintf(stderr, "%s 0806 42: arp who-has %s tell %s\n",
:info:build                                                          ~^
:info:build                                                          %d
:info:build ./arpspoof.c:70:53: warning: format specifies type 'char *' but the argument has type 'int' [-Wformat]
:info:build                 fprintf(stderr, "%s 0806 42: arp who-has %s tell %s\n",
:info:build                                                                  ~^
:info:build                                                                  %d
:info:build ./arpspoof.c:77:15: warning: incompatible pointer types passing 'struct ether_addr *' to parameter of type 'struct ether_addr *' [-Wincompatible-pointer-types]
:info:build                         ether_ntoa((struct ether_addr *)tha),
:info:build                                    ^~~~~~~~~~~~~~~~~~~~~~~~
:info:build ./arpspoof.c:25:44: note: passing argument to parameter here
:info:build extern char *ether_ntoa(struct ether_addr *);
:info:build                                            ^
:info:build 1 warning generated.
:info:build ./arpspoof.c:76:43: warning: format specifies type 'char *' but the argument has type 'int' [-Wformat]
:info:build                 fprintf(stderr, "%s 0806 42: arp reply %s is-at ",
:info:build                                                        ~^
:info:build                                                        %d
:info:build ./arpspoof.c:80:15: warning: incompatible pointer types passing 'struct ether_addr *' to parameter of type 'struct ether_addr *' [-Wincompatible-pointer-types]
:info:build                         ether_ntoa((struct ether_addr *)sha));
:info:build                                    ^~~~~~~~~~~~~~~~~~~~~~~~
:info:build ./arpspoof.c:25:44: note: passing argument to parameter here
:info:build extern char *ether_ntoa(struct ether_addr *);
:info:build                                            ^
:info:build ./arpspoof.c:82:10: warning: implicit declaration of function 'libnet_write_link_layer' is invalid in C99 [-Wimplicit-function-declaration]
:info:build         return (libnet_write_link_layer(llif, dev, pkt, sizeof(pkt)) == sizeof(pkt));
:info:build                 ^
:info:build ./arpspoof.c:114:28: warning: incompatible pointer types passing 'struct ether_addr *' to parameter of type 'struct ether_addr *' [-Wincompatible-pointer-types]
:info:build                 if (arp_cache_lookup(ip, mac) == 0)
:info:build                                          ^~~
:info:build /usr/bin/clang -pipe -O2 -DBIND_8_COMPAT -arch x86_64 -D_BSD_SOURCE -DHAVE_SOCKADDR_SA_LEN -DLIBNET_BSDISH_OS -DLIBNET_BSD_BYTE_SWAP -DDSNIFF_LIBDIR=\"/opt/local/lib/\" -I. -I/opt/local/include -I/opt/local/include -I/opt/local/include  -I/opt/local/include  -I./missing -c ./pcaputil.c
:info:build ./arpspoof.c:26:59: note: passing argument to parameter here
:info:build extern int arp_cache_lookup(in_addr_t, struct ether_addr *);
:info:build                                                           ^
:info:build ./arpspoof.c:162:21: warning: implicit declaration of function 'libnet_name_resolve' is invalid in C99 [-Wimplicit-function-declaration]
:info:build                         if ((target_ip = libnet_name_resolve(optarg, 1)) == -1)
:info:build                                          ^
:info:build ./arpspoof.c:181:14: warning: implicit declaration of function 'libnet_open_link_interface' is invalid in C99 [-Wimplicit-function-declaration]
:info:build         if ((llif = libnet_open_link_interface(intf, ebuf)) == 0)
:info:build                     ^
:info:build ./arpspoof.c:181:12: warning: incompatible integer to pointer conversion assigning to 'struct libnet_link_int *' from 'int'; 
:info:build         if ((llif = libnet_open_link_interface(intf, ebuf)) == 0)
:info:build                   ^ ~~~~~~~~~~~~~~~~~~~~~~~~~~~~~~~~~~~~~~
:info:build ./arpspoof.c:29:26: error: tentative definition has type 'struct ether_addr' that is never completed
:info:build static struct ether_addr spoof_mac, target_mac;
:info:build                          ^
:info:build ./arpspoof.c:29:15: note: forward declaration of 'struct ether_addr'
:info:build static struct ether_addr spoof_mac, target_mac;
:info:build               ^
:info:build ./arpspoof.c:29:37: error: tentative definition has type 'struct ether_addr' that is never completed
:info:build static struct ether_addr spoof_mac, target_mac;
:info:build                                     ^
:info:build ./arpspoof.c:29:15: note: forward declaration of 'struct ether_addr'
:info:build static struct ether_addr spoof_mac, target_mac;
:info:build               ^
:info:build 19 warnings and 5 errors generated.
:info:build make: *** [arpspoof.o] Error 1
:info:build make: *** Waiting for unfinished jobs....
:info:build ./dnsspoof.c:95:14: warning: implicit declaration of function 'libnet_open_link_interface' is invalid in C99 [-Wimplicit-function-declaration]
:info:build         if ((llif = libnet_open_link_interface(dev, buf)) == NULL)
:info:build                     ^
:info:build ./dnsspoof.c:95:12: warning: incompatible integer to pointer conversion assigning to 'struct libnet_link_int *' from 'int'; 
:info:build         if ((llif = libnet_open_link_interface(dev, buf)) == NULL)
:info:build                   ^ ~~~~~~~~~~~~~~~~~~~~~~~~~~~~~~~~~~~~
:info:build ./dnsspoof.c:98:17: warning: implicit declaration of function 'libnet_get_ipaddr' is invalid in C99 [-Wimplicit-function-declaration]
:info:build         if ((lnet_ip = libnet_get_ipaddr(llif, dev, buf)) == -1)
:info:build                        ^
:info:build ./dnsspoof.c:103:2: warning: implicit declaration of function 'libnet_close_link_interface' is invalid in C99 [-Wimplicit-function-declaration]
:info:build         libnet_close_link_interface(llif);
:info:build         ^
:info:build ./dnsspoof.c:191:54: error: incomplete definition of type 'struct libnet_ip_hdr'
:info:build         udp = (struct libnet_udp_hdr *)(pkt + pcap_off + (ip->ip_hl * 4));
:info:build                                                           ~~^
:info:build ./dnsspoof.c:181:9: note: forward declaration of 'struct libnet_ip_hdr'
:info:build         struct libnet_ip_hdr *ip;
:info:build                ^
:info:build ./dnsspoof.c:213:12: error: use of undeclared identifier 'IP_H'
:info:build         p = buf + IP_H + UDP_H + dnslen;
:info:build                   ^
:info:build ./dnsspoof.c:213:19: error: use of undeclared identifier 'UDP_H'
:info:build         p = buf + IP_H + UDP_H + dnslen;
:info:build                          ^
:info:build ./dnsspoof.c:225:10: warning: assigning to 'u_char *' (aka 'unsigned char *') from 'char *' converts between pointers to integer types with different sign [-Wpointer-sign]
:info:build                 if ((q = dns_lookup_ptr(name)) == NULL)
:info:build                        ^ ~~~~~~~~~~~~~~~~~~~~
:info:build ./dnsspoof.c:229:20: warning: passing 'u_char *' (aka 'unsigned char *') to parameter of type 'const char *' converts between pointers to integer types with different sign [-Wpointer-sign]
:info:build                 anslen = dn_comp(q, p + 12, 256, NULL, NULL);
:info:build                                  ^
:info:build /usr/include/resolv.h:452:31: note: passing argument to parameter here
:info:build int             dn_comp __P((const char *, u_char *, int, u_char **, u_char **));
:info:build                                          ^
:info:build /usr/include/sys/cdefs.h:92:21: note: expanded from macro '__P'
:info:build #define __P(protos)     protos          /* full-blown ANSI C */
:info:build                         ^
:info:build ./dnsspoof.c:236:2: warning: implicit declaration of function 'libnet_build_ip' is invalid in C99 [-Wimplicit-function-declaration]
:info:build         libnet_build_ip(UDP_H + dnslen + anslen, 0, libnet_get_prand(PRu16),
:info:build         ^
:info:build ./dnsspoof.c:236:18: error: use of undeclared identifier 'UDP_H'
:info:build         libnet_build_ip(UDP_H + dnslen + anslen, 0, libnet_get_prand(PRu16),
:info:build                         ^
:info:build ./dnsspoof.c:241:34: error: use of undeclared identifier 'IP_H'
:info:build                          NULL, dnslen + anslen, buf + IP_H);
:info:build                                                       ^
:info:build ./dnsspoof.c:243:15: error: use of undeclared identifier 'IP_H'
:info:build         memcpy(buf + IP_H + UDP_H, (u_char *)dns, dnslen);
:info:build                      ^
:info:build /usr/include/secure/_string.h:54:21: note: expanded from macro 'memcpy'
:info:build   ((__darwin_obsz0 (dest) != (size_t) -1)                               \
:info:build                     ^
:info:build /usr/include/secure/_common.h:38:55: note: expanded from macro '__darwin_obsz0'
:info:build #define __darwin_obsz0(object) __builtin_object_size (object, 0)
:info:build                                                       ^
:info:build ./dnsspoof.c:243:22: error: use of undeclared identifier 'UDP_H'
:info:build         memcpy(buf + IP_H + UDP_H, (u_char *)dns, dnslen);
:info:build                             ^
:info:build /usr/include/secure/_string.h:54:21: note: expanded from macro 'memcpy'
:info:build   ((__darwin_obsz0 (dest) != (size_t) -1)                               \
:info:build                     ^
:info:build /usr/include/secure/_common.h:38:55: note: expanded from macro '__darwin_obsz0'
:info:build #define __darwin_obsz0(object) __builtin_object_size (object, 0)
:info:build                                                       ^
:info:build ./dnsspoof.c:243:15: error: use of undeclared identifier 'IP_H'
:info:build         memcpy(buf + IP_H + UDP_H, (u_char *)dns, dnslen);
:info:build                      ^
:info:build /usr/include/secure/_string.h:55:30: note: expanded from macro 'memcpy'
:info:build    ? __builtin___memcpy_chk (dest, src, len, __darwin_obsz0 (dest))     \
:info:build                              ^
:info:build ./dnsspoof.c:243:22: error: use of undeclared identifier 'UDP_H'
:info:build         memcpy(buf + IP_H + UDP_H, (u_char *)dns, dnslen);
:info:build                             ^
:info:build /usr/include/secure/_string.h:55:30: note: expanded from macro 'memcpy'
:info:build    ? __builtin___memcpy_chk (dest, src, len, __darwin_obsz0 (dest))     \
:info:build                              ^
:info:build ./dnsspoof.c:243:15: error: use of undeclared identifier 'IP_H'
:info:build         memcpy(buf + IP_H + UDP_H, (u_char *)dns, dnslen);
:info:build                      ^
:info:build /usr/include/secure/_string.h:56:27: note: expanded from macro 'memcpy'
:info:build    : __inline_memcpy_chk (dest, src, len))
:info:build                           ^
:info:build ./dnsspoof.c:243:22: error: use of undeclared identifier 'UDP_H'
:info:build         memcpy(buf + IP_H + UDP_H, (u_char *)dns, dnslen);
:info:build                             ^
:info:build /usr/include/secure/_string.h:56:27: note: expanded from macro 'memcpy'
:info:build    : __inline_memcpy_chk (dest, src, len))
:info:build                           ^
:info:build ./dnsspoof.c:245:25: error: use of undeclared identifier 'IP_H'
:info:build         dns = (HEADER *)(buf + IP_H + UDP_H);
:info:build                                ^
:info:build ./dnsspoof.c:245:32: error: use of undeclared identifier 'UDP_H'
:info:build         dns = (HEADER *)(buf + IP_H + UDP_H);
:info:build                                       ^
:info:build ./dnsspoof.c:252:39: error: use of undeclared identifier 'UDP_H'
:info:build         libnet_do_checksum(buf, IPPROTO_UDP, UDP_H + dnslen);
:info:build                                              ^
:info:build ./dnsspoof.c:254:6: warning: implicit declaration of function 'libnet_write_ip' is invalid in C99 [-Wimplicit-function-declaration]
:info:build         if (libnet_write_ip(lnet_sock, buf, IP_H + UDP_H + dnslen) < 0)
:info:build             ^
:info:build ./dnsspoof.c:254:38: error: use of undeclared identifier 'IP_H'
:info:build         if (libnet_write_ip(lnet_sock, buf, IP_H + UDP_H + dnslen) < 0)
:info:build                                             ^
:info:build ./dnsspoof.c:254:45: error: use of undeclared identifier 'UDP_H'
:info:build         if (libnet_write_ip(lnet_sock, buf, IP_H + UDP_H + dnslen) < 0)
:info:build                                                    ^
:info:build ./dnsspoof.c:258:8: warning: implicit declaration of function 'libnet_host_lookup' is invalid in C99 [-Wimplicit-function-declaration]
:info:build               libnet_host_lookup(ip->ip_src.s_addr, 0), ntohs(udp->uh_sport),
:info:build               ^
:info:build ./dnsspoof.c:258:29: error: incomplete definition of type 'struct libnet_ip_hdr'
:info:build               libnet_host_lookup(ip->ip_src.s_addr, 0), ntohs(udp->uh_sport),
:info:build                                  ~~^
:info:build ./dnsspoof.c:181:9: note: forward declaration of 'struct libnet_ip_hdr'
:info:build         struct libnet_ip_hdr *ip;
:info:build                ^
:info:build ./dnsspoof.c:266:2: warning: implicit declaration of function 'libnet_close_raw_sock' is invalid in C99 [-Wimplicit-function-declaration]
:info:build         libnet_close_raw_sock(lnet_sock);
:info:build         ^
:info:build ./dnsspoof.c:304:64: warning: format specifies type 'char *' but the argument has type 'int' [-Wformat]
:info:build         else snprintf(buf, sizeof(buf), "udp dst port 53 and not src %s",
:info:build              ~~~~~~~~~~~~~~~~~~~~~~~~~~~~~~~~~~~~~~~~~~~~~~~~~~~~~~~~~^~~
:info:build                                                                      %d
:info:build /usr/include/secure/_stdio.h:56:62: note: expanded from macro 'snprintf'
:info:build   __builtin___snprintf_chk (str, len, 0, __darwin_obsz(str), __VA_ARGS__)
:info:build                                                              ^
:info:build ./dnsspoof.c:313:19: warning: implicit declaration of function 'libnet_open_raw_sock' is invalid in C99 [-Wimplicit-function-declaration]
:info:build         if ((lnet_sock = libnet_open_raw_sock(IPPROTO_RAW)) == -1)
:info:build                          ^
:info:build ./dnsspoof.c:316:20: error: too few arguments to function call, expected 1, have 0
:info:build         libnet_seed_prand();
:info:build         ~~~~~~~~~~~~~~~~~ ^
:info:build /opt/local/include/./libnet/libnet-functions.h:155:1: note: 'libnet_seed_prand' declared here
:info:build int
:info:build ^
:info:build 12 warnings and 18 errors generated.
:info:build make: *** [dnsspoof.o] Error 1
:info:build 1 warning generated.
:info:build make: Leaving directory `/opt/local/var/macports/build/_opt_local_var_macports_sources_rsync.macports.org_release_tarballs_ports_net_dsniff/dsniff/work/dsniff-2.3'
:info:build Command failed:  cd "/opt/local/var/macports/build/_opt_local_var_macports_sources_rsync.macports.org_release_tarballs_ports_net_dsniff/dsniff/work/dsniff-2.3" && /usr/bin/make -j4 -w all 
:info:build Exit code: 2
:error:build org.macports.build for port dsniff returned: command execution failed
:debug:build Error code: CHILDSTATUS 15834 2
:debug:build Backtrace: command execution failed
    while executing
"system -nice 0 $fullcmdstring"
    ("eval" body line 1)
    invoked from within
"eval system $notty $nice \$fullcmdstring"
    invoked from within
"command_exec build"
    (procedure "portbuild::build_main" line 8)
    invoked from within
"$procedure $targetname"
:info:build Warning: targets not executed for dsniff: org.macports.activate org.macports.build org.macports.destroot org.macports.install
:notice:build Please see the log file for port dsniff for details:
    /opt/local/var/macports/logs/_opt_local_var_macports_sources_rsync.macports.org_release_tarballs_ports_net_dsniff/dsniff/main.log

Change History (3)

comment:1 Changed 9 years ago by ryandesign (Ryan Schmidt)

Description: modified (diff)
Port: dsniff added
Summary: installing dnsiff failedinstalling dsniff failed

Has duplicate #35367.

comment:2 Changed 9 years ago by ryandesign (Ryan Schmidt)

Resolution: duplicate
Status: newclosed

Duplicate of #23971. Try dsniff-devel instead.

comment:3 Changed 9 years ago by ryandesign (Ryan Schmidt)

Milestone: MacPorts Future
Note: See TracTickets for help on using tickets.