Opened 8 weeks ago

Last modified 7 weeks ago

#55128 new defect

boost @1.59.0_3+no_single+no_static+python27 Error: Failed to deactivate boost: error deleting "/opt/local/include/boost/fusion/sequence/comparison/enable_comparison.hpp": permission denied

Reported by: diegodefuentes Owned by:
Priority: Normal Milestone:
Component: ports Version: 2.4.2
Keywords: highsierra Cc: ryandesign (Ryan Schmidt), michaelld (Michael Dickens)
Port: boost

Description (last modified by mf2k (Frank Schima))

sudo port upgrade outdated
--->  Fetching archive for boost
--->  Computing dependencies for boost
--->  Deactivating boost @1.59.0_3+no_single+no_static+python27
Error: Failed to deactivate boost: error deleting "/opt/local/include/boost/fusion/sequence/comparison/enable_comparison.hpp": permission denied
Error: See /opt/local/var/macports/logs/_opt_local_var_macports_registry_portfiles_boost-1.59.0_3_e2fed3bafe8564f3ac3441dd40f91c9aa32d5dd8162b8649684a59b52f058aa0-12750/boost/main.log for details.
Warning: Failed to execute portfile from registry for boost @1.59.0_3+no_single+no_static+python27
--->  Deactivating boost @1.59.0_3+no_single+no_static+python27
Error: Failed to uninstall boost: error deleting "/opt/local/include/boost/fusion/sequence/comparison/enable_comparison.hpp": permission denied
Error: See /opt/local/var/macports/logs/_opt_local_var_macports_registry_portfiles_boost-1.59.0_3_e2fed3bafe8564f3ac3441dd40f91c9aa32d5dd8162b8649684a59b52f058aa0-12750/boost/main.log for details.
Warning: Failed to execute portfile from registry for boost @1.59.0_3+no_single+no_static+python27
--->  Deactivating boost @1.59.0_3+no_single+no_static+python27
Error: Failed to deactivate boost: error deleting "/opt/local/include/boost/fusion/sequence/comparison/enable_comparison.hpp": permission denied
Error: See /opt/local/var/macports/logs/_opt_local_var_macports_registry_portfiles_boost-1.59.0_3_e2fed3bafe8564f3ac3441dd40f91c9aa32d5dd8162b8649684a59b52f058aa0-12750/boost/main.log for details.
Warning: Failed to execute portfile from registry for boost @1.59.0_3+no_single+no_static+python27
--->  Deactivating boost @1.59.0_3+no_single+no_static+python27
Error: Uninstall boost 1.59.0_3+no_single+no_static+python27 failed: error deleting "/opt/local/include/boost/fusion/sequence/comparison/enable_comparison.hpp": permission denied
Error: Follow https://guide.macports.org/#project.tickets to report a bug.

Attachments (1)

main.log.7z (339.9 KB) - added by diegodefuentes 7 weeks ago.
Requested log

Download all attachments as: .zip

Change History (4)

comment:1 Changed 8 weeks ago by mf2k (Frank Schima)

  • Description modified (diff)

comment:2 Changed 8 weeks ago by ryandesign (Ryan Schmidt)

I don't understand this. Can you attach the mentioned main.log file, please?

Changed 7 weeks ago by diegodefuentes

Requested log

comment:3 Changed 7 weeks ago by diegodefuentes

Requested log attached, thanks for looking into this

Note: See TracTickets for help on using tickets.