Opened 8 weeks ago

Closed 3 weeks ago

#66398 closed defect (fixed)

libgcc11 installation error (when installing gcc11) on Ventura 13.0.1

Reported by: imos-99 Owned by: kencu (Ken)
Priority: Normal Milestone:
Component: ports Version:
Keywords: ventura Cc:
Port: libgcc11

Description (last modified by jmroot (Joshua Root))

Intel 64 bit processor Mac Pro, Ventura 13.0.1, Xcode 14.5

Encountered error (copied from main.log):

Library/Developer/CommandLineTools/SDKs/MacOSX13.sdk -B./ _muldi3_s.o _negdi2_s.o _lshrdi3_s.o _ashldi3_s.o _ashrdi3_s.o _cmpdi2_s.o _ucmpdi2_s.o _clear_cache_s.o _trampoline_s.o __main_s.o _absvsi2_s.o _absvdi2_s.o _addvsi3_s.o _addvdi3_s.o _subvsi3_s.o _subvdi3_s.o _mulvsi3_s.o _mulvdi3_s.o _negvsi2_s.o _negvdi2_s.o _ctors_s.o _ffssi2_s.o _ffsdi2_s.o _clz_s.o _clzsi2_s.o _clzdi2_s.o _ctzsi2_s.o _ctzdi2_s.o _popcount_tab_s.o _popcountsi2_s.o _popcountdi2_s.o _paritysi2_s.o _paritydi2_s.o _powisf2_s.o _powidf2_s.o _powixf2_s.o _powitf2_s.o _mulhc3_s.o _mulsc3_s.o _muldc3_s.o _mulxc3_s.o _multc3_s.o _divhc3_s.o _divsc3_s.o _divdc3_s.o _divxc3_s.o _divtc3_s.o _bswapsi2_s.o _bswapdi2_s.o _clrsbsi2_s.o _clrsbdi2_s.o _fixunssfsi_s.o _fixunsdfsi_s.o _fixunsxfsi_s.o _fixsfdi_s.o _fixdfdi_s.o _fixxfdi_s.o _fixunssfdi_s.o _fixunsdfdi_s.o _fixunsxfdi_s.o _floatdisf_s.o _floatdidf_s.o _floatdixf_s.o _floatundisf_s.o _floatundidf_s.o _floatundixf_s.o _fixsfti_s.o _fixdfti_s.o _fixxfti_s.o _fixtfti_s.o _fixunssfti_s.o _fixunsdfti_s.o _fixunsxfti_s.o _fixunstfti_s.o _floattisf_s.o _floattidf_s.o _floattixf_s.o _floattitf_s.o _floatuntisf_s.o _floatuntidf_s.o _floatuntixf_s.o _floatuntitf_s.o _divdi3_s.o _moddi3_s.o _divmoddi4_s.o _udivdi3_s.o _umoddi3_s.o _udivmoddi4_s.o _udiv_w_sdiv_s.o darwin-64_s.o heap-trampoline_s.o cpuinfo_s.o sfp-exceptions_s.o addtf3_s.o divtf3_s.o eqtf2_s.o getf2_s.o letf2_s.o multf3_s.o negtf2_s.o subtf3_s.o unordtf2_s.o fixtfsi_s.o fixunstfsi_s.o floatsitf_s.o floatunsitf_s.o fixtfdi_s.o fixunstfdi_s.o floatditf_s.o floatunditf_s.o fixtfti_s.o fixunstfti_s.o floattitf_s.o floatuntitf_s.o extendsftf2_s.o extenddftf2_s.o extendxftf2_s.o trunctfsf2_s.o trunctfdf2_s.o trunctfxf2_s.o enable-execute-stack_s.o emutls_s.o libgcc.a -lSystem
:info:build MLIBS=`/opt/local/var/macports/build/_opt_local_var_macports_sources_rsync.macports.org_macports_release_tarballs_ports_lang_gcc11/libgcc11/work/build/./gcc/xgcc -B/opt/local/var/macports/build/_opt_local_var_macports_sources_rsync.macports.org_macports_release_tarballs_ports_lang_gcc11/libgcc11/work/build/./gcc/ -B/opt/local/x86_64-apple-darwin22/bin/ -B/opt/local/x86_64-apple-darwin22/lib/ -isystem /opt/local/x86_64-apple-darwin22/include -isystem /opt/local/x86_64-apple-darwin22/sys-include   -fno-checking --print-multi-lib | sed -e 's/;.*$//'` ; \
:info:build 	for mlib in $MLIBS ; do \
:info:build 	  cp ../${mlib}/libgcc/${mlib}/libgcc_s.dylib  \
:info:build 	    ./libgcc_s.1.1.dylib_T_${mlib} || exit 1 ; \
:info:build 	done
:info:build xgcc: warning: could not understand version '13.0'
:info:build lipo -output libgcc_s.1.1.dylib \
:info:build 	  -create libgcc_s.1.1.dylib_T*
:info:build rm libgcc_s.1.1.dylib_T*
:info:build MLIBS=`/opt/local/var/macports/build/_opt_local_var_macports_sources_rsync.macports.org_macports_release_tarballs_ports_lang_gcc11/libgcc11/work/build/./gcc/xgcc -B/opt/local/var/macports/build/_opt_local_var_macports_sources_rsync.macports.org_macports_release_tarballs_ports_lang_gcc11/libgcc11/work/build/./gcc/ -B/opt/local/x86_64-apple-darwin22/bin/ -B/opt/local/x86_64-apple-darwin22/lib/ -isystem /opt/local/x86_64-apple-darwin22/include -isystem /opt/local/x86_64-apple-darwin22/sys-include   -fno-checking --print-multi-lib | sed -e 's/;.*$//'` ; \
:info:build 	for mlib in $MLIBS ; do \
:info:build 	  cp ../${mlib}/libgcc/${mlib}/libgcc_s.dylib  \
:info:build 	    ./libgcc_s.1.1.dylib_T_${mlib} || exit 1 ; \
:info:build 	  arch=`lipo -info libgcc_s.1.1.dylib_T_${mlib} | sed -e 's/.*:\ //'` ; \
:info:build 	  /opt/local/var/macports/build/_opt_local_var_macports_sources_rsync.macports.org_macports_release_tarballs_ports_lang_gcc11/libgcc11/work/build/./gcc/xgcc -B/opt/local/var/macports/build/_opt_local_var_macports_sources_rsync.macports.org_macports_release_tarballs_ports_lang_gcc11/libgcc11/work/build/./gcc/ -B/opt/local/x86_64-apple-darwin22/bin/ -B/opt/local/x86_64-apple-darwin22/lib/ -isystem /opt/local/x86_64-apple-darwin22/include -isystem /opt/local/x86_64-apple-darwin22/sys-include   -fno-checking -arch ${arch} -nodefaultlibs -dynamiclib -nodefaultrpaths \
:info:build 	    -o libgcc_s.1.dylib_T_${mlib} \
:info:build 	    -Wl,-reexport_library,libgcc_s.1.1.dylib_T_${mlib} \
:info:build 	    -lSystem \
:info:build 	    -Wl,-reexported_symbols_list,/opt/local/var/macports/build/_opt_local_var_macports_sources_rsync.macports.org_macports_release_tarballs_ports_lang_gcc11/libgcc11/work/gcc-11.3.0/libgcc/config/darwin-unwind.ver \
:info:build 	    -install_name @rpath/libgcc_s.1.dylib \
:info:build 	    -compatibility_version 1 -current_version 1.1 ; \
:info:build 	done
:info:build xgcc: warning: could not understand version '13.0'
:info:build xgcc: warning: could not understand version '13.0'
:info:build ld: targeted OS version does not support -reexported_symbols_list
:info:build collect2: error: ld returned 1 exit status
:info:build make[3]: *** [libgcc_s.1.dylib] Error 1
:info:build make[3]: Leaving directory `/opt/local/var/macports/build/_opt_local_var_macports_sources_rsync.macports.org_macports_release_tarballs_ports_lang_gcc11/libgcc11/work/build/x86_64-apple-darwin22/libgcc'
:info:build make[2]: *** [all-stage1-target-libgcc] Error 2
:info:build make[2]: Leaving directory `/opt/local/var/macports/build/_opt_local_var_macports_sources_rsync.macports.org_macports_release_tarballs_ports_lang_gcc11/libgcc11/work/build'
:info:build make[1]: *** [stage1-bubble] Error 2
:info:build make[1]: Leaving directory `/opt/local/var/macports/build/_opt_local_var_macports_sources_rsync.macports.org_macports_release_tarballs_ports_lang_gcc11/libgcc11/work/build'
:info:build make: *** [bootstrap-lean] Error 2
:info:build make: Leaving directory `/opt/local/var/macports/build/_opt_local_var_macports_sources_rsync.macports.org_macports_release_tarballs_ports_lang_gcc11/libgcc11/work/build'
:info:build Command failed:  cd "/opt/local/var/macports/build/_opt_local_var_macports_sources_rsync.macports.org_macports_release_tarballs_ports_lang_gcc11/libgcc11/work/build" && /usr/bin/make -j8 -w bootstrap-lean 
:info:build Exit code: 2
:error:build Failed to build libgcc11: command execution failed
:debug:build Error code: CHILDSTATUS 62135 2
:debug:build Backtrace: command execution failed
:debug:build     while executing
:debug:build "system {*}$notty {*}$callback {*}$nice $fullcmdstring"
:debug:build     invoked from within
:debug:build "command_exec -callback portprogress::target_progress_callback build"
:debug:build     (procedure "portbuild::build_main" line 8)
:debug:build     invoked from within
:debug:build "$procedure $targetname"
:error:build See /opt/local/var/macports/logs/_opt_local_var_macports_sources_rsync.macports.org_macports_release_tarballs_ports_lang_gcc11/libgcc11/main.log for details.

Change History (6)

comment:1 Changed 8 weeks ago by jmroot (Joshua Root)

Description: modified (diff)
Keywords: ventura added
Priority: HighNormal

comment:2 in reply to:  description ; Changed 8 weeks ago by ryandesign (Ryan Schmidt)

Replying to imos-99:

:info:build xgcc: warning: could not understand version '13.0'

gcc11 might be too old to work on macOS 13. Did you try a newer version of gcc, like gcc12 or gcc-devel?

comment:3 in reply to:  2 Changed 5 weeks ago by aforeman

Replying to ryandesign:

Replying to imos-99:

:info:build xgcc: warning: could not understand version '13.0'

gcc11 might be too old to work on macOS 13. Did you try a newer version of gcc, like gcc12 or gcc-devel?

This is installed as a dependancy of other packages.

comment:4 Changed 5 weeks ago by kencu (Ken)

no packages should depend on gcc11/libgcc11 at present.

can you see which package is calling for it?

port -v installed | grep gcc11

might tell you.

comment:5 Changed 5 weeks ago by imos-99

You are right, there are no dependencies. I compiled my own package, which also compiles fine with gcc12. Thanks!

comment:6 Changed 3 weeks ago by kencu (Ken)

Owner: set to kencu
Resolution: fixed
Status: newclosed

In 302d838a7a29e992ce0727ad34d66ad009b44e16/macports-ports (master):

gccN: mark all gccs < gcc12 as not buildable on Ventura+

closes: #66398

Note: See TracTickets for help on using tickets.