Opened 11 years ago

Closed 11 years ago

#23427 closed defect (fixed)

Kdelibs4 fails to build on Snow Leopard 10.6.2

Reported by: djackan@… Owned by: nerdling (Jeremy Lavergne)
Priority: Normal Milestone:
Component: ports Version:
Keywords: Cc: sharky@…, jord.swart@…, t.quillinan@…, funkypuck@…
Port: kdelibs4

Description (last modified by jmroot (Joshua Root))

So far I have done: sudo port clean --all kdelibs4 sudo port -d install kdelibs4 I've done the selfupdate and upgrade outdated and nothing has changed Kdelibs4 always fails at the same point. There are other tickets with similar outputs but as far as I can tell it's not the same problem. I'm actually having a hard time even seeing where the error is. I've attached the debug log.

If it matters I'm building it on a 15" Macbook Pro with the Intel Santa Rosa processor. The Xcode is 3.2.1 The error message is below:

/opt/local/bin/cmake -E cmake_progress_report /opt/local/var/macports/build/_opt_local_var_macports_sources_rsync.macports.org_release_ports_kde_kdelibs4/work/build/CMakeFiles 
[ 40%] Building CXX object kdeui/CMakeFiles/kdeui.dir/kglobalaccel_component_interface.o
cd /opt/local/var/macports/build/_opt_local_var_macports_sources_rsync.macports.org_release_ports_kde_kdelibs4/work/build/kdeui && /usr/bin/g++-4.2   -DMAKE_KDEUI_LIB -DQT_NO_STL -DQT_NO_CAST_TO_ASCII -D_REENTRANT -DKDE_DEPRECATED_WARNINGS -arch x86_64 -isysroot /Developer/SDKs/MacOSX10.6.sdk -mmacosx-version-min=10.6 -O2 -arch x86_64  -fno-common -Woverloaded-virtual -fvisibility=hidden -fvisibility-inlines-hidden -O2 -DNDEBUG -DQT_NO_DEBUG -fPIC -I/opt/local/var/macports/build/_opt_local_var_macports_sources_rsync.macports.org_release_ports_kde_kdelibs4/work/build/kdeui -I/opt/local/var/macports/build/_opt_local_var_macports_sources_rsync.macports.org_release_ports_kde_kdelibs4/work/kdelibs-4.3.4/kdeui -I/opt/local/var/macports/build/_opt_local_var_macports_sources_rsync.macports.org_release_ports_kde_kdelibs4/work/kdelibs-4.3.4 -I/opt/local/var/macports/build/_opt_local_var_macports_sources_rsync.macports.org_release_ports_kde_kdelibs4/work/build -I/opt/local/var/macports/build/_opt_local_var_macports_sources_rsync.macports.org_release_ports_kde_kdelibs4/work/kdelibs-4.3.4/interfaces -I/opt/local/var/macports/build/_opt_local_var_macports_sources_rsync.macports.org_release_ports_kde_kdelibs4/work/kdelibs-4.3.4/interfaces/kregexpeditor -I/opt/local/var/macports/build/_opt_local_var_macports_sources_rsync.macports.org_release_ports_kde_kdelibs4/work/kdelibs-4.3.4/kdecore/sonnet -I/opt/local/var/macports/build/_opt_local_var_macports_sources_rsync.macports.org_release_ports_kde_kdelibs4/work/kdelibs-4.3.4/kjs -I/opt/local/var/macports/build/_opt_local_var_macports_sources_rsync.macports.org_release_ports_kde_kdelibs4/work/build/kjs -I/opt/local/var/macports/build/_opt_local_var_macports_sources_rsync.macports.org_release_ports_kde_kdelibs4/work/kdelibs-4.3.4/kdecore -I/opt/local/var/macports/build/_opt_local_var_macports_sources_rsync.macports.org_release_ports_kde_kdelibs4/work/build/kdecore -I/opt/local/var/macports/build/_opt_local_var_macports_sources_rsync.macports.org_release_ports_kde_kdelibs4/work/kdelibs-4.3.4/kdecore/compression -I/opt/local/var/macports/build/_opt_local_var_macports_sources_rsync.macports.org_release_ports_kde_kdelibs4/work/kdelibs-4.3.4/kdecore/config -I/opt/local/var/macports/build/_opt_local_var_macports_sources_rsync.macports.org_release_ports_kde_kdelibs4/work/kdelibs-4.3.4/kdecore/date -I/opt/local/var/macports/build/_opt_local_var_macports_sources_rsync.macports.org_release_ports_kde_kdelibs4/work/kdelibs-4.3.4/kdecore/io -I/opt/local/var/macports/build/_opt_local_var_macports_sources_rsync.macports.org_release_ports_kde_kdelibs4/work/kdelibs-4.3.4/kdecore/jobs -I/opt/local/var/macports/build/_opt_local_var_macports_sources_rsync.macports.org_release_ports_kde_kdelibs4/work/kdelibs-4.3.4/kdecore/kernel -I/opt/local/var/macports/build/_opt_local_var_macports_sources_rsync.macports.org_release_ports_kde_kdelibs4/work/kdelibs-4.3.4/kdecore/network -I/opt/local/var/macports/build/_opt_local_var_macports_sources_rsync.macports.org_release_ports_kde_kdelibs4/work/kdelibs-4.3.4/kdecore/services -I/opt/local/var/macports/build/_opt_local_var_macports_sources_rsync.macports.org_release_ports_kde_kdelibs4/work/kdelibs-4.3.4/kdecore/localization -I/opt/local/var/macports/build/_opt_local_var_macports_sources_rsync.macports.org_release_ports_kde_kdelibs4/work/kdelibs-4.3.4/kdecore/sycoca -I/opt/local/var/macports/build/_opt_local_var_macports_sources_rsync.macports.org_release_ports_kde_kdelibs4/work/kdelibs-4.3.4/kdecore/text -I/opt/local/var/macports/build/_opt_local_var_macports_sources_rsync.macports.org_release_ports_kde_kdelibs4/work/kdelibs-4.3.4/kdecore/util -I/opt/local/var/macports/build/_opt_local_var_macports_sources_rsync.macports.org_release_ports_kde_kdelibs4/work/kdelibs-4.3.4/kdeui/actions -I/opt/local/var/macports/build/_opt_local_var_macports_sources_rsync.macports.org_release_ports_kde_kdelibs4/work/kdelibs-4.3.4/kdeui/colors -I/opt/local/var/macports/build/_opt_local_var_macports_sources_rsync.macports.org_release_ports_kde_kdelibs4/work/kdelibs-4.3.4/kdeui/config -I/opt/local/var/macports/build/_opt_local_var_macports_sources_rsync.macports.org_release_ports_kde_kdelibs4/work/kdelibs-4.3.4/kdeui/dialogs -I/opt/local/var/macports/build/_opt_local_var_macports_sources_rsync.macports.org_release_ports_kde_kdelibs4/work/kdelibs-4.3.4/kdeui/findreplace -I/opt/local/var/macports/build/_opt_local_var_macports_sources_rsync.macports.org_release_ports_kde_kdelibs4/work/kdelibs-4.3.4/kdeui/fonts -I/opt/local/var/macports/build/_opt_local_var_macports_sources_rsync.macports.org_release_ports_kde_kdelibs4/work/kdelibs-4.3.4/kdeui/icons -I/opt/local/var/macports/build/_opt_local_var_macports_sources_rsync.macports.org_release_ports_kde_kdelibs4/work/kdelibs-4.3.4/kdeui/itemviews -I/opt/local/var/macports/build/_opt_local_var_macports_sources_rsync.macports.org_release_ports_kde_kdelibs4/work/kdelibs-4.3.4/kdeui/jobs -I/opt/local/var/macports/build/_opt_local_var_macports_sources_rsync.macports.org_release_ports_kde_kdelibs4/work/kdelibs-4.3.4/kdeui/kernel -I/opt/local/var/macports/build/_opt_local_var_macports_sources_rsync.macports.org_release_ports_kde_kdelibs4/work/kdelibs-4.3.4/kdeui/paged -I/opt/local/var/macports/build/_opt_local_var_macports_sources_rsync.macports.org_release_ports_kde_kdelibs4/work/kdelibs-4.3.4/kdeui/plotting -I/opt/local/var/macports/build/_opt_local_var_macports_sources_rsync.macports.org_release_ports_kde_kdelibs4/work/kdelibs-4.3.4/kdeui/shortcuts -I/opt/local/var/macports/build/_opt_local_var_macports_sources_rsync.macports.org_release_ports_kde_kdelibs4/work/kdelibs-4.3.4/kdeui/sonnet -I/opt/local/var/macports/build/_opt_local_var_macports_sources_rsync.macports.org_release_ports_kde_kdelibs4/work/kdelibs-4.3.4/kdeui/util -I/opt/local/var/macports/build/_opt_local_var_macports_sources_rsync.macports.org_release_ports_kde_kdelibs4/work/kdelibs-4.3.4/kdeui/widgets -I/opt/local/var/macports/build/_opt_local_var_macports_sources_rsync.macports.org_release_ports_kde_kdelibs4/work/kdelibs-4.3.4/kdeui/windowmanagement -I/opt/local/var/macports/build/_opt_local_var_macports_sources_rsync.macports.org_release_ports_kde_kdelibs4/work/kdelibs-4.3.4/kdeui/xmlgui -I/opt/local/libexec/qt4-mac/include/phonon -I/opt/local/libexec/qt4-mac/include/QtXmlPatterns -I/opt/local/libexec/qt4-mac/include/QtWebKit -I/opt/local/libexec/qt4-mac/include/QtHelp -I/opt/local/libexec/qt4-mac/include/QtAssistant -I/opt/local/libexec/qt4-mac/include/QtDBus -I/opt/local/libexec/qt4-mac/include/QtTest -I/opt/local/libexec/qt4-mac/include/QtUiTools -I/opt/local/libexec/qt4-mac/include/QtScript -I/opt/local/libexec/qt4-mac/include/QtSvg -I/opt/local/libexec/qt4-mac/include/QtXml -I/opt/local/libexec/qt4-mac/include/QtSql -I/opt/local/libexec/qt4-mac/include/QtOpenGL -I/opt/local/libexec/qt4-mac/include/QtNetwork -I/opt/local/libexec/qt4-mac/include/QtDesigner -I/opt/local/libexec/qt4-mac/include/Qt3Support -I/opt/local/libexec/qt4-mac/include/QtGui -I/opt/local/libexec/qt4-mac/include/QtCore -I/opt/local/libexec/qt4-mac/include/Qt -I/opt/local/libexec/qt4-mac/mkspecs/default -I/opt/local/libexec/qt4-mac/include   -F/opt/local/libexec/qt4-mac/lib -L/opt/local/libexec/qt4-mac/lib -D__APPLE_KDE__ -D_LARGEFILE64_SOURCE -o CMakeFiles/kdeui.dir/kglobalaccel_component_interface.o -c /opt/local/var/macports/build/_opt_local_var_macports_sources_rsync.macports.org_release_ports_kde_kdelibs4/work/build/kdeui/kglobalaccel_component_interface.cpp
Linking CXX shared library ../lib/libkdeui.dylib
cd /opt/local/var/macports/build/_opt_local_var_macports_sources_rsync.macports.org_release_ports_kde_kdelibs4/work/build/kdeui && /opt/local/bin/cmake -E cmake_link_script CMakeFiles/kdeui.dir/link.txt --verbose=1
/usr/bin/g++-4.2   -arch x86_64 -isysroot /Developer/SDKs/MacOSX10.6.sdk -mmacosx-version-min=10.6 -O2 -arch x86_64  -fno-common -Woverloaded-virtual -fvisibility=hidden -fvisibility-inlines-hidden -O2 -DNDEBUG -DQT_NO_DEBUG -dynamiclib -headerpad_max_install_names -single_module -multiply_defined suppress -L/opt/local/lib -compatibility_version 5.0.0 -current_version 5.3.0 -o ../lib/libkdeui.5.3.0.dylib -install_name /opt/local/lib/libkdeui.5.dylib CMakeFiles/kdeui.dir/kdeui_automoc.o CMakeFiles/kdeui.dir/actions/kactioncollection.o CMakeFiles/kdeui.dir/actions/kactioncategory.o CMakeFiles/kdeui.dir/actions/kaction.o CMakeFiles/kdeui.dir/actions/kactionmenu.o CMakeFiles/kdeui.dir/actions/kcodecaction.o CMakeFiles/kdeui.dir/actions/kfontaction.o CMakeFiles/kdeui.dir/actions/kfontsizeaction.o CMakeFiles/kdeui.dir/actions/kpastetextaction.o CMakeFiles/kdeui.dir/actions/krecentfilesaction.o CMakeFiles/kdeui.dir/actions/kselectaction.o CMakeFiles/kdeui.dir/actions/kstandardaction.o CMakeFiles/kdeui.dir/actions/ktoggleaction.o CMakeFiles/kdeui.dir/actions/ktoggletoolbaraction.o CMakeFiles/kdeui.dir/actions/ktogglefullscreenaction.o CMakeFiles/kdeui.dir/actions/ktoolbarlabelaction.o CMakeFiles/kdeui.dir/actions/ktoolbarpopupaction.o CMakeFiles/kdeui.dir/actions/ktoolbarspaceraction.o CMakeFiles/kdeui.dir/colors/kcolorspaces.o CMakeFiles/kdeui.dir/colors/kcolorutils.o CMakeFiles/kdeui.dir/colors/kcolorscheme.o CMakeFiles/kdeui.dir/colors/kcolorcollection.o CMakeFiles/kdeui.dir/colors/kcolorbutton.o CMakeFiles/kdeui.dir/colors/kcolorcombo.o CMakeFiles/kdeui.dir/colors/kcolordialog.o CMakeFiles/kdeui.dir/colors/kcolormimedata.o CMakeFiles/kdeui.dir/colors/kcolorvalueselector.o CMakeFiles/kdeui.dir/colors/khuesaturationselect.o CMakeFiles/kdeui.dir/config/kconfigskeleton.o CMakeFiles/kdeui.dir/config/kconfiggroupgui.o CMakeFiles/kdeui.dir/dialogs/kaboutkdedialog_p.o CMakeFiles/kdeui.dir/dialogs/kassistantdialog.o CMakeFiles/kdeui.dir/dialogs/kconfigdialog.o CMakeFiles/kdeui.dir/dialogs/kconfigdialogmanager.o CMakeFiles/kdeui.dir/dialogs/kbugreport.o CMakeFiles/kdeui.dir/dialogs/kdeprintdialog.o CMakeFiles/kdeui.dir/dialogs/kdialog.o CMakeFiles/kdeui.dir/dialogs/kedittoolbar.o CMakeFiles/kdeui.dir/dialogs/kinputdialog.o CMakeFiles/kdeui.dir/dialogs/klinkdialog.o CMakeFiles/kdeui.dir/dialogs/kmessagebox.o CMakeFiles/kdeui.dir/dialogs/kmessageboxmessagehandler.o CMakeFiles/kdeui.dir/dialogs/kaboutapplicationdialog.o CMakeFiles/kdeui.dir/dialogs/knewpassworddialog.o CMakeFiles/kdeui.dir/dialogs/kpassworddialog.o CMakeFiles/kdeui.dir/dialogs/kpixmapregionselectordialog.o CMakeFiles/kdeui.dir/dialogs/kprogressdialog.o CMakeFiles/kdeui.dir/dialogs/kshortcuteditwidget.o CMakeFiles/kdeui.dir/dialogs/kshortcutseditordelegate.o CMakeFiles/kdeui.dir/dialogs/kshortcutseditoritem.o CMakeFiles/kdeui.dir/dialogs/kshortcutseditor.o CMakeFiles/kdeui.dir/dialogs/kshortcutschemeseditor.o CMakeFiles/kdeui.dir/dialogs/kshortcutsdialog.o CMakeFiles/kdeui.dir/dialogs/ksplashscreen.o CMakeFiles/kdeui.dir/dialogs/kswitchlanguagedialog_p.o CMakeFiles/kdeui.dir/dialogs/ktip.o CMakeFiles/kdeui.dir/findreplace/kfind.o CMakeFiles/kdeui.dir/findreplace/kreplace.o CMakeFiles/kdeui.dir/findreplace/kfinddialog.o CMakeFiles/kdeui.dir/findreplace/kreplacedialog.o CMakeFiles/kdeui.dir/fonts/fonthelpers.o CMakeFiles/kdeui.dir/fonts/kfontchooser.o CMakeFiles/kdeui.dir/fonts/kfontcombobox.o CMakeFiles/kdeui.dir/fonts/kfontdialog.o CMakeFiles/kdeui.dir/fonts/kfontrequester.o CMakeFiles/kdeui.dir/icons/kiconeffect.o CMakeFiles/kdeui.dir/icons/kiconengine.o CMakeFiles/kdeui.dir/icons/kicon.o CMakeFiles/kdeui.dir/icons/kiconloader.o CMakeFiles/kdeui.dir/icons/kicontheme.o CMakeFiles/kdeui.dir/icons/kiconcache.o CMakeFiles/kdeui.dir/itemviews/klistwidget.o CMakeFiles/kdeui.dir/itemviews/klistwidgetsearchline.o CMakeFiles/kdeui.dir/itemviews/ktreewidgetsearchline.o CMakeFiles/kdeui.dir/itemviews/kfilterproxysearchline.o CMakeFiles/kdeui.dir/itemviews/kextendableitemdelegate.o CMakeFiles/kdeui.dir/itemviews/kcategorizedsortfilterproxymodel.o CMakeFiles/kdeui.dir/itemviews/kcategorizedview.o CMakeFiles/kdeui.dir/itemviews/kcategorydrawer.o CMakeFiles/kdeui.dir/itemviews/kwidgetitemdelegate.o CMakeFiles/kdeui.dir/itemviews/kwidgetitemdelegatepool.o CMakeFiles/kdeui.dir/jobs/kdialogjobuidelegate.o CMakeFiles/kdeui.dir/jobs/kabstractwidgetjobtracker.o CMakeFiles/kdeui.dir/jobs/kwidgetjobtracker.o CMakeFiles/kdeui.dir/jobs/kstatusbarjobtracker.o CMakeFiles/kdeui.dir/jobs/kuiserverjobtracker.o CMakeFiles/kdeui.dir/kernel/kapplication.o CMakeFiles/kdeui.dir/kernel/kclipboard.o CMakeFiles/kdeui.dir/kernel/kuniqueapplication.o CMakeFiles/kdeui.dir/kernel/ksessionmanager.o CMakeFiles/kdeui.dir/kernel/kstyle.o CMakeFiles/kdeui.dir/kernel/kstartupinfo.o CMakeFiles/kdeui.dir/kernel/kglobalsettings.o CMakeFiles/kdeui.dir/paged/kpagedialog.o CMakeFiles/kdeui.dir/paged/kpagemodel.o CMakeFiles/kdeui.dir/paged/kpageview.o CMakeFiles/kdeui.dir/paged/kpageview_p.o CMakeFiles/kdeui.dir/paged/kpagewidget.o CMakeFiles/kdeui.dir/paged/kpagewidgetmodel.o CMakeFiles/kdeui.dir/plotting/kplotaxis.o CMakeFiles/kdeui.dir/plotting/kplotpoint.o CMakeFiles/kdeui.dir/plotting/kplotobject.o CMakeFiles/kdeui.dir/plotting/kplotwidget.o CMakeFiles/kdeui.dir/shortcuts/kshortcut.o CMakeFiles/kdeui.dir/shortcuts/kshortcutschemeshelper.o CMakeFiles/kdeui.dir/shortcuts/kstandardshortcut.o CMakeFiles/kdeui.dir/shortcuts/kglobalaccel.o CMakeFiles/kdeui.dir/shortcuts/kglobalshortcutinfo.o CMakeFiles/kdeui.dir/shortcuts/kglobalshortcutinfo_dbus.o CMakeFiles/kdeui.dir/shortcuts/kacceleratormanager.o CMakeFiles/kdeui.dir/shortcuts/kcheckaccelerators.o CMakeFiles/kdeui.dir/shortcuts/kgesture.o CMakeFiles/kdeui.dir/shortcuts/kgesturemap.o CMakeFiles/kdeui.dir/sonnet/dialog.o CMakeFiles/kdeui.dir/sonnet/configwidget.o CMakeFiles/kdeui.dir/sonnet/highlighter.o CMakeFiles/kdeui.dir/sonnet/configdialog.o CMakeFiles/kdeui.dir/sonnet/dictionarycombobox.o CMakeFiles/kdeui.dir/util/kckey.o CMakeFiles/kdeui.dir/util/kcompletion.o CMakeFiles/kdeui.dir/util/kcompletionbase.o CMakeFiles/kdeui.dir/util/kcrash.o CMakeFiles/kdeui.dir/util/kcursor.o CMakeFiles/kdeui.dir/util/kguiitem.o CMakeFiles/kdeui.dir/util/kkeyserver.o CMakeFiles/kdeui.dir/util/kmanagerselection.o CMakeFiles/kdeui.dir/util/kmodifierkeyinfo.o CMakeFiles/kdeui.dir/util/kmodifierkeyinfoprovider.o CMakeFiles/kdeui.dir/util/knotification.o CMakeFiles/kdeui.dir/util/knotificationmanager.o CMakeFiles/kdeui.dir/util/knotificationrestrictions.o CMakeFiles/kdeui.dir/util/knumvalidator.o CMakeFiles/kdeui.dir/util/kpassivepopup.o CMakeFiles/kdeui.dir/util/kpassivepopupmessagehandler.o CMakeFiles/kdeui.dir/util/kpixmapcache.o CMakeFiles/kdeui.dir/util/kpixmapprovider.o CMakeFiles/kdeui.dir/util/kstandardguiitem.o CMakeFiles/kdeui.dir/util/ksvgrenderer.o CMakeFiles/kdeui.dir/util/ksystemtrayicon.o CMakeFiles/kdeui.dir/util/kwallet.o CMakeFiles/kdeui.dir/util/kwhatsthismanager.o CMakeFiles/kdeui.dir/util/kwordwrap.o CMakeFiles/kdeui.dir/util/kxerrorhandler.o CMakeFiles/kdeui.dir/util/kxmessages.o CMakeFiles/kdeui.dir/util/kxutils.o CMakeFiles/kdeui.dir/util/kundostack.o CMakeFiles/kdeui.dir/widgets/kactionselector.o CMakeFiles/kdeui.dir/widgets/kanimatedbutton.o CMakeFiles/kdeui.dir/widgets/karrowbutton.o CMakeFiles/kdeui.dir/widgets/kdialogbuttonbox.o CMakeFiles/kdeui.dir/widgets/kbuttongroup.o CMakeFiles/kdeui.dir/widgets/kcapacitybar.o CMakeFiles/kdeui.dir/widgets/kcharselect.o CMakeFiles/kdeui.dir/widgets/kcharselectdata.o CMakeFiles/kdeui.dir/widgets/kcmodule.o CMakeFiles/kdeui.dir/widgets/kcombobox.o CMakeFiles/kdeui.dir/widgets/kcompletionbox.o CMakeFiles/kdeui.dir/widgets/kdatepicker.o CMakeFiles/kdeui.dir/widgets/kdatetable.o CMakeFiles/kdeui.dir/widgets/kdatetimewidget.o CMakeFiles/kdeui.dir/widgets/kdatewidget.o CMakeFiles/kdeui.dir/widgets/keditlistbox.o CMakeFiles/kdeui.dir/widgets/kfadewidgeteffect.o CMakeFiles/kdeui.dir/widgets/khbox.o CMakeFiles/kdeui.dir/widgets/khelpmenu.o CMakeFiles/kdeui.dir/widgets/khistorycombobox.o CMakeFiles/kdeui.dir/widgets/kkeysequencewidget.o CMakeFiles/kdeui.dir/widgets/klanguagebutton.o CMakeFiles/kdeui.dir/widgets/kled.o CMakeFiles/kdeui.dir/widgets/klineedit.o CMakeFiles/kdeui.dir/widgets/kmainwindow.o CMakeFiles/kdeui.dir/widgets/kmenu.o CMakeFiles/kdeui.dir/widgets/kmenubar.o CMakeFiles/kdeui.dir/widgets/kmultitabbar.o CMakeFiles/kdeui.dir/widgets/knuminput.o CMakeFiles/kdeui.dir/widgets/kpixmapregionselectorwidget.o CMakeFiles/kdeui.dir/widgets/kpushbutton.o CMakeFiles/kdeui.dir/widgets/krestrictedline.o CMakeFiles/kdeui.dir/widgets/krichtextedit.o CMakeFiles/kdeui.dir/widgets/krichtextwidget.o CMakeFiles/kdeui.dir/widgets/kruler.o CMakeFiles/kdeui.dir/widgets/kselector.o CMakeFiles/kdeui.dir/widgets/kseparator.o CMakeFiles/kdeui.dir/widgets/kshortcutwidget.o CMakeFiles/kdeui.dir/widgets/ksqueezedtextlabel.o CMakeFiles/kdeui.dir/widgets/kstatusbar.o CMakeFiles/kdeui.dir/widgets/kstringvalidator.o CMakeFiles/kdeui.dir/widgets/ktabbar.o CMakeFiles/kdeui.dir/widgets/ktabwidget.o CMakeFiles/kdeui.dir/widgets/ktextbrowser.o CMakeFiles/kdeui.dir/widgets/ktextedit.o CMakeFiles/kdeui.dir/widgets/ktimezonewidget.o CMakeFiles/kdeui.dir/widgets/ktitlewidget.o CMakeFiles/kdeui.dir/widgets/ktoolbar.o CMakeFiles/kdeui.dir/widgets/kurllabel.o CMakeFiles/kdeui.dir/widgets/kvbox.o CMakeFiles/kdeui.dir/widgets/kxyselector.o CMakeFiles/kdeui.dir/widgets/kdeuiwidgetsproxystyle.o CMakeFiles/kdeui.dir/widgets/nestedlisthelper.o CMakeFiles/kdeui.dir/xmlgui/kxmlguibuilder.o CMakeFiles/kdeui.dir/xmlgui/kxmlguiwindow.o CMakeFiles/kdeui.dir/xmlgui/kmainwindowiface.o CMakeFiles/kdeui.dir/xmlgui/kmenumenuhandler_p.o CMakeFiles/kdeui.dir/xmlgui/ktoolbarhandler.o CMakeFiles/kdeui.dir/xmlgui/kxmlguiclient.o CMakeFiles/kdeui.dir/xmlgui/kxmlguifactory.o CMakeFiles/kdeui.dir/xmlgui/kxmlguifactory_p.o CMakeFiles/kdeui.dir/xmlgui/kxmlguiversionhandler.o CMakeFiles/kdeui.dir/util/kkeyserver_mac.o CMakeFiles/kdeui.dir/windowmanagement/kwindowsystem_mac.o CMakeFiles/kdeui.dir/windowmanagement/kwindowinfo_mac.o CMakeFiles/kdeui.dir/util/kmodifierkeyinfoprovider_dummy.o CMakeFiles/kdeui.dir/kwallet_interface.o CMakeFiles/kdeui.dir/jobviewserverinterface.o CMakeFiles/kdeui.dir/jobviewiface.o CMakeFiles/kdeui.dir/kglobalaccel_interface.o CMakeFiles/kdeui.dir/kglobalaccel_component_interface.o -L/opt/local/var/macports/build/_opt_local_var_macports_sources_rsync.macports.org_release_ports_kde_kdelibs4/work/build/lib -F/opt/local/libexec/qt4-mac/lib -framework QtSvg -F/opt/local/libexec/qt4-mac/lib -framework QtCore -lpthread ../lib/libkdecore.5.3.0.dylib -F/opt/local/libexec/qt4-mac/lib -framework QtGui -F/opt/local/libexec/qt4-mac/lib -framework QtXml -F/opt/local/libexec/qt4-mac/lib -framework QtNetwork -framework Carbon -F/opt/local/libexec/qt4-mac/lib -framework QtCore -lpthread -framework Carbon -F/opt/local/libexec/qt4-mac/lib -framework QtDBus 
cd /opt/local/var/macports/build/_opt_local_var_macports_sources_rsync.macports.org_release_ports_kde_kdelibs4/work/build/kdeui && /opt/local/bin/cmake -E cmake_symlink_library ../lib/libkdeui.5.3.0.dylib ../lib/libkdeui.5.dylib ../lib/libkdeui.dylib
/opt/local/bin/cmake -E cmake_progress_report /opt/local/var/macports/build/_opt_local_var_macports_sources_rsync.macports.org_release_ports_kde_kdelibs4/work/build/CMakeFiles  22 23 24 25 26 27 28 29 30
[ 40%] Built target kdeui
make: *** [all] Error 2
Error: Target org.macports.build returned: shell command " cd "/opt/local/var/macports/build/_opt_local_var_macports_sources_rsync.macports.org_release_ports_kde_kdelibs4/work/build" && /usr/bin/make -j2 all " returned error 2
DEBUG: Backtrace: shell command " cd "/opt/local/var/macports/build/_opt_local_var_macports_sources_rsync.macports.org_release_ports_kde_kdelibs4/work/build" && /usr/bin/make -j2 all " returned error 2
    while executing
"command_exec build"
    (procedure "portbuild::build_main" line 9)
    invoked from within
"$procedure $targetname"
Warning: the following items did not execute (for kdelibs4): org.macports.activate org.macports.build org.macports.destroot org.macports.archive org.macports.install
Error: Status 1 encountered during processing.
To report a bug, see <http://guide.macports.org/#project.tickets>

Attachments (1)

kdelibs4_4.3.4builddebugreport.zip (109.4 KB) - added by djackan@… 11 years ago.
compressed debug log

Download all attachments as: .zip

Change History (20)

comment:1 Changed 11 years ago by djackan@…

Ok I was unable to attach the debug log because it was too large.

comment:2 Changed 11 years ago by jmroot (Joshua Root)

Cc: sharky@… added
Description: modified (diff)
Keywords: kdelibs4 Snow Leopard kdeui removed
Owner: changed from macports-tickets@… to snc@…
Port: 4.3.4 removed

Please remember to preview, and cc the maintainers. Try compressing the debug log first.

Changed 11 years ago by djackan@…

compressed debug log

comment:3 Changed 11 years ago by nerdling (Jeremy Lavergne)

Cc: snc@… added; sharky@… removed
Owner: changed from snc@… to sharky@…

I didn't see anything substantive in the log, just warnings about porting to 64-bit. Sharky, do you see anything?

comment:4 Changed 11 years ago by djackan@…

I did a word search for "error" in the log could this possibly be related to my problem?

CMakeFiles/kimg_jp2.dir/jp2.o -c /opt/local/var/macports/build/_opt_local_var_macports_sources_rsync.macports.org_release_ports_kde_kdelibs4/work/kdelibs-4.3.4/kimgio/jp2.cpp
/opt/local/var/macports/build/_opt_local_var_macports_sources_rsync.macports.org_release_ports_kde_kdelibs4/work/kdelibs-4.3.4/kimgio/jp2.cpp:27:27: error: jasper/jasper.h: No such file or directory
/opt/local/var/macports/build/_opt_local_var_macports_sources_rsync.macports.org_release_ports_kde_kdelibs4/work/kdelibs-4.3.4/kimgio/jp2.cpp:38: error: expected initializer before '*' token
make[2]: *** [kimgio/CMakeFiles/kimg_jp2.dir/jp2.o] Error 1
make[1]: *** [kimgio/CMakeFiles/kimg_jp2.dir/all] Error 2
make[1]: *** Waiting for unfinished jobs....
/opt/local/bin/cmake -E cmake_progress_report /opt/local/var/macports/build/_opt_local_var_macports_sources_rsync.macports.org_release_ports_kde_kdelibs4/work/build/CMakeFiles 
[ 32%] Building CXX object kdeui/CMakeFiles/kdeui.dir/findreplace/kfinddialog.o

comment:5 Changed 11 years ago by djackan@…

Problem is still present with kdelibs4 4.3.5

comment:6 Changed 11 years ago by djackan@…

I just rebuilt all of the dependencies for kdelibs4 and that did not solve the problem.

comment:7 Changed 11 years ago by jord.swart@…

Still the same problem. Anyone able to fix it?

comment:8 Changed 11 years ago by jord.swart@…

Cc: jord.swart@… added

Cc Me!

comment:9 Changed 11 years ago by ryandesign (Ryan Schmidt)

Has duplicate #23678.

comment:10 Changed 11 years ago by t.quillinan@…

Cc: t.quillinan@… added

Cc Me!

comment:11 Changed 11 years ago by funkypuck@…

Cc: funkypuck@… added

Cc Me!

comment:12 Changed 11 years ago by jord.swart@…

Did anyone fix this in the last 6 months?

comment:13 Changed 11 years ago by nerdling (Jeremy Lavergne)

Cc: sharky@… added; snc@… removed
Owner: changed from sharky@… to snc@…
Status: newassigned
Version: 1.8.2

Looks to be the cause of not having jasper installed, or an extra in a location it shouldn't be. I'll hardcode the location for it in the next release and see if that does the trick. I can't reproduce this so I don't really have a way of testing it. I'd just as soon disable kimgio.

comment:14 Changed 11 years ago by jord.swart@…

Hmmm, I've been digging around a little. Seems it is referring to the libjasper in the Xcode (not the one installed through macports). I am currently downloading Xcode 3.2.3 and will install that on my machine.

I will post the results in about an hour.

comment:15 Changed 11 years ago by jord.swart@…

Still have the same error. Looking forward to your changes.

comment:16 Changed 11 years ago by nerdling (Jeremy Lavergne)

Paths explicitly set in r70154. Let me know if this works after a selfupdate in 30 minutes.

comment:17 Changed 11 years ago by jord.swart@…

Hi Sharky,

I guess that worked, I am now running into the next problem (see below). Since it references libpng (missing required architecture); I guess it might be related (wrong path again?).

Is there a way that I can disable kimgio?

:info:build ld: warning: in /Developer/SDKs/MacOSX10.6.sdk/Library/Frameworks//libpng.framework/libpng, missing required architecture x86_64 in file
:info:build Undefined symbols:
:info:build   "_png_progressive_combine_row", referenced from:
:info:build       khtmlImLoad::PNGLoader::dispHaveRow(png_struct_def*, unsigned char*, unsigned long, int)in pngloader.o
:info:build   "_png_set_gray_1_2_4_to_8", referenced from:
:info:build       khtmlImLoad::PNGLoader::dispHaveInfo(png_struct_def*, png_info_struct*)       in pngloader.o
:info:build   "_png_set_tRNS_to_alpha", referenced from:
:info:build       khtmlImLoad::PNGLoader::dispHaveInfo(png_struct_def*, png_info_struct*)       in pngloader.o
:info:build   "_png_set_palette_to_rgb", referenced from:
:info:build       khtmlImLoad::PNGLoader::dispHaveInfo(png_struct_def*, png_info_struct*)       in pngloader.o
:info:build   "_png_set_bgr", referenced from:
:info:build       khtmlImLoad::PNGLoader::dispHaveInfo(png_struct_def*, png_info_struct*)       in pngloader.o
:info:build   "_png_set_filler", referenced from:
:info:build       khtmlImLoad::PNGLoader::dispHaveInfo(png_struct_def*, png_info_struct*)       in pngloader.o
:info:build   "_png_get_valid", referenced from:
:info:build       khtmlImLoad::PNGLoader::dispHaveInfo(png_struct_def*, png_info_struct*)       in pngloader.o
:info:build   "_png_create_info_struct", referenced from:
:info:build       khtmlImLoad::PNGLoaderProvider::loaderFor(QByteArray const&)  in pngloader.o
:info:build   "_png_destroy_read_struct", referenced from:
:info:build       khtmlImLoad::PNGLoader::~PNGLoader()in pngloader.o
:info:build       khtmlImLoad::PNGLoader::~PNGLoader()in pngloader.o
:info:build   "_png_get_IHDR", referenced from:
:info:build       khtmlImLoad::PNGLoader::dispHaveInfo(png_struct_def*, png_info_struct*)       in pngloader.o
:info:build   "_png_set_interlace_handling", referenced from:
:info:build       khtmlImLoad::PNGLoader::dispHaveInfo(png_struct_def*, png_info_struct*)       in pngloader.o
:info:build   "_png_set_strip_16", referenced from:
:info:build       khtmlImLoad::PNGLoader::dispHaveInfo(png_struct_def*, png_info_struct*)       in pngloader.o
:info:build   "_png_set_progressive_read_fn", referenced from:
:info:build       khtmlImLoad::PNGLoaderProvider::loaderFor(QByteArray const&)  in pngloader.o
:info:build   "_png_create_read_struct", referenced from:
:info:build       khtmlImLoad::PNGLoaderProvider::loaderFor(QByteArray const&)  in pngloader.o
:info:build   "_png_set_gray_to_rgb", referenced from:
:info:build       khtmlImLoad::PNGLoader::dispHaveInfo(png_struct_def*, png_info_struct*)       in pngloader.o
:info:build   "_png_process_data", referenced from:
:info:build       khtmlImLoad::PNGLoader::processData(unsigned char*, int)in pngloader.o
:info:build   "_png_start_read_image", referenced from:
:info:build       khtmlImLoad::PNGLoader::dispHaveInfo(png_struct_def*, png_info_struct*)       in pngloader.o
:info:build   "_png_read_update_info", referenced from:
:info:build       khtmlImLoad::PNGLoader::dispHaveInfo(png_struct_def*, png_info_struct*)       in pngloader.o
:info:build ld: symbol(s) not found
:info:build collect2: ld returned 1 exit status
:info:build make[2]: *** [lib/libkhtml.5.4.0.dylib] Error 1
:info:build make[1]: *** [khtml/CMakeFiles/khtml.dir/all] Error 2
:info:build make: *** [all] Error 2

comment:19 Changed 11 years ago by nerdling (Jeremy Lavergne)

Alright, libpng is explicitly set in r70331. Let me know if there are more ;-)

comment:20 Changed 11 years ago by nerdling (Jeremy Lavergne)

Resolution: fixed
Status: assignedclosed

No further bugs reported; closing as fixed.

Note: See TracTickets for help on using tickets.