Opened 8 years ago

Closed 8 years ago

#36007 closed defect (duplicate)

qt3 fails to upgrade

Reported by: mr.neel@… Owned by: macports-tickets@…
Priority: Normal Milestone:
Component: ports Version: 2.1.2
Keywords: Cc:
Port: qt3

Description

version:1
:msg:main --->  Computing dependencies for qt3:info:main .:debug:main Checking for conflicts against qt3
:debug:main Searching for dependency: qt3-mac
:debug:main Didn't find receipt, going to depspec regex for: qt3-mac
:debug:main Searching for dependency: qt4-mac
:debug:main Didn't find receipt, going to depspec regex for: qt4-mac
:debug:main Searching for dependency: qt4-mac-devel
:debug:main Didn't find receipt, going to depspec regex for: qt4-mac-devel
:debug:main Searching for dependency: mesa
:debug:main Found Dependency: receipt exists for mesa
:debug:main Searching for dependency: jpeg
:debug:main Found Dependency: receipt exists for jpeg
:debug:main Searching for dependency: libpng
:debug:main Found Dependency: receipt exists for libpng
:debug:main Searching for dependency: perl5
:debug:main Found Dependency: receipt exists for perl5
:debug:main Searching for dependency: Xft2
:debug:main Found Dependency: receipt exists for Xft2
:debug:main Searching for dependency: xrender
:debug:main Found Dependency: receipt exists for xrender
:debug:main Searching for dependency: xorg-libXcursor
:debug:main Found Dependency: receipt exists for xorg-libXcursor
:debug:main Searching for dependency: xorg-libXinerama
:debug:main Found Dependency: receipt exists for xorg-libXinerama
:debug:main Searching for dependency: xorg-libXrandr
:debug:main Found Dependency: receipt exists for xorg-libXrandr
:debug:main Searching for dependency: zlib
:debug:main Found Dependency: receipt exists for zlib
:msg:main 
:debug:main Executing org.macports.main (qt3)
:debug:main changing euid/egid - current euid: 0 - current egid: 0
:debug:main egid changed to: 501
:debug:main euid changed to: 503
:debug:main Skipping completed org.macports.archivefetch (qt3)
:debug:main Privilege de-escalation not attempted as not running as root.
:debug:main Skipping completed org.macports.fetch (qt3)
:debug:main Privilege de-escalation not attempted as not running as root.
:debug:main Skipping completed org.macports.checksum (qt3)
:debug:main Privilege de-escalation not attempted as not running as root.
:debug:main Skipping completed org.macports.extract (qt3)
:debug:main Privilege de-escalation not attempted as not running as root.
:debug:main Skipping completed org.macports.patch (qt3)
:debug:main Privilege de-escalation not attempted as not running as root.
:debug:main Skipping completed org.macports.configure (qt3)
:debug:main Privilege de-escalation not attempted as not running as root.
:debug:main Can't run org.macports.build on this port without elevated privileges. Escalating privileges back to root.
:debug:main euid changed to: 0. egid changed to: 0.
:debug:build build phase started at Wed Sep  5 16:31:34 PDT 2012
:notice:build --->  Building qt3
:debug:build Executing proc-pre-org.macports.build-build-0
:debug:build Executing org.macports.build (qt3)
:info:build ++ ls -1 /lib/
:info:build ++ grep -E '(qt-mt|qt3)'
:info:build ++ grep -v '.bad$'
:info:build + unset QMAKESPEC
:info:build ++ pwd
:info:build + export QTDIR=/opt/local/var/macports/build/_opt_local_var_macports_sources_rsync.macports.org_release_tarballs_ports_x11_qt3/qt3/work/qt-x11-free-3.3.8
:info:build + QTDIR=/opt/local/var/macports/build/_opt_local_var_macports_sources_rsync.macports.org_release_tarballs_ports_x11_qt3/qt3/work/qt-x11-free-3.3.8
:info:build + export DYLD_LIBRARY_PATH=/opt/local/var/macports/build/_opt_local_var_macports_sources_rsync.macports.org_release_tarballs_ports_x11_qt3/qt3/work/qt-x11-free-3.3.8/lib:/opt/local/var/macports/build/_opt_local_var_macports_sources_rsync.macports.org_release_tarballs_ports_x11_qt3/qt3/work/qt-x11-free-3.3.8/plugins/designer:/opt/local/var/macports/build/_opt_local_var_macports_sources_rsync.macports.org_release_tarballs_ports_x11_qt3/qt3/work/qt-x11-free-3.3.8/plugins/imageformats
:info:build + DYLD_LIBRARY_PATH=/opt/local/var/macports/build/_opt_local_var_macports_sources_rsync.macports.org_release_tarballs_ports_x11_qt3/qt3/work/qt-x11-free-3.3.8/lib:/opt/local/var/macports/build/_opt_local_var_macports_sources_rsync.macports.org_release_tarballs_ports_x11_qt3/qt3/work/qt-x11-free-3.3.8/plugins/designer:/opt/local/var/macports/build/_opt_local_var_macports_sources_rsync.macports.org_release_tarballs_ports_x11_qt3/qt3/work/qt-x11-free-3.3.8/plugins/imageformats
:info:build + export PATH=/opt/local/var/macports/build/_opt_local_var_macports_sources_rsync.macports.org_release_tarballs_ports_x11_qt3/qt3/work/qt-x11-free-3.3.8/bin:/opt/local/bin:/opt/local/sbin:/bin:/sbin:/usr/bin:/usr/sbin
:info:build + PATH=/opt/local/var/macports/build/_opt_local_var_macports_sources_rsync.macports.org_release_tarballs_ports_x11_qt3/qt3/work/qt-x11-free-3.3.8/bin:/opt/local/bin:/opt/local/sbin:/bin:/sbin:/usr/bin:/usr/sbin
:info:build + export INSTALL_ROOT=
:info:build + INSTALL_ROOT=
:info:build + export HOME=/opt/local/var/macports/build/_opt_local_var_macports_sources_rsync.macports.org_release_tarballs_ports_x11_qt3/qt3/work/qt-x11-free-3.3.8
:info:build + HOME=/opt/local/var/macports/build/_opt_local_var_macports_sources_rsync.macports.org_release_tarballs_ports_x11_qt3/qt3/work/qt-x11-free-3.3.8
:info:build + '[' -f /usr/lib/libresolv.dylib ']'
:info:build + LIBRESOLV=-lresolv
:info:build + perl -pi -e 's,#define QT_AOUT_UNDERSCORE,,' mkspecs/darwin-g++/qplatformdefs.h
:info:build + echo yes
:info:build + ./configure '-I$(QTDIR)/include' '-L$(QTDIR)/lib' -I/opt/local/include -L/opt/local/lib -lresolv -buildkey qt3-jaguar -platform darwin-g++ -xplatform darwin-g++ -prefix /opt/local/lib/qt3 -docdir /opt/local/share/doc/qt3 -headerdir /opt/local/include/qt3 -libdir /opt/local/lib -release -shared -no-exceptions -thread -cups -stl -qt-gif -plugin-imgfmt-png -plugin-imgfmt-jpeg -plugin-imgfmt-mng -system-libpng -system-libjpeg -system-zlib -largefile -sm -xinerama -xrender -xft -xkb -plugin-sql-sqlite -no-sql-ibase -no-sql-mysql -no-sql-odbc -no-sql-psql
:info:build 
:info:build This is the Qt/X11 Open Source Edition.
:info:build 
:info:build You are licensed to use this software under the terms of either
:info:build the Q Public License (QPL) or the GNU General Public License (GPL).
:info:build 
:info:build Type 'Q' to view the Q Public License.
:info:build Type 'G' to view the GNU General Public License.
:info:build Type 'yes' to accept this license offer.
:info:build Type 'no' to decline this license offer.
:info:build 
:info:build Do you accept the terms of either license? 
:info:build Creating qmake. Please wait...
:info:build gmake: `qmake' is up to date.
:info:build 
:info:build Build type:    darwin-g++
:info:build 
:info:build Configuration .......  nocrosscompiler minimal-config small-config medium-config large-config full-config styles tools kernel widgets dialogs iconview workspace network canvas table xml opengl sql release dll thread largefile stl ipv6 system-jpeg system-png gif system-zlib cups bigcodecs x11sm xshape xinerama xcursor xrandr xrender xftfreetype xkb
:info:build STL support ......... yes
:info:build PCH support ......... no
:info:build IPv6 support ........ yes
:info:build Thread support ...... yes
:info:build NIS support ......... no
:info:build CUPS support ........ yes
:info:build Large File support .. partial
:info:build GIF support ......... yes
:info:build MNG support ......... plugin (qt)
:info:build JPEG support ........ plugin (system)
:info:build PNG support ......... plugin (system)
:info:build zlib support ........ system
:info:build OpenGL support ...... yes
:info:build NAS sound support ... no
:info:build Session management .. yes
:info:build XShape support ...... yes
:info:build Xinerama support .... yes
:info:build Tablet support ...... no
:info:build Xcursor support ..... yes
:info:build XRandR support ...... yes
:info:build XRender support ..... yes
:info:build Xft support ......... yes
:info:build XKB Support ......... yes
:info:build 
:info:build Finding project files. Please wait...
:info:build   68 projects found.
:info:build 
:info:build Creating makefiles. Please wait...
:info:build   for /opt/local/var/macports/build/_opt_local_var_macports_sources_rsync.macports.org_release_tarballs_ports_x11_qt3/qt3/work/qt-x11-free-3.3.8/src/moc/moc.pro
:info:build   for /opt/local/var/macports/build/_opt_local_var_macports_sources_rsync.macports.org_release_tarballs_ports_x11_qt3/qt3/work/qt-x11-free-3.3.8/src/qt.pro
:info:build   for /opt/local/var/macports/build/_opt_local_var_macports_sources_rsync.macports.org_release_tarballs_ports_x11_qt3/qt3/work/qt-x11-free-3.3.8/extensions/extensions.pro
:info:build   for /opt/local/var/macports/build/_opt_local_var_macports_sources_rsync.macports.org_release_tarballs_ports_x11_qt3/qt3/work/qt-x11-free-3.3.8/extensions/nsplugin/src/qnp.pro
:info:build   for /opt/local/var/macports/build/_opt_local_var_macports_sources_rsync.macports.org_release_tarballs_ports_x11_qt3/qt3/work/qt-x11-free-3.3.8/plugins/src/accessible/accessible.pro
:info:build   for /opt/local/var/macports/build/_opt_local_var_macports_sources_rsync.macports.org_release_tarballs_ports_x11_qt3/qt3/work/qt-x11-free-3.3.8/plugins/src/codecs/codecs.pro
:info:build   for /opt/local/var/macports/build/_opt_local_var_macports_sources_rsync.macports.org_release_tarballs_ports_x11_qt3/qt3/work/qt-x11-free-3.3.8/plugins/src/imageformats/imageformats.pro
:info:build   for /opt/local/var/macports/build/_opt_local_var_macports_sources_rsync.macports.org_release_tarballs_ports_x11_qt3/qt3/work/qt-x11-free-3.3.8/plugins/src/sqldrivers/sqldrivers.pro
:info:build   for /opt/local/var/macports/build/_opt_local_var_macports_sources_rsync.macports.org_release_tarballs_ports_x11_qt3/qt3/work/qt-x11-free-3.3.8/plugins/src/src.pro
:info:build   for /opt/local/var/macports/build/_opt_local_var_macports_sources_rsync.macports.org_release_tarballs_ports_x11_qt3/qt3/work/qt-x11-free-3.3.8/plugins/src/styles/styles.pro
:info:build   for /opt/local/var/macports/build/_opt_local_var_macports_sources_rsync.macports.org_release_tarballs_ports_x11_qt3/qt3/work/qt-x11-free-3.3.8/tools/assistant/lib/lib.pro
:info:build   for /opt/local/var/macports/build/_opt_local_var_macports_sources_rsync.macports.org_release_tarballs_ports_x11_qt3/qt3/work/qt-x11-free-3.3.8/tools/designer/designer/designer.pro
:info:build   for /opt/local/var/macports/build/_opt_local_var_macports_sources_rsync.macports.org_release_tarballs_ports_x11_qt3/qt3/work/qt-x11-free-3.3.8/tools/designer/designer.pro
:info:build   for /opt/local/var/macports/build/_opt_local_var_macports_sources_rsync.macports.org_release_tarballs_ports_x11_qt3/qt3/work/qt-x11-free-3.3.8/tools/designer/editor/editor.pro
:info:build   for /opt/local/var/macports/build/_opt_local_var_macports_sources_rsync.macports.org_release_tarballs_ports_x11_qt3/qt3/work/qt-x11-free-3.3.8/tools/designer/plugins/plugins.pro
:info:build   for /opt/local/var/macports/build/_opt_local_var_macports_sources_rsync.macports.org_release_tarballs_ports_x11_qt3/qt3/work/qt-x11-free-3.3.8/tools/designer/uilib/uilib.pro
:info:build   for /opt/local/var/macports/build/_opt_local_var_macports_sources_rsync.macports.org_release_tarballs_ports_x11_qt3/qt3/work/qt-x11-free-3.3.8/tools/linguist/linguist.pro
:info:build   for /opt/local/var/macports/build/_opt_local_var_macports_sources_rsync.macports.org_release_tarballs_ports_x11_qt3/qt3/work/qt-x11-free-3.3.8/tools/tools.pro
:info:build   for /opt/local/var/macports/build/_opt_local_var_macports_sources_rsync.macports.org_release_tarballs_ports_x11_qt3/qt3/work/qt-x11-free-3.3.8/config.tests/unix/endian/endiantest.pro
:info:build   for /opt/local/var/macports/build/_opt_local_var_macports_sources_rsync.macports.org_release_tarballs_ports_x11_qt3/qt3/work/qt-x11-free-3.3.8/config.tests/unix/ipv6/ipv6test.pro
:info:build   for /opt/local/var/macports/build/_opt_local_var_macports_sources_rsync.macports.org_release_tarballs_ports_x11_qt3/qt3/work/qt-x11-free-3.3.8/config.tests/unix/largefile/largefiletest.pro
:info:build   for /opt/local/var/macports/build/_opt_local_var_macports_sources_rsync.macports.org_release_tarballs_ports_x11_qt3/qt3/work/qt-x11-free-3.3.8/config.tests/unix/ptrsize/ptrsizetest.pro
:info:build   for /opt/local/var/macports/build/_opt_local_var_macports_sources_rsync.macports.org_release_tarballs_ports_x11_qt3/qt3/work/qt-x11-free-3.3.8/config.tests/unix/stl/stltest.pro
:info:build   for /opt/local/var/macports/build/_opt_local_var_macports_sources_rsync.macports.org_release_tarballs_ports_x11_qt3/qt3/work/qt-x11-free-3.3.8/config.tests/x11/notype/notypetest.pro
:info:build   for /opt/local/var/macports/build/_opt_local_var_macports_sources_rsync.macports.org_release_tarballs_ports_x11_qt3/qt3/work/qt-x11-free-3.3.8/plugins/src/accessible/widgets/widgets.pro
:info:build   for /opt/local/var/macports/build/_opt_local_var_macports_sources_rsync.macports.org_release_tarballs_ports_x11_qt3/qt3/work/qt-x11-free-3.3.8/plugins/src/codecs/cn/cn.pro
:info:build   for /opt/local/var/macports/build/_opt_local_var_macports_sources_rsync.macports.org_release_tarballs_ports_x11_qt3/qt3/work/qt-x11-free-3.3.8/plugins/src/codecs/jp/jp.pro
:info:build   for /opt/local/var/macports/build/_opt_local_var_macports_sources_rsync.macports.org_release_tarballs_ports_x11_qt3/qt3/work/qt-x11-free-3.3.8/plugins/src/codecs/kr/kr.pro
:info:build   for /opt/local/var/macports/build/_opt_local_var_macports_sources_rsync.macports.org_release_tarballs_ports_x11_qt3/qt3/work/qt-x11-free-3.3.8/plugins/src/codecs/tw/tw.pro
:info:build   for /opt/local/var/macports/build/_opt_local_var_macports_sources_rsync.macports.org_release_tarballs_ports_x11_qt3/qt3/work/qt-x11-free-3.3.8/plugins/src/imageformats/jpeg/jpeg.pro
:info:build   for /opt/local/var/macports/build/_opt_local_var_macports_sources_rsync.macports.org_release_tarballs_ports_x11_qt3/qt3/work/qt-x11-free-3.3.8/plugins/src/imageformats/mng/mng.pro
:info:build   for /opt/local/var/macports/build/_opt_local_var_macports_sources_rsync.macports.org_release_tarballs_ports_x11_qt3/qt3/work/qt-x11-free-3.3.8/plugins/src/imageformats/png/png.pro
:info:build   for /opt/local/var/macports/build/_opt_local_var_macports_sources_rsync.macports.org_release_tarballs_ports_x11_qt3/qt3/work/qt-x11-free-3.3.8/plugins/src/sqldrivers/ibase/ibase.pro
:info:build   for /opt/local/var/macports/build/_opt_local_var_macports_sources_rsync.macports.org_release_tarballs_ports_x11_qt3/qt3/work/qt-x11-free-3.3.8/plugins/src/sqldrivers/mysql/mysql.pro
:info:build   for /opt/local/var/macports/build/_opt_local_var_macports_sources_rsync.macports.org_release_tarballs_ports_x11_qt3/qt3/work/qt-x11-free-3.3.8/plugins/src/sqldrivers/odbc/odbc.pro
:info:build   for /opt/local/var/macports/build/_opt_local_var_macports_sources_rsync.macports.org_release_tarballs_ports_x11_qt3/qt3/work/qt-x11-free-3.3.8/plugins/src/sqldrivers/psql/psql.pro
:info:build   for /opt/local/var/macports/build/_opt_local_var_macports_sources_rsync.macports.org_release_tarballs_ports_x11_qt3/qt3/work/qt-x11-free-3.3.8/plugins/src/sqldrivers/sqlite/sqlite.pro
:info:build   for /opt/local/var/macports/build/_opt_local_var_macports_sources_rsync.macports.org_release_tarballs_ports_x11_qt3/qt3/work/qt-x11-free-3.3.8/plugins/src/styles/cde/cde.pro
:info:build   for /opt/local/var/macports/build/_opt_local_var_macports_sources_rsync.macports.org_release_tarballs_ports_x11_qt3/qt3/work/qt-x11-free-3.3.8/plugins/src/styles/compact/compact.pro
:info:build   for /opt/local/var/macports/build/_opt_local_var_macports_sources_rsync.macports.org_release_tarballs_ports_x11_qt3/qt3/work/qt-x11-free-3.3.8/plugins/src/styles/motif/motif.pro
:info:build   for /opt/local/var/macports/build/_opt_local_var_macports_sources_rsync.macports.org_release_tarballs_ports_x11_qt3/qt3/work/qt-x11-free-3.3.8/plugins/src/styles/motifplus/motifplus.pro
:info:build   for /opt/local/var/macports/build/_opt_local_var_macports_sources_rsync.macports.org_release_tarballs_ports_x11_qt3/qt3/work/qt-x11-free-3.3.8/plugins/src/styles/platinum/platinum.pro
:info:build   for /opt/local/var/macports/build/_opt_local_var_macports_sources_rsync.macports.org_release_tarballs_ports_x11_qt3/qt3/work/qt-x11-free-3.3.8/plugins/src/styles/sgi/sgi.pro
:info:build   for /opt/local/var/macports/build/_opt_local_var_macports_sources_rsync.macports.org_release_tarballs_ports_x11_qt3/qt3/work/qt-x11-free-3.3.8/plugins/src/styles/windows/windows.pro
:info:build   for /opt/local/var/macports/build/_opt_local_var_macports_sources_rsync.macports.org_release_tarballs_ports_x11_qt3/qt3/work/qt-x11-free-3.3.8/tools/assistant/assistant.pro
:info:build   for /opt/local/var/macports/build/_opt_local_var_macports_sources_rsync.macports.org_release_tarballs_ports_x11_qt3/qt3/work/qt-x11-free-3.3.8/tools/designer/app/app.pro
:info:build   for /opt/local/var/macports/build/_opt_local_var_macports_sources_rsync.macports.org_release_tarballs_ports_x11_qt3/qt3/work/qt-x11-free-3.3.8/tools/designer/plugins/cppeditor/cppeditor.pro
:info:build   for /opt/local/var/macports/build/_opt_local_var_macports_sources_rsync.macports.org_release_tarballs_ports_x11_qt3/qt3/work/qt-x11-free-3.3.8/tools/designer/plugins/dlg/dlg.pro
:info:build   for /opt/local/var/macports/build/_opt_local_var_macports_sources_rsync.macports.org_release_tarballs_ports_x11_qt3/qt3/work/qt-x11-free-3.3.8/tools/designer/plugins/glade/glade.pro
:info:build   for /opt/local/var/macports/build/_opt_local_var_macports_sources_rsync.macports.org_release_tarballs_ports_x11_qt3/qt3/work/qt-x11-free-3.3.8/tools/designer/plugins/kdevdlg/kdevdlg.pro
:info:build   for /opt/local/var/macports/build/_opt_local_var_macports_sources_rsync.macports.org_release_tarballs_ports_x11_qt3/qt3/work/qt-x11-free-3.3.8/tools/designer/plugins/rc/rc.pro
:info:build   for /opt/local/var/macports/build/_opt_local_var_macports_sources_rsync.macports.org_release_tarballs_ports_x11_qt3/qt3/work/qt-x11-free-3.3.8/tools/designer/plugins/wizards/wizards.pro
:info:build   for /opt/local/var/macports/build/_opt_local_var_macports_sources_rsync.macports.org_release_tarballs_ports_x11_qt3/qt3/work/qt-x11-free-3.3.8/tools/designer/tools/conv2ui/conv2ui.pro
:info:build   for /opt/local/var/macports/build/_opt_local_var_macports_sources_rsync.macports.org_release_tarballs_ports_x11_qt3/qt3/work/qt-x11-free-3.3.8/tools/designer/tools/createcw/createcw.pro
:info:build   for /opt/local/var/macports/build/_opt_local_var_macports_sources_rsync.macports.org_release_tarballs_ports_x11_qt3/qt3/work/qt-x11-free-3.3.8/tools/designer/uic/uic.pro
:info:build   for /opt/local/var/macports/build/_opt_local_var_macports_sources_rsync.macports.org_release_tarballs_ports_x11_qt3/qt3/work/qt-x11-free-3.3.8/tools/designer/uilib/test/test.pro
:info:build   for /opt/local/var/macports/build/_opt_local_var_macports_sources_rsync.macports.org_release_tarballs_ports_x11_qt3/qt3/work/qt-x11-free-3.3.8/tools/linguist/linguist/linguist.pro
:info:build   for /opt/local/var/macports/build/_opt_local_var_macports_sources_rsync.macports.org_release_tarballs_ports_x11_qt3/qt3/work/qt-x11-free-3.3.8/tools/linguist/lrelease/lrelease.pro
:info:build   for /opt/local/var/macports/build/_opt_local_var_macports_sources_rsync.macports.org_release_tarballs_ports_x11_qt3/qt3/work/qt-x11-free-3.3.8/tools/linguist/lupdate/lupdate.pro
:info:build   for /opt/local/var/macports/build/_opt_local_var_macports_sources_rsync.macports.org_release_tarballs_ports_x11_qt3/qt3/work/qt-x11-free-3.3.8/tools/linguist/qm2ts/qm2ts.pro
:info:build   for /opt/local/var/macports/build/_opt_local_var_macports_sources_rsync.macports.org_release_tarballs_ports_x11_qt3/qt3/work/qt-x11-free-3.3.8/tools/makeqpf/makeqpf.pro
:info:build   for /opt/local/var/macports/build/_opt_local_var_macports_sources_rsync.macports.org_release_tarballs_ports_x11_qt3/qt3/work/qt-x11-free-3.3.8/tools/mergetr/mergetr.pro
:info:build   for /opt/local/var/macports/build/_opt_local_var_macports_sources_rsync.macports.org_release_tarballs_ports_x11_qt3/qt3/work/qt-x11-free-3.3.8/tools/msg2qm/msg2qm.pro
:info:build   for /opt/local/var/macports/build/_opt_local_var_macports_sources_rsync.macports.org_release_tarballs_ports_x11_qt3/qt3/work/qt-x11-free-3.3.8/tools/qconfig/qconfig.pro
:info:build   for /opt/local/var/macports/build/_opt_local_var_macports_sources_rsync.macports.org_release_tarballs_ports_x11_qt3/qt3/work/qt-x11-free-3.3.8/tools/qembed/qembed.pro
:info:build   for /opt/local/var/macports/build/_opt_local_var_macports_sources_rsync.macports.org_release_tarballs_ports_x11_qt3/qt3/work/qt-x11-free-3.3.8/tools/qtconfig/qtconfig.pro
:info:build   for /opt/local/var/macports/build/_opt_local_var_macports_sources_rsync.macports.org_release_tarballs_ports_x11_qt3/qt3/work/qt-x11-free-3.3.8/tools/qvfb/qvfb.pro
:info:build 
:info:build Qt is now configured for building. Just run /opt/local/bin/gmake.
:info:build To reconfigure, run /opt/local/bin/gmake confclean and configure.
:info:build 
:info:build + /usr/bin/find . -name Makefile -print0
:info:build + xargs -0 perl -pi -e s,-L/opt/local/lib/qt3/lib,,g
:info:build + pushd /opt/local
:info:build /opt/local ~
:info:build ++ /bin/pwd -P
:info:build + FixifiedSW=/opt/local
:info:build + popd
:info:build ~
:info:build + /usr/bin/find . -name Makefile -print0
:info:build + xargs -0 perl -pi -e 's,\$\(INSTALL_ROOT\)/opt/local,\$\(INSTALL_ROOT\)/opt/local,g'
:info:build + /usr/bin/make
:info:build cd qmake && /usr/bin/make
:info:build make[2]: `qmake' is up to date.
:info:build cd src/moc && /usr/bin/make
:info:build make[2]: Nothing to be done for `first'.
:info:build cd src && /usr/bin/make
:info:build make[2]: Nothing to be done for `first'.
:info:build cd plugins/src && /usr/bin/make
:info:build cd accessible && /usr/bin/make -f Makefile
:info:build make[3]: Nothing to be done for `first'.
:info:build cd codecs && /usr/bin/make -f Makefile
:info:build make[3]: Nothing to be done for `first'.
:info:build cd imageformats && /usr/bin/make -f Makefile
:info:build cd png && /usr/bin/make -f Makefile
:info:build /usr/bin/llvm-g++-4.2 -c -pipe -O2 -I/opt/local/var/macports/build/_opt_local_var_macports_sources_rsync.macports.org_release_tarballs_ports_x11_qt3/qt3/work/qt-x11-free-3.3.8/include -I/opt/local/include -fno-exceptions -Wall -W -Os -fPIC  -D__DARWIN_X11__ -DQT_NO_DEBUG -DQT_THREAD_SUPPORT -DQT_PLUGIN -DQT_SHARED -I/opt/local/var/macports/build/_opt_local_var_macports_sources_rsync.macports.org_release_tarballs_ports_x11_qt3/qt3/work/qt-x11-free-3.3.8/mkspecs/darwin-g++ -I. -I/opt/local/include/freetype2 -I/opt/local/lib/qt3/include -I../../../../include -I/opt/local/include -I/opt/local/include -I.moc/release-shared-mt/ -o .obj/release-shared-mt/main.o main.cpp
:info:build In file included from main.cpp:11:
:info:build ../../../../src/kernel/qpngio.cpp: In function ‘void setup_qt(QImage&, png_struct*, png_info*, float)’:
:info:build ../../../../src/kernel/qpngio.cpp:128: error: invalid use of incomplete type ‘struct png_info_def’
:info:build /opt/local/include/png.h:727: error: forward declaration of ‘struct png_info_def’
:info:build ../../../../src/kernel/qpngio.cpp:165: error: invalid use of incomplete type ‘struct png_info_def’
:info:build /opt/local/include/png.h:727: error: forward declaration of ‘struct png_info_def’
:info:build ../../../../src/kernel/qpngio.cpp:175: error: invalid use of incomplete type ‘struct png_info_def’
:info:build /opt/local/include/png.h:727: error: forward declaration of ‘struct png_info_def’
:info:build ../../../../src/kernel/qpngio.cpp:183: error: invalid use of incomplete type ‘struct png_info_def’
:info:build /opt/local/include/png.h:727: error: forward declaration of ‘struct png_info_def’
:info:build ../../../../src/kernel/qpngio.cpp:189: error: invalid use of incomplete type ‘struct png_info_def’
:info:build /opt/local/include/png.h:727: error: forward declaration of ‘struct png_info_def’
:info:build ../../../../src/kernel/qpngio.cpp:191: error: invalid use of incomplete type ‘struct png_info_def’
:info:build /opt/local/include/png.h:727: error: forward declaration of ‘struct png_info_def’
:info:build ../../../../src/kernel/qpngio.cpp:192: error: invalid use of incomplete type ‘struct png_info_def’
:info:build /opt/local/include/png.h:727: error: forward declaration of ‘struct png_info_def’
:info:build ../../../../src/kernel/qpngio.cpp:193: error: invalid use of incomplete type ‘struct png_info_def’
:info:build /opt/local/include/png.h:727: error: forward declaration of ‘struct png_info_def’
:info:build ../../../../src/kernel/qpngio.cpp:197: error: invalid use of incomplete type ‘struct png_info_def’
:info:build /opt/local/include/png.h:727: error: forward declaration of ‘struct png_info_def’
:info:build ../../../../src/kernel/qpngio.cpp:204: error: invalid use of incomplete type ‘struct png_info_def’
:info:build /opt/local/include/png.h:727: error: forward declaration of ‘struct png_info_def’
:info:build ../../../../src/kernel/qpngio.cpp:206: error: invalid use of incomplete type ‘struct png_info_def’
:info:build /opt/local/include/png.h:727: error: forward declaration of ‘struct png_info_def’
:info:build ../../../../src/kernel/qpngio.cpp:207: error: invalid use of incomplete type ‘struct png_info_def’
:info:build /opt/local/include/png.h:727: error: forward declaration of ‘struct png_info_def’
:info:build ../../../../src/kernel/qpngio.cpp:208: error: invalid use of incomplete type ‘struct png_info_def’
:info:build /opt/local/include/png.h:727: error: forward declaration of ‘struct png_info_def’
:info:build ../../../../src/kernel/qpngio.cpp: In function ‘void read_png_image(QImageIO*)’:
:info:build ../../../../src/kernel/qpngio.cpp:295: error: invalid use of incomplete type ‘struct png_struct_def’
:info:build /opt/local/include/png.h:854: error: forward declaration of ‘struct png_struct_def’
:info:build ../../../../src/kernel/qpngio.cpp: In member function ‘bool QPNGImageWriter::writeImage(const QImage&, int, int, int)’:
:info:build ../../../../src/kernel/qpngio.cpp:480: error: invalid use of incomplete type ‘struct png_struct_def’
:info:build /opt/local/include/png.h:854: error: forward declaration of ‘struct png_struct_def’
:info:build ../../../../src/kernel/qpngio.cpp:502: error: invalid use of incomplete type ‘struct png_info_def’
:info:build /opt/local/include/png.h:727: error: forward declaration of ‘struct png_info_def’
:info:build ../../../../src/kernel/qpngio.cpp:517: error: invalid use of incomplete type ‘struct png_info_def’
:info:build /opt/local/include/png.h:727: error: forward declaration of ‘struct png_info_def’
:info:build ../../../../src/kernel/qpngio.cpp:518: error: invalid use of incomplete type ‘struct png_info_def’
:info:build /opt/local/include/png.h:727: error: forward declaration of ‘struct png_info_def’
:info:build ../../../../src/kernel/qpngio.cpp:519: error: invalid use of incomplete type ‘struct png_info_def’
:info:build /opt/local/include/png.h:727: error: forward declaration of ‘struct png_info_def’
:info:build ../../../../src/kernel/qpngio.cpp:535: error: invalid use of incomplete type ‘struct png_info_def’
:info:build /opt/local/include/png.h:727: error: forward declaration of ‘struct png_info_def’
:info:build ../../../../src/kernel/qpngio.cpp:536: error: invalid use of incomplete type ‘struct png_info_def’
:info:build /opt/local/include/png.h:727: error: forward declaration of ‘struct png_info_def’
:info:build ../../../../src/kernel/qpngio.cpp:537: error: invalid use of incomplete type ‘struct png_info_def’
:info:build /opt/local/include/png.h:727: error: forward declaration of ‘struct png_info_def’
:info:build ../../../../src/kernel/qpngio.cpp:555: error: invalid use of incomplete type ‘struct png_info_def’
:info:build /opt/local/include/png.h:727: error: forward declaration of ‘struct png_info_def’
:info:build ../../../../src/kernel/qpngio.cpp: In member function ‘virtual int QPNGFormat::decode(QImage&, QImageConsumer*, const uchar*, int)’:
:info:build ../../../../src/kernel/qpngio.cpp:1041: error: invalid use of incomplete type ‘struct png_struct_def’
:info:build /opt/local/include/png.h:854: error: forward declaration of ‘struct png_struct_def’
:info:build ../../../../src/kernel/qpngio.cpp:1068: error: invalid use of incomplete type ‘struct png_struct_def’
:info:build /opt/local/include/png.h:854: error: forward declaration of ‘struct png_struct_def’
:info:build ../../../../src/kernel/qpngio.cpp: In member function ‘void QPNGFormat::end(png_struct*, png_info*)’:
:info:build ../../../../src/kernel/qpngio.cpp:1128: error: invalid use of incomplete type ‘struct png_struct_def’
:info:build /opt/local/include/png.h:854: error: forward declaration of ‘struct png_struct_def’
:info:build ../../../../src/kernel/qpngio.cpp: In function ‘void qt_zlib_compression_hack()’:
:info:build ../../../../src/kernel/qpngio.cpp:1243: error: ‘compress’ was not declared in this scope
:info:build ../../../../src/kernel/qpngio.cpp:1244: error: ‘uncompress’ was not declared in this scope
:info:build make[4]: *** [.obj/release-shared-mt/main.o] Error 1
:info:build make[3]: *** [sub-png] Error 2
:info:build make[2]: *** [sub-imageformats] Error 2
:info:build make[1]: *** [sub-plugins] Error 2
:info:build make: *** [init] Error 2
:info:build Command failed: cd /opt/local/var/macports/build/_opt_local_var_macports_sources_rsync.macports.org_release_tarballs_ports_x11_qt3/qt3/work/qt-x11-free-3.3.8 && ./CompileScript.sh
:info:build Exit code: 2
:error:build org.macports.build for port qt3 returned: command execution failed
:debug:build Error code: NONE
:debug:build Backtrace: command execution failed
    while executing
"$procedure $targetname"
:info:build Warning: targets not executed for qt3: org.macports.install org.macports.build org.macports.destroot
:notice:build Please see the log file for port qt3 for details:
    /opt/local/var/macports/logs/_opt_local_var_macports_sources_rsync.macports.org_release_tarballs_ports_x11_qt3/qt3/main.log

Change History (1)

comment:1 Changed 8 years ago by ryandesign (Ryan Schmidt)

Port: qt3 added
Resolution: duplicate
Status: newclosed

Duplicate of #35983.

Note: See TracTickets for help on using tickets.