Opened 3 months ago

Closed 3 months ago

#61985 closed defect (duplicate)

molden @2.6.4 build error on MacOS Big Sur

Reported by: vikilyc (yuchen liu) Owned by: ryandesign (Ryan Schmidt)
Priority: Normal Milestone:
Component: ports Version: 2.6.4
Keywords: Cc:
Port: molden

Description

DEBUG: build phase started at Mon Jan  4 01:29:58 PST 2021
--->  Building molden
DEBUG: Executing proc-pre-org.macports.build-build-0
DEBUG: Executing org.macports.build (molden)
DEBUG: port disallows a parallel build
DEBUG: Environment:
CC_PRINT_OPTIONS='YES'
CC_PRINT_OPTIONS_FILE='/opt/local/var/macports/build/_opt_local_var_macports_sources_rsync.macports.org_macports_release_tarballs_ports_science_molden/molden/work/.CC_PRINT_OPTIONS'
CPATH='/opt/local/include'
DEVELOPER_DIR='/Library/Developer/CommandLineTools'
LIBRARY_PATH='/opt/local/lib'
MACOSX_DEPLOYMENT_TARGET='11.1'
SDKROOT='/Library/Developer/CommandLineTools/SDKs/MacOSX11.1.sdk'
Executing:  cd "/opt/local/var/macports/build/_opt_local_var_macports_sources_rsync.macports.org_macports_release_tarballs_ports_science_molden/molden/work/molden6.6" && /opt/local/bin/gmake -w all CC=/usr/bin/clang FC=/opt/local/bin/gfortran-mp-9 PREFIX=/opt/local
DEBUG: system:  cd "/opt/local/var/macports/build/_opt_local_var_macports_sources_rsync.macports.org_macports_release_tarballs_ports_science_molden/molden/work/molden6.6" && /opt/local/bin/gmake -w all CC=/usr/bin/clang FC=/opt/local/bin/gfortran-mp-9 PREFIX=/opt/local
gmake: Entering directory '/opt/local/var/macports/build/_opt_local_var_macports_sources_rsync.macports.org_macports_release_tarballs_ports_science_molden/molden/work/molden6.6'
/usr/bin/clang -g -std=gnu89 -Wno-return-type -DDARWIN -I/opt/local/include -DDOBACK -DHASTIMER -DCOLOR_OFFSET=0.0 -Wno-logical-op-parentheses   -c -o src/xwin.o src/xwin.c
src/xwin.c:8715:4: error: implicit declaration of function 'plinz_' [-Werror,-Wimplicit-function-declaration]
   plinz_(isel,istat,
   ^
src/xwin.c:8715:4: note: did you mean 'plinzz_'?
src/xwin.c:8702:6: note: 'plinzz_' declared here
void plinzz_(isel,istat)
     ^
src/xwin.c:8745:2: error: implicit declaration of function 'dumliz_' [-Werror,-Wimplicit-function-declaration]
        dumliz_(isel,blv,alphv,betv,
        ^
src/xwin.c:8745:2: note: did you mean 'dumlin_'?
src/xwin.c:8730:6: note: 'dumlin_' declared here
void dumlin_(isel,blv,alphv,betv)
     ^
src/xwin.c:8774:2: error: implicit declaration of function 'wlinz_' [-Werror,-Wimplicit-function-declaration]
        wlinz_(iun,iopt,igamb,
        ^
src/xwin.c:8774:2: note: did you mean 'wline_'?
src/xwin.c:8760:6: note: 'wline_' declared here
void wline_(iun,iopt,igamb)
     ^
src/xwin.c:8804:2: error: implicit declaration of function 'inpland_' [-Werror,-Wimplicit-function-declaration]
        inpland_(iat,jat,inp,outv,
        ^
src/xwin.c:8804:2: note: did you mean 'inplane_'?
src/xwin.c:8789:6: note: 'inplane_' declared here
void inplane_(iat,jat,inp,outv)
     ^
src/xwin.c:8830:2: error: implicit declaration of function 'wrzmaz_' [-Werror,-Wimplicit-function-declaration]
        wrzmaz_(iun,iopt,
        ^
src/xwin.c:8830:2: note: did you mean 'wrzmat_'?
src/xwin.c:8817:6: note: 'wrzmat_' declared here
void wrzmat_(iun,iopt)
     ^
src/xwin.c:8861:2: error: implicit declaration of function 'mapzzz_' [-Werror,-Wimplicit-function-declaration]
        mapzzz_(iun,imod,iff,izmtmp,istat,
        ^
src/xwin.c:8861:2: note: did you mean 'mapxzz_'?
src/xwin.c:8845:6: note: 'mapxzz_' declared here
void mapxzz_(iun,imod,iff,izmtmp,istat)
     ^
src/xwin.c:8888:2: error: implicit declaration of function 'fndmzz_' [-Werror,-Wimplicit-function-declaration]
        fndmzz_(ixyz,istat,zmptrp->imap);
        ^
src/xwin.c:8888:2: note: did you mean 'fndmaz_'?
src/xwin.c:8875:6: note: 'fndmaz_' declared here
void fndmaz_(ixyz,istat)
     ^
src/xwin.c:8912:2: error: implicit declaration of function 'chkmzz_' [-Werror,-Wimplicit-function-declaration]
        chkmzz_(istat,
        ^
src/xwin.c:8912:2: note: did you mean 'chkmaz_'?
src/xwin.c:8900:6: note: 'chkmaz_' declared here
void chkmaz_(istat)
     ^
src/xwin.c:8937:2: error: implicit declaration of function 'prtzz_' [-Werror,-Wimplicit-function-declaration]
        prtzz_(
        ^
src/xwin.c:8937:2: note: did you mean 'prtzm_'?
src/xwin.c:8926:6: note: 'prtzm_' declared here
void prtzm_()
     ^
src/xwin.c:8963:2: error: implicit declaration of function 'getzzz_' [-Werror,-Wimplicit-function-declaration]
        getzzz_(istat,
        ^
src/xwin.c:8963:2: note: did you mean 'getzmz_'?
src/xwin.c:8951:6: note: 'getzmz_' declared here
void getzmz_(istat)
     ^
src/xwin.c:8994:2: error: implicit declaration of function 'dumzz_' [-Werror,-Wimplicit-function-declaration]
        dumzz_(cc,ianc,nnatoms,
        ^
src/xwin.c:8994:2: note: did you mean 'dumzm_'?
src/xwin.c:8977:6: note: 'dumzm_' declared here
void dumzm_(cc,ianc,nnatoms)
     ^
src/xwin.c:9027:2: error: implicit declaration of function 'convzmzz_' [-Werror,-Wimplicit-function-declaration]
        convzmzz_(cc,ianc,nnatoms,igo,ico,ido,
        ^
src/xwin.c:9027:2: note: did you mean 'convzmat_'?
src/xwin.c:9010:6: note: 'convzmat_' declared here
void convzmat_(cc,ianc,nnatoms,igo,ico,ido)
     ^
src/xwin.c:9058:2: error: implicit declaration of function 'getmdp_' [-Werror,-Wimplicit-function-declaration]
        getmdp_(nnatoms,heat,igo,ico,istat,
        ^
src/xwin.c:9058:2: note: did you mean 'getmop_'?
src/xwin.c:9042:6: note: 'getmop_' declared here
void getmop_(nnatoms,heat,igo,ico,istat)
     ^
src/xwin.c:9089:2: error: implicit declaration of function 'getzd_' [-Werror,-Wimplicit-function-declaration]
        getzd_(nnatoms,igo,ico,istat,
        ^
src/xwin.c:9089:2: note: did you mean 'getzm_'?
src/xwin.c:9074:6: note: 'getzm_' declared here
void getzm_(nnatoms,igo,ico,istat)
     ^
src/xwin.c:9124:2: error: implicit declaration of function 'adffud_' [-Werror,-Wimplicit-function-declaration]
        adffud_(x,y,z,psi,
        ^
src/xwin.c:9124:2: note: did you mean 'adffun_'?
src/xwin.c:9109:6: note: 'adffun_' declared here
void adffun_(x,y,z,psi)
     ^
src/xwin.c:9151:2: error: implicit declaration of function 'addd_' [-Werror,-Wimplicit-function-declaration]
        addd_(imo,ipsi,iao,
        ^
src/xwin.c:9151:2: note: did you mean 'atdd_'?
src/xwin.c:9137:6: note: 'atdd_' declared here
void atdd_(imo,ipsi,iao)
     ^
src/xwin.c:9176:2: error: implicit declaration of function 'denmdd_' [-Werror,-Wimplicit-function-declaration]
        denmdd_(ido,
        ^
src/xwin.c:9176:2: note: did you mean 'denmad_'?
src/xwin.c:9164:6: note: 'denmad_' declared here
void denmad_(ido)
     ^
src/xwin.c:9202:2: error: implicit declaration of function 'densmad_' [-Werror,-Wimplicit-function-declaration]
        densmad_(ido,
        ^
src/xwin.c:9227:2: error: implicit declaration of function 'densmtd_' [-Werror,-Wimplicit-function-declaration]
        densmtd_(ido,
        ^
src/xwin.c:9227:2: note: did you mean 'densmto_'?
src/xwin.c:9215:6: note: 'densmto_' declared here
void densmto_(ido)
     ^
fatal error: too many errors emitted, stopping now [-ferror-limit=]
20 errors generated.
gmake: *** [<builtin>: src/xwin.o] Error 1
gmake: Leaving directory '/opt/local/var/macports/build/_opt_local_var_macports_sources_rsync.macports.org_macports_release_tarballs_ports_science_molden/molden/work/molden6.6'
Command failed:  cd "/opt/local/var/macports/build/_opt_local_var_macports_sources_rsync.macports.org_macports_release_tarballs_ports_science_molden/molden/work/molden6.6" && /opt/local/bin/gmake -w all CC=/usr/bin/clang FC=/opt/local/bin/gfortran-mp-9 PREFIX=/opt/local
Exit code: 2
Error: Failed to build molden: command execution failed
DEBUG: Error code: CHILDSTATUS 14089 2
DEBUG: Backtrace: command execution failed
    while executing
"system {*}$notty {*}$nice $fullcmdstring"
    invoked from within
"command_exec build"
    (procedure "portbuild::build_main" line 8)
    invoked from within
"$procedure $targetname"
Error: See /opt/local/var/macports/logs/_opt_local_var_macports_sources_rsync.macports.org_macports_release_tarballs_ports_science_molden/molden/main.log for details.
Error: Follow https://guide.macports.org/#project.tickets to report a bug.
Error: Processing of port molden failed 

Change History (2)

comment:1 Changed 3 months ago by jmroot (Joshua Root)

Owner: set to ryandesign
Status: newassigned

comment:2 Changed 3 months ago by jmroot (Joshua Root)

Resolution: duplicate
Status: assignedclosed
Note: See TracTickets for help on using tickets.