Opened 3 years ago

Closed 3 years ago

Last modified 3 years ago

#51149 closed defect (invalid)

QGIS not install

Reported by: news24lor Owned by: Veence (Vincent)
Priority: Normal Milestone:
Component: ports Version: 2.3.4
Keywords: Cc: mark.hash@…, aaschwanden (Andy Aschwanden), chris@…
Port: qgis

Description (last modified by mf2k (Frank Schima))

QGIS 2.14 does non install on OS X 10.11.x

These are the last rows of log file...

.......
:info:build /usr/bin/clang++   -pipe -Os -stdlib=libc++  -DSPATIALITE_VERSION_GE_4_0_0 -DSPATIALITE_VERSION_G_4_1_1 -DSPATIALITE_HAS_INIT_EX -std=c++11 -Wno-error=c++11-narrowing -Wall -Wextra -Wno-long-long -Wformat-security -Wno-strict-aliasing -Wno-return-type-c-linkage -Wno-overloaded-virtual -Qunused-arguments -DNDEBUG -arch x86_64 -mmacosx-version-min=10.11 -Wl,-search_paths_first -Wl,-headerpad_max_install_names  -L/opt/local/lib -Wl,-headerpad_max_install_names -Qunused-arguments -F/Library/Frameworks CMakeFiles/qgis_maplayerstylemanager.dir/testqgsmaplayerstylemanager.cpp.o CMakeFiles/qgis_maplayerstylemanager.dir/qgscompositionchecker.cpp.o CMakeFiles/qgis_maplayerstylemanager.dir/qgis_maplayerstylemanager_automoc.cpp.o  -o ../../../output/bin/qgis_maplayerstylemanager  -L/opt/local/var/macports/build/_opt_local_var_macports_sources_rsync.macports.org_release_tarballs_ports_gis_qgis/qgis/work/qgis-2.14.0/build/src/core  -L/opt/local/var/macports/build/_opt_local_var_macports_sources_rsync.macports.org_release_tarballs_ports_gis_qgis/qgis/work/qgis-2.14.0/build/src/gui  /opt/local/libexec/qt4/lib/libQtXml.dylib /opt/local/libexec/qt4/lib/libQtCore.dylib /opt/local/libexec/qt4/lib/libQtSvg.dylib /opt/local/libexec/qt4/lib/libQtTest.dylib /opt/local/lib/libproj.dylib /opt/local/lib/libgeos_c.dylib /opt/local/lib/libgdal.dylib ../../../output/lib/qgis_core.framework/Versions/2.14/qgis_core -framework CoreFoundation -framework IOKit /opt/local/libexec/qt4/lib/libQtXml.dylib /opt/local/libexec/qt4/lib/libQtCore.dylib /opt/local/libexec/qt4/lib/libQtGui.dylib /opt/local/libexec/qt4/lib/libQtNetwork.dylib /opt/local/libexec/qt4/lib/libQtSvg.dylib /opt/local/libexec/qt4/lib/libQtWebKit.dylib /opt/local/libexec/qt4/lib/libQtSql.dylib /opt/local/lib/libqca.dylib /opt/local/lib/libproj.dylib /opt/local/lib/libgeos_c.dylib /opt/local/lib/libgdal.dylib /opt/local/lib/libspatialindex.dylib /opt/local/lib/libexpat.dylib /opt/local/lib/libsqlite3.dylib /opt/local/lib/libspatialite.dylib -Wl,-rpath,/opt/local/lib 
:info:build make[2]: Leaving directory `/opt/local/var/macports/build/_opt_local_var_macports_sources_rsync.macports.org_release_tarballs_ports_gis_qgis/qgis/work/qgis-2.14.0/build'
:info:build make[2]: Leaving directory `/opt/local/var/macports/build/_opt_local_var_macports_sources_rsync.macports.org_release_tarballs_ports_gis_qgis/qgis/work/qgis-2.14.0/build'
:info:build [ 55%] Built target qgis_maplayertest
:info:build [ 55%] Built target qgis_symbolv2test
:info:build make[2]: Leaving directory `/opt/local/var/macports/build/_opt_local_var_macports_sources_rsync.macports.org_release_tarballs_ports_gis_qgis/qgis/work/qgis-2.14.0/build'
:info:build [ 55%] Built target qgis_maplayerstylemanager
:info:build make[1]: Leaving directory `/opt/local/var/macports/build/_opt_local_var_macports_sources_rsync.macports.org_release_tarballs_ports_gis_qgis/qgis/work/qgis-2.14.0/build'
:info:build make: *** [all] Error 2
:info:build make: Leaving directory `/opt/local/var/macports/build/_opt_local_var_macports_sources_rsync.macports.org_release_tarballs_ports_gis_qgis/qgis/work/qgis-2.14.0/build'
:info:build Command failed:  cd "/opt/local/var/macports/build/_opt_local_var_macports_sources_rsync.macports.org_release_tarballs_ports_gis_qgis/qgis/work/qgis-2.14.0/build" && /usr/bin/make -j4 -w all VERBOSE=ON 
:info:build Exit code: 2
:error:build org.macports.build for port qgis returned: command execution failed
:debug:build Error code: CHILDSTATUS 88030 2
:debug:build Backtrace: command execution failed
    while executing
"system -nice 0 $fullcmdstring"
    ("eval" body line 1)
    invoked from within
"eval system $notty $nice \$fullcmdstring"
    invoked from within
"command_exec build"
    (procedure "portbuild::build_main" line 8)
    invoked from within
"portbuild::build_main org.macports.build"
    ("eval" body line 1)
    invoked from within
"eval $procedure $targetname"
:info:build Warning: targets not executed for qgis: org.macports.activate org.macports.build org.macports.destroot org.macports.install
:notice:build Please see the log file for port qgis for details:
    /opt/local/var/macports/logs/_opt_local_var_macports_sources_rsync.macports.org_release_tarballs_ports_gis_qgis/qgis/main.log

Attachments (3)

patch-sip.diff (1.7 KB) - added by aaschwanden (Andy Aschwanden) 3 years ago.
Portfile (7.0 KB) - added by aaschwanden (Andy Aschwanden) 3 years ago.
Portfile.2 (7.0 KB) - added by aaschwanden (Andy Aschwanden) 3 years ago.

Download all attachments as: .zip

Change History (23)

comment:1 Changed 3 years ago by mf2k (Frank Schima)

Description: modified (diff)
Owner: changed from macports-tickets@… to vince@…
Port: qgis added

comment:2 Changed 3 years ago by garethsimons@…

Same problem for me.

comment:3 Changed 3 years ago by Veence (Vincent)

I'm on vacation at the moment. I'll look into this next week when I'm back home. Sorry for the delay. Please hold on.

comment:4 Changed 3 years ago by mark.hash@…

Hello, I have the same issue.

comment:5 Changed 3 years ago by mark.hash@…

Cc: mark.hash@… added

Cc Me!

comment:6 Changed 3 years ago by aaschwanden (Andy Aschwanden)

Cc: andy.aschwanden@… added

Cc Me!

comment:7 Changed 3 years ago by aaschwanden (Andy Aschwanden)

The error appears much earlier:

:info:build cd /opt/local/var/macports/build/_opt_local_var_macports_sources_rsync.macports.org_release_tarballs_ports_gis_qgis/qgis/work/qgis-2.14.0/build/tests/src/core && /usr/bin/clang++   -DPYTHON2 -DQT_CORE_LIB -DQT_GUI_LIB -DQT_NETWORK_LIB -DQT_NO_CAST_TO_ASCII -DQT_NO_DEBUG -DQT_SQL_LIB -DQT_SVG_LIB -DQT_WEBKIT_LIB -DQT_XML_LIB -DWITH_QTWEBKIT -isystem /opt/local/libexec/qt4/include -isystem /opt/local/libexec/qt4/include/QtSvg -isystem /opt/local/libexec/qt4/include/QtWebKit -isystem /opt/local/libexec/qt4/include/QtGui -isystem /opt/local/libexec/qt4/include/QtXml -isystem /opt/local/libexec/qt4/include/QtSql -isystem /opt/local/libexec/qt4/include/QtNetwork -isystem /opt/local/libexec/qt4/include/QtCore -I/opt/local/var/macports/build/_opt_local_var_macports_sources_rsync.macports.org_release_tarballs_ports_gis_qgis/qgis/work/qgis-2.14.0/build -I/opt/local/var/macports/build/_opt_local_var_macports_sources_rsync.macports.org_release_tarballs_ports_gis_qgis/qgis/work/qgis-2.14.0/tests/src/core -I/opt/local/var/macports/build/_opt_local_var_macports_sources_rsync.macports.org_release_tarballs_ports_gis_qgis/qgis/work/qgis-2.14.0/build/tests/src/core -I/opt/local/var/macports/build/_opt_local_var_macports_sources_rsync.macports.org_release_tarballs_ports_gis_qgis/qgis/work/qgis-2.14.0/src/core -I/opt/local/var/macports/build/_opt_local_var_macports_sources_rsync.macports.org_release_tarballs_ports_gis_qgis/qgis/work/qgis-2.14.0/src/core/auth -I/opt/local/var/macports/build/_opt_local_var_macports_sources_rsync.macports.org_release_tarballs_ports_gis_qgis/qgis/work/qgis-2.14.0/src/core/composer -I/opt/local/var/macports/build/_opt_local_var_macports_sources_rsync.macports.org_release_tarballs_ports_gis_qgis/qgis/work/qgis-2.14.0/src/core/geometry -I/opt/local/var/macports/build/_opt_local_var_macports_sources_rsync.macports.org_release_tarballs_ports_gis_qgis/qgis/work/qgis-2.14.0/src/core/effects -I/opt/local/var/macports/build/_opt_local_var_macports_sources_rsync.macports.org_release_tarballs_ports_gis_qgis/qgis/work/qgis-2.14.0/src/core/layertree -I/opt/local/var/macports/build/_opt_local_var_macports_sources_rsync.macports.org_release_tarballs_ports_gis_qgis/qgis/work/qgis-2.14.0/src/core/raster -I/opt/local/var/macports/build/_opt_local_var_macports_sources_rsync.macports.org_release_tarballs_ports_gis_qgis/qgis/work/qgis-2.14.0/src/core/symbology-ng -isystem /opt/local/include -isystem /opt/local/include/QtCrypto  -pipe -Os -stdlib=libc++  -DSPATIALITE_VERSION_GE_4_0_0 -DSPATIALITE_VERSION_G_4_1_1 -DSPATIALITE_HAS_INIT_EX -std=c++11 -Wno-error=c++11-narrowing -Wall -Wextra -Wno-long-long -Wformat-security -Wno-strict-aliasing -Wno-return-type-c-linkage -Wno-overloaded-virtual -Qunused-arguments -DNDEBUG -arch x86_64 -mmacosx-version-min=10.11   -DCORE_EXPORT= -DGUI_EXPORT= -DPYTHON_EXPORT= -DANALYSIS_EXPORT= -DAPP_EXPORT= -DCUSTOMWIDGETS_EXPORT= -DSERVER_EXPORT= -DTEST_DATA_DIR="\"/opt/local/var/macports/build/_opt_local_var_macports_sources_rsync.macports.org_release_tarballs_ports_gis_qgis/qgis/work/qgis-2.14.0/tests/testdata\"" -DINSTALL_PREFIX="\"/Applications/MacPorts/QGIS.app/Contents/MacOS\"" -o CMakeFiles/qgis_invertedpolygontest.dir/qgis_invertedpolygontest_automoc.cpp.o -c /opt/local/var/macports/build/_opt_local_var_macports_sources_rsync.macports.org_release_tarballs_ports_gis_qgis/qgis/work/qgis-2.14.0/build/tests/src/core/qgis_invertedpolygontest_automoc.cpp
:info:build /opt/local/var/macports/build/_opt_local_var_macports_sources_rsync.macports.org_release_tarballs_ports_gis_qgis/qgis/work/qgis-2.14.0/python/core/conversions.sip:735:7: error: member reference type 'QMap<qint64, QMap<int, QVariant> > *' (aka 'QMap<long long, QMap<int, QVariant> > *') is a pointer; did you mean to use '->'?
:info:build     qm.insert(k, *t);
:info:build     ~~^
:info:build       ->
:info:build /opt/local/var/macports/build/_opt_local_var_macports_sources_rsync.macports.org_release_tarballs_ports_gis_qgis/qgis/work/qgis-2.14.0/python/core/conversions.sip:735:18: error: no viable conversion from 'QVariant' to 'const QMap<int, QVariant>'
:info:build     qm.insert(k, *t);
:info:build                  ^~
:info:build /opt/local/libexec/qt4/include/QtCore/qmap.h:183:12: note: candidate constructor not viable: no known conversion from 'QVariant' to 'const QMap<int, QVariant> &' for 1st argument
:info:build     inline QMap(const QMap<Key, T> &other) : d(other.d)
:info:build            ^
:info:build /opt/local/libexec/qt4/include/QtCore/qmap.h:398:46: note: passing argument to parameter 'value' here
:info:build     iterator insert(const Key &key, const T &value);
:info:build                                              ^
:info:build [ 36%] Building CXX object tests/src/core/CMakeFiles/qgis_filewritertest.dir/qgis_filewritertest_automoc.cpp.o
:info:build [ 36%] Linking CXX executable ../../../output/bin/qgis_invertedpolygontest

It seems to be related to an upgrade of py27-sip from 4.17_0 to 4.18_0, I don't understand the issue but if I downgrade to 4.17_0 qgis compiles again

sudo port -vf deactivate py27-sip @4.18_0
sudo port -vf activate py27-sip @4.17_0

However, the python bindings then don't work. At QGIS startup, I get:

Traceback (most recent call last):
  File "", line 1, in 
  File "/Applications/MacPorts/QGIS.app/Contents/MacOS/../Resources/python/qgis/gui/__init__.py", line 26, in 
    from qgis._gui import *
RuntimeError: the sip module implements API v11.0 to v11.2 but the PyQt4.Qsci module requires API v11.3


Changed 3 years ago by aaschwanden (Andy Aschwanden)

Attachment: patch-sip.diff added

Changed 3 years ago by aaschwanden (Andy Aschwanden)

Attachment: Portfile added

comment:8 Changed 3 years ago by aaschwanden (Andy Aschwanden)

I found a solution here

https://github.com/OSGeo/homebrew-osgeo4mac/issues/129

and was able to create a patch file that works for me (see attachment). Please note that my updated Portfile downloads QGIS 2.14.1 instead of the current MacPorts version 2.14.0; I haven't had time to test the patch with 2.14.0. But maybe QGIS version should be bumped up to 2.14.1 anyway?

comment:9 Changed 3 years ago by aaschwanden (Andy Aschwanden)

It appears the py27-sip issues was fixed in QGIS 2.14.2, bumping up the Portfile to 2.14.2 solves the problem for me (see attached Portfile).

Changed 3 years ago by aaschwanden (Andy Aschwanden)

Attachment: Portfile.2 added

comment:10 Changed 3 years ago by Veence (Vincent)

I updated to 2.14.2 Is this bug fixed?

comment:11 in reply to:  10 Changed 3 years ago by news24lor

Replying to vince@…:

I updated to 2.14.2 Is this bug fixed?

Hi

I have updated all old packages without errors and I have installed new version of QGIS 2.14.2. There is an error at the end: it’s different from 2.14.0. The build goes until to 96% and after there's the error. It does not build the app. You can see the log.

Thanks again!!

Lorenzo

:info:build [ 96%] Linking CXX shared library ../../output/lib/libqgis_app.dylib :info:build cd /opt/local/var/macports/build/_opt_local_var_macports_sources_rsync.macports.org_release_tarballs_ports_gis_qgis/qgis/work/qgis-2.14.2/build/src/app && /opt/local/bin/cmake -E cmake_link_script CMakeFiles/qgis_app.dir/link.txt --verbose=ON :info:build /usr/bin/clang++ -pipe -Os -stdlib=libc++ -DSPATIALITE_VERSION_GE_4_0_0 -DSPATIALITE_VERSION_G_4_1_1 -DSPATIALITE_HAS_INIT_EX -std=c++11 -Wno-error=c++11-narrowing -Wall -Wextra -Wno-long-long -Wformat-security -Wno-strict-aliasing -Wno-return-type-c-linkage -Wno-overloaded-virtual -Qunused-arguments -fvisibility=hidden -fvisibility-inlines-hidden -DNDEBUG -arch x86_64 -mmacosx-version-min=10.11 -dynamiclib -Wl,-headerpad_max_install_names -L/opt/local/lib -Wl,-headerpad_max_install_names -Qunused-arguments -F/Library/Frameworks -compatibility_version 2.14.2 -current_version 2.14.2 -o ../../output/lib/libqgis_app.2.14.2.dylib -install_name /opt/local/var/macports/build/_opt_local_var_macports_sources_rsync.macports.org_release_tarballs_ports_gis_qgis/qgis/work/qgis-2.14.2/build/output/lib/libqgis_app.2.14.2.dylib CMakeFiles/qgis_app.dir/qgisapp.cpp.o CMakeFiles/qgis_app.dir/qgisappinterface.cpp.o CMakeFiles/qgis_app.dir/qgisappstylesheet.cpp.o CMakeFiles/qgis_app.dir/qgsabout.cpp.o CMakeFiles/qgis_app.dir/qgsalignrasterdialog.cpp.o CMakeFiles/qgis_app.dir/qgsapplayertreeviewmenuprovider.cpp.o CMakeFiles/qgis_app.dir/qgssponsors.cpp.o CMakeFiles/qgis_app.dir/qgsaddattrdialog.cpp.o CMakeFiles/qgis_app.dir/qgsaddtaborgroup.cpp.o CMakeFiles/qgis_app.dir/qgsjoindialog.cpp.o CMakeFiles/qgis_app.dir/qgsannotationwidget.cpp.o CMakeFiles/qgis_app.dir/qgsattributeactiondialog.cpp.o CMakeFiles/qgis_app.dir/qgsattributetypedialog.cpp.o CMakeFiles/qgis_app.dir/qgsattributetabledialog.cpp.o CMakeFiles/qgis_app.dir/qgsbookmarks.cpp.o CMakeFiles/qgis_app.dir/qgsbrowserdockwidget.cpp.o CMakeFiles/qgis_app.dir/qgsclipboard.cpp.o CMakeFiles/qgis_app.dir/qgsconfigureshortcutsdialog.cpp.o CMakeFiles/qgis_app.dir/qgscustomization.cpp.o CMakeFiles/qgis_app.dir/qgscustomprojectiondialog.cpp.o CMakeFiles/qgis_app.dir/qgsdecorationitem.cpp.o CMakeFiles/qgis_app.dir/qgsdecorationcopyright.cpp.o CMakeFiles/qgis_app.dir/qgsdecorationcopyrightdialog.cpp.o CMakeFiles/qgis_app.dir/qgsdecorationnortharrow.cpp.o CMakeFiles/qgis_app.dir/qgsdecorationnortharrowdialog.cpp.o CMakeFiles/qgis_app.dir/qgsdecorationscalebar.cpp.o CMakeFiles/qgis_app.dir/qgsdecorationscalebardialog.cpp.o CMakeFiles/qgis_app.dir/qgsdecorationgrid.cpp.o CMakeFiles/qgis_app.dir/qgsdecorationgriddialog.cpp.o CMakeFiles/qgis_app.dir/qgsdxfexportdialog.cpp.o CMakeFiles/qgis_app.dir/qgsformannotationdialog.cpp.o CMakeFiles/qgis_app.dir/qgsguivectorlayertools.cpp.o CMakeFiles/qgis_app.dir/qgshtmlannotationdialog.cpp.o CMakeFiles/qgis_app.dir/qgsdelattrdialog.cpp.o CMakeFiles/qgis_app.dir/qgsdiagramproperties.cpp.o CMakeFiles/qgis_app.dir/qgsdisplayangle.cpp.o CMakeFiles/qgis_app.dir/qgsfieldcalculator.cpp.o CMakeFiles/qgis_app.dir/qgsfieldsproperties.cpp.o CMakeFiles/qgis_app.dir/qgsidentifyresultsdialog.cpp.o CMakeFiles/qgis_app.dir/qgsfeatureaction.cpp.o CMakeFiles/qgis_app.dir/qgslabeldialog.cpp.o CMakeFiles/qgis_app.dir/qgslabelpropertydialog.cpp.o CMakeFiles/qgis_app.dir/qgslabelengineconfigdialog.cpp.o CMakeFiles/qgis_app.dir/qgslabelinggui.cpp.o CMakeFiles/qgis_app.dir/qgslabelingwidget.cpp.o CMakeFiles/qgis_app.dir/qgslabelpreview.cpp.o CMakeFiles/qgis_app.dir/qgsloadstylefromdbdialog.cpp.o CMakeFiles/qgis_app.dir/qgsmaplayerstyleguiutils.cpp.o CMakeFiles/qgis_app.dir/qgsrulebasedlabelingwidget.cpp.o CMakeFiles/qgis_app.dir/qgssavestyletodbdialog.cpp.o CMakeFiles/qgis_app.dir/qgsstatusbarcoordinateswidget.cpp.o CMakeFiles/qgis_app.dir/qgsversioninfo.cpp.o CMakeFiles/qgis_app.dir/qgswelcomepageitemsmodel.cpp.o CMakeFiles/qgis_app.dir/qgswelcomepage.cpp.o CMakeFiles/qgis_app.dir/qgsmaptooladdfeature.cpp.o CMakeFiles/qgis_app.dir/qgsmaptooladdpart.cpp.o CMakeFiles/qgis_app.dir/qgsmaptooladdring.cpp.o CMakeFiles/qgis_app.dir/qgsmaptoolfillring.cpp.o CMakeFiles/qgis_app.dir/qgsmaptoolannotation.cpp.o CMakeFiles/qgis_app.dir/qgsmaptoolchangelabelproperties.cpp.o CMakeFiles/qgis_app.dir/qgsmaptooldeletering.cpp.o CMakeFiles/qgis_app.dir/qgsmaptooldeletepart.cpp.o CMakeFiles/qgis_app.dir/qgsmaptoolfeatureaction.cpp.o CMakeFiles/qgis_app.dir/qgsmaptoolformannotation.cpp.o CMakeFiles/qgis_app.dir/qgsmaptoolhtmlannotation.cpp.o CMakeFiles/qgis_app.dir/qgsmaptoolpinlabels.cpp.o CMakeFiles/qgis_app.dir/qgsmaptoolshowhidelabels.cpp.o CMakeFiles/qgis_app.dir/qgsmaptoolidentifyaction.cpp.o CMakeFiles/qgis_app.dir/qgsmaptoollabel.cpp.o CMakeFiles/qgis_app.dir/qgsmaptoolmeasureangle.cpp.o CMakeFiles/qgis_app.dir/qgsmaptoolmovefeature.cpp.o CMakeFiles/qgis_app.dir/qgsmaptoolmovelabel.cpp.o CMakeFiles/qgis_app.dir/qgsmaptooloffsetcurve.cpp.o CMakeFiles/qgis_app.dir/qgsmaptoolreshape.cpp.o CMakeFiles/qgis_app.dir/qgsmaptoolrotatefeature.cpp.o CMakeFiles/qgis_app.dir/qgsmaptoolrotatelabel.cpp.o CMakeFiles/qgis_app.dir/qgsmaptoolrotatepointsymbols.cpp.o CMakeFiles/qgis_app.dir/qgsmaptoolselect.cpp.o CMakeFiles/qgis_app.dir/qgsmaptoolselectrectangle.cpp.o CMakeFiles/qgis_app.dir/qgsmaptoolselectfreehand.cpp.o CMakeFiles/qgis_app.dir/qgsmaptoolselectpolygon.cpp.o CMakeFiles/qgis_app.dir/qgsmaptoolselectradius.cpp.o CMakeFiles/qgis_app.dir/qgsmaptoolselectutils.cpp.o CMakeFiles/qgis_app.dir/qgsmaptoolsimplify.cpp.o CMakeFiles/qgis_app.dir/qgsmaptoolsplitfeatures.cpp.o CMakeFiles/qgis_app.dir/qgsmaptoolsplitparts.cpp.o CMakeFiles/qgis_app.dir/qgsmaptoolsvgannotation.cpp.o CMakeFiles/qgis_app.dir/qgsmaptooltextannotation.cpp.o CMakeFiles/qgis_app.dir/nodetool/qgsmaptoolnodetool.cpp.o CMakeFiles/qgis_app.dir/nodetool/qgsselectedfeature.cpp.o CMakeFiles/qgis_app.dir/nodetool/qgsvertexentry.cpp.o CMakeFiles/qgis_app.dir/nodetool/qgsnodeeditor.cpp.o CMakeFiles/qgis_app.dir/qgsmeasuredialog.cpp.o CMakeFiles/qgis_app.dir/qgsmeasuretool.cpp.o CMakeFiles/qgis_app.dir/qgsmergeattributesdialog.cpp.o CMakeFiles/qgis_app.dir/qgsoptions.cpp.o CMakeFiles/qgis_app.dir/qgspointrotationitem.cpp.o CMakeFiles/qgis_app.dir/qgspluginmetadata.cpp.o CMakeFiles/qgis_app.dir/qgspluginregistry.cpp.o CMakeFiles/qgis_app.dir/qgsprojectlayergroupdialog.cpp.o CMakeFiles/qgis_app.dir/qgsprojectproperties.cpp.o CMakeFiles/qgis_app.dir/qgsrastercalcdialog.cpp.o CMakeFiles/qgis_app.dir/qgsrasterlayerproperties.cpp.o CMakeFiles/qgis_app.dir/qgsrelationmanagerdialog.cpp.o CMakeFiles/qgis_app.dir/qgsrelationadddlg.cpp.o CMakeFiles/qgis_app.dir/qgsstatisticalsummarydockwidget.cpp.o CMakeFiles/qgis_app.dir/qgstextannotationdialog.cpp.o CMakeFiles/qgis_app.dir/qgsshortcutsmanager.cpp.o CMakeFiles/qgis_app.dir/qgssnappingdialog.cpp.o CMakeFiles/qgis_app.dir/qgssvgannotationdialog.cpp.o CMakeFiles/qgis_app.dir/qgsundowidget.cpp.o CMakeFiles/qgis_app.dir/qgstipgui.cpp.o CMakeFiles/qgis_app.dir/qgstipfactory.cpp.o CMakeFiles/qgis_app.dir/qgsvectorlayerproperties.cpp.o CMakeFiles/qgis_app.dir/qgsvisibilitypresets.cpp.o CMakeFiles/qgis_app.dir/qgshandlebadlayers.cpp.o CMakeFiles/qgis_app.dir/qgsmaptooladdcircularstring.cpp.o CMakeFiles/qgis_app.dir/qgsmaptoolcircularstringcurvepoint.cpp.o CMakeFiles/qgis_app.dir/qgsmaptoolcircularstringradius.cpp.o CMakeFiles/qgis_app.dir/composer/qgsattributeselectiondialog.cpp.o CMakeFiles/qgis_app.dir/composer/qgscomposer.cpp.o CMakeFiles/qgis_app.dir/composer/qgscomposerarrowwidget.cpp.o CMakeFiles/qgis_app.dir/composer/qgscomposerattributetablewidget.cpp.o CMakeFiles/qgis_app.dir/composer/qgscomposerhtmlwidget.cpp.o CMakeFiles/qgis_app.dir/composer/qgscomposerimageexportoptionsdialog.cpp.o CMakeFiles/qgis_app.dir/composer/qgscomposeritemwidget.cpp.o CMakeFiles/qgis_app.dir/composer/qgscomposerlabelwidget.cpp.o CMakeFiles/qgis_app.dir/composer/qgscomposerpicturewidget.cpp.o CMakeFiles/qgis_app.dir/composer/qgscomposermanager.cpp.o CMakeFiles/qgis_app.dir/composer/qgscomposermapwidget.cpp.o CMakeFiles/qgis_app.dir/composer/qgscomposerscalebarwidget.cpp.o CMakeFiles/qgis_app.dir/composer/qgscomposershapewidget.cpp.o CMakeFiles/qgis_app.dir/composer/qgscomposertablewidget.cpp.o CMakeFiles/qgis_app.dir/composer/qgscomposertablebackgroundcolorsdialog.cpp.o CMakeFiles/qgis_app.dir/composer/qgscomposerlegenditemdialog.cpp.o CMakeFiles/qgis_app.dir/composer/qgscomposerlegendlayersdialog.cpp.o CMakeFiles/qgis_app.dir/composer/qgscomposerlegendwidget.cpp.o CMakeFiles/qgis_app.dir/composer/qgscompositionwidget.cpp.o CMakeFiles/qgis_app.dir/composer/qgsatlascompositionwidget.cpp.o CMakeFiles/qgis_app.dir/legend/qgsapplegendinterface.cpp.o CMakeFiles/qgis_app.dir/ogr/qgsogrhelperfunctions.cpp.o CMakeFiles/qgis_app.dir/ogr/qgsopenvectorlayerdialog.cpp.o CMakeFiles/qgis_app.dir/ogr/qgsnewogrconnection.cpp.o CMakeFiles/qgis_app.dir/ogr/qgsvectorlayersaveasdialog.cpp.o CMakeFiles/qgis_app.dir/gps/qgsgpsinformationwidget.cpp.o CMakeFiles/qgis_app.dir/gps/qgsgpsmarker.cpp.o CMakeFiles/qgis_app.dir/openstreetmap/qgsosmdownloaddialog.cpp.o CMakeFiles/qgis_app.dir/openstreetmap/qgsosmimportdialog.cpp.o CMakeFiles/qgis_app.dir/openstreetmap/qgsosmexportdialog.cpp.o CMakeFiles/qgis_app.dir/pluginmanager/qgspluginmanager.cpp.o CMakeFiles/qgis_app.dir/pluginmanager/qgspluginmanager_texts.cpp.o CMakeFiles/qgis_app.dir/pluginmanager/qgsapppluginmanagerinterface.cpp.o CMakeFiles/qgis_app.dir/pluginmanager/qgspluginsortfilterproxymodel.cpp.o CMakeFiles/qgis_app.dir/pluginmanager/qgspluginitemdelegate.cpp.o CMakeFiles/qgis_app.dir/qgsnewspatialitelayerdialog.cpp.o CMakeFiles/qgis_app.dir/qgssettingstree.cpp.o CMakeFiles/qgis_app.dir/qgsvariantdelegate.cpp.o CMakeFiles/qgis_app.dir/moc_qgisapp.cxx.o CMakeFiles/qgis_app.dir/moc_qgisappinterface.cxx.o CMakeFiles/qgis_app.dir/moc_qgisappstylesheet.cxx.o CMakeFiles/qgis_app.dir/moc_qgsabout.cxx.o CMakeFiles/qgis_app.dir/moc_qgsaddattrdialog.cxx.o CMakeFiles/qgis_app.dir/moc_qgsalignrasterdialog.cxx.o CMakeFiles/qgis_app.dir/moc_qgsjoindialog.cxx.o CMakeFiles/qgis_app.dir/moc_qgsaddtaborgroup.cxx.o CMakeFiles/qgis_app.dir/moc_qgsannotationwidget.cxx.o CMakeFiles/qgis_app.dir/moc_qgsapplayertreeviewmenuprovider.cxx.o CMakeFiles/qgis_app.dir/moc_qgsattributeactiondialog.cxx.o CMakeFiles/qgis_app.dir/moc_qgsattributetypedialog.cxx.o CMakeFiles/qgis_app.dir/moc_qgsattributetabledialog.cxx.o CMakeFiles/qgis_app.dir/moc_qgsbookmarks.cxx.o CMakeFiles/qgis_app.dir/moc_qgsbrowserdockwidget.cxx.o CMakeFiles/qgis_app.dir/moc_qgsclipboard.cxx.o CMakeFiles/qgis_app.dir/moc_qgsconfigureshortcutsdialog.cxx.o CMakeFiles/qgis_app.dir/moc_qgscustomization.cxx.o CMakeFiles/qgis_app.dir/moc_qgscustomprojectiondialog.cxx.o CMakeFiles/qgis_app.dir/moc_qgsdecorationitem.cxx.o CMakeFiles/qgis_app.dir/moc_qgsdecorationcopyright.cxx.o CMakeFiles/qgis_app.dir/moc_qgsdecorationcopyrightdialog.cxx.o CMakeFiles/qgis_app.dir/moc_qgsdecorationnortharrow.cxx.o CMakeFiles/qgis_app.dir/moc_qgsdecorationnortharrowdialog.cxx.o CMakeFiles/qgis_app.dir/moc_qgsdecorationscalebar.cxx.o CMakeFiles/qgis_app.dir/moc_qgsdecorationscalebardialog.cxx.o CMakeFiles/qgis_app.dir/moc_qgsdecorationgrid.cxx.o CMakeFiles/qgis_app.dir/moc_qgsdecorationgriddialog.cxx.o CMakeFiles/qgis_app.dir/moc_qgsdelattrdialog.cxx.o CMakeFiles/qgis_app.dir/moc_qgsdiagramproperties.cxx.o CMakeFiles/qgis_app.dir/moc_qgsdisplayangle.cxx.o CMakeFiles/qgis_app.dir/moc_qgsdxfexportdialog.cxx.o CMakeFiles/qgis_app.dir/moc_qgsfeatureaction.cxx.o CMakeFiles/qgis_app.dir/moc_qgsfieldcalculator.cxx.o CMakeFiles/qgis_app.dir/moc_qgsfieldsproperties.cxx.o CMakeFiles/qgis_app.dir/moc_qgsformannotationdialog.cxx.o CMakeFiles/qgis_app.dir/moc_qgsguivectorlayertools.cxx.o CMakeFiles/qgis_app.dir/moc_qgshtmlannotationdialog.cxx.o CMakeFiles/qgis_app.dir/moc_qgsidentifyresultsdialog.cxx.o CMakeFiles/qgis_app.dir/moc_qgslabeldialog.cxx.o CMakeFiles/qgis_app.dir/moc_qgslabelengineconfigdialog.cxx.o CMakeFiles/qgis_app.dir/moc_qgslabelinggui.cxx.o CMakeFiles/qgis_app.dir/moc_qgslabelpreview.cxx.o CMakeFiles/qgis_app.dir/moc_qgslabelingwidget.cxx.o CMakeFiles/qgis_app.dir/moc_qgslabelpropertydialog.cxx.o CMakeFiles/qgis_app.dir/moc_qgsloadstylefromdbdialog.cxx.o CMakeFiles/qgis_app.dir/moc_qgsmaplayerstyleguiutils.cxx.o CMakeFiles/qgis_app.dir/moc_qgsrulebasedlabelingwidget.cxx.o CMakeFiles/qgis_app.dir/moc_qgssavestyletodbdialog.cxx.o CMakeFiles/qgis_app.dir/moc_qgsshortcutsmanager.cxx.o CMakeFiles/qgis_app.dir/moc_qgsstatusbarcoordinateswidget.cxx.o CMakeFiles/qgis_app.dir/moc_qgsversioninfo.cxx.o CMakeFiles/qgis_app.dir/moc_qgswelcomepageitemsmodel.cxx.o CMakeFiles/qgis_app.dir/moc_qgswelcomepage.cxx.o CMakeFiles/qgis_app.dir/moc_qgsmaptooladdfeature.cxx.o CMakeFiles/qgis_app.dir/moc_qgsmaptoolannotation.cxx.o CMakeFiles/qgis_app.dir/moc_qgsmaptoolcircularstringradius.cxx.o CMakeFiles/qgis_app.dir/moc_qgsmaptooladdpart.cxx.o CMakeFiles/qgis_app.dir/moc_qgsmaptooladdring.cxx.o CMakeFiles/qgis_app.dir/moc_qgsmaptoolfillring.cxx.o CMakeFiles/qgis_app.dir/moc_qgsmaptoolchangelabelproperties.cxx.o CMakeFiles/qgis_app.dir/moc_qgsmaptooldeletepart.cxx.o CMakeFiles/qgis_app.dir/moc_qgsmaptooldeletering.cxx.o CMakeFiles/qgis_app.dir/moc_qgsmaptoolfeatureaction.cxx.o CMakeFiles/qgis_app.dir/moc_qgsmaptoolformannotation.cxx.o CMakeFiles/qgis_app.dir/moc_qgsmaptoolhtmlannotation.cxx.o CMakeFiles/qgis_app.dir/moc_qgsmaptoolpinlabels.cxx.o CMakeFiles/qgis_app.dir/moc_qgsmaptoolshowhidelabels.cxx.o CMakeFiles/qgis_app.dir/moc_qgsmaptoolidentifyaction.cxx.o CMakeFiles/qgis_app.dir/moc_qgsmaptoolmeasureangle.cxx.o CMakeFiles/qgis_app.dir/moc_qgsmaptoolmovefeature.cxx.o CMakeFiles/qgis_app.dir/moc_qgsmaptoolmovelabel.cxx.o CMakeFiles/qgis_app.dir/moc_qgsmaptoollabel.cxx.o CMakeFiles/qgis_app.dir/moc_qgsmaptooloffsetcurve.cxx.o CMakeFiles/qgis_app.dir/moc_qgsmaptoolreshape.cxx.o CMakeFiles/qgis_app.dir/moc_qgsmaptoolrotatefeature.cxx.o CMakeFiles/qgis_app.dir/moc_qgsmaptoolrotatelabel.cxx.o CMakeFiles/qgis_app.dir/moc_qgsmaptoolrotatepointsymbols.cxx.o CMakeFiles/qgis_app.dir/moc_qgsmaptoolselectfreehand.cxx.o CMakeFiles/qgis_app.dir/moc_qgsmaptoolselect.cxx.o CMakeFiles/qgis_app.dir/moc_qgsmaptoolselectpolygon.cxx.o CMakeFiles/qgis_app.dir/moc_qgsmaptoolselectradius.cxx.o CMakeFiles/qgis_app.dir/moc_qgsmaptoolselectrectangle.cxx.o CMakeFiles/qgis_app.dir/moc_qgsmaptoolsimplify.cxx.o CMakeFiles/qgis_app.dir/moc_qgsmaptoolsplitfeatures.cxx.o CMakeFiles/qgis_app.dir/moc_qgsmaptoolsplitparts.cxx.o CMakeFiles/qgis_app.dir/moc_qgsmaptoolsvgannotation.cxx.o CMakeFiles/qgis_app.dir/moc_qgsmaptooltextannotation.cxx.o CMakeFiles/qgis_app.dir/moc_qgsmaptooladdcircularstring.cxx.o CMakeFiles/qgis_app.dir/moc_qgsmaptoolcircularstringcurvepoint.cxx.o CMakeFiles/qgis_app.dir/nodetool/moc_qgsmaptoolnodetool.cxx.o CMakeFiles/qgis_app.dir/nodetool/moc_qgsselectedfeature.cxx.o CMakeFiles/qgis_app.dir/nodetool/moc_qgsnodeeditor.cxx.o CMakeFiles/qgis_app.dir/moc_qgsmeasuredialog.cxx.o CMakeFiles/qgis_app.dir/moc_qgsmeasuretool.cxx.o CMakeFiles/qgis_app.dir/moc_qgsmergeattributesdialog.cxx.o CMakeFiles/qgis_app.dir/moc_qgsoptions.cxx.o CMakeFiles/qgis_app.dir/moc_qgsprojectlayergroupdialog.cxx.o CMakeFiles/qgis_app.dir/moc_qgsprojectproperties.cxx.o CMakeFiles/qgis_app.dir/moc_qgsrastercalcdialog.cxx.o CMakeFiles/qgis_app.dir/moc_qgsrasterlayerproperties.cxx.o CMakeFiles/qgis_app.dir/moc_qgsrelationmanagerdialog.cxx.o CMakeFiles/qgis_app.dir/moc_qgsrelationadddlg.cxx.o CMakeFiles/qgis_app.dir/moc_qgssnappingdialog.cxx.o CMakeFiles/qgis_app.dir/moc_qgssponsors.cxx.o CMakeFiles/qgis_app.dir/moc_qgsstatisticalsummarydockwidget.cxx.o CMakeFiles/qgis_app.dir/moc_qgssvgannotationdialog.cxx.o CMakeFiles/qgis_app.dir/moc_qgstextannotationdialog.cxx.o CMakeFiles/qgis_app.dir/moc_qgstipgui.cxx.o CMakeFiles/qgis_app.dir/moc_qgstipfactory.cxx.o CMakeFiles/qgis_app.dir/moc_qgsundowidget.cxx.o CMakeFiles/qgis_app.dir/moc_qgsvectorlayerproperties.cxx.o CMakeFiles/qgis_app.dir/moc_qgsvisibilitypresets.cxx.o CMakeFiles/qgis_app.dir/moc_qgshandlebadlayers.cxx.o CMakeFiles/qgis_app.dir/composer/moc_qgsattributeselectiondialog.cxx.o CMakeFiles/qgis_app.dir/composer/moc_qgscomposer.cxx.o CMakeFiles/qgis_app.dir/composer/moc_qgscomposerarrowwidget.cxx.o CMakeFiles/qgis_app.dir/composer/moc_qgscomposerattributetablewidget.cxx.o CMakeFiles/qgis_app.dir/composer/moc_qgscomposerhtmlwidget.cxx.o CMakeFiles/qgis_app.dir/composer/moc_qgscomposerimageexportoptionsdialog.cxx.o CMakeFiles/qgis_app.dir/composer/moc_qgscomposeritemwidget.cxx.o CMakeFiles/qgis_app.dir/composer/moc_qgscomposerlabelwidget.cxx.o CMakeFiles/qgis_app.dir/composer/moc_qgscomposerlegendwidget.cxx.o CMakeFiles/qgis_app.dir/composer/moc_qgscomposerlegenditemdialog.cxx.o CMakeFiles/qgis_app.dir/composer/moc_qgscomposerlegendlayersdialog.cxx.o CMakeFiles/qgis_app.dir/composer/moc_qgscomposermanager.cxx.o CMakeFiles/qgis_app.dir/composer/moc_qgscomposermapwidget.cxx.o CMakeFiles/qgis_app.dir/composer/moc_qgscomposerpicturewidget.cxx.o CMakeFiles/qgis_app.dir/composer/moc_qgscomposerscalebarwidget.cxx.o CMakeFiles/qgis_app.dir/composer/moc_qgscomposertablewidget.cxx.o CMakeFiles/qgis_app.dir/composer/moc_qgscomposertablebackgroundcolorsdialog.cxx.o CMakeFiles/qgis_app.dir/composer/moc_qgscomposershapewidget.cxx.o CMakeFiles/qgis_app.dir/composer/moc_qgscompositionwidget.cxx.o CMakeFiles/qgis_app.dir/composer/moc_qgsatlascompositionwidget.cxx.o CMakeFiles/qgis_app.dir/legend/moc_qgsapplegendinterface.cxx.o CMakeFiles/qgis_app.dir/ogr/moc_qgsopenvectorlayerdialog.cxx.o CMakeFiles/qgis_app.dir/ogr/moc_qgsnewogrconnection.cxx.o CMakeFiles/qgis_app.dir/ogr/moc_qgsvectorlayersaveasdialog.cxx.o CMakeFiles/qgis_app.dir/gps/moc_qgsgpsinformationwidget.cxx.o CMakeFiles/qgis_app.dir/openstreetmap/moc_qgsosmdownloaddialog.cxx.o CMakeFiles/qgis_app.dir/openstreetmap/moc_qgsosmimportdialog.cxx.o CMakeFiles/qgis_app.dir/openstreetmap/moc_qgsosmexportdialog.cxx.o CMakeFiles/qgis_app.dir/pluginmanager/moc_qgspluginmanager.cxx.o CMakeFiles/qgis_app.dir/pluginmanager/moc_qgsapppluginmanagerinterface.cxx.o CMakeFiles/qgis_app.dir/pluginmanager/moc_qgspluginsortfilterproxymodel.cxx.o CMakeFiles/qgis_app.dir/pluginmanager/moc_qgspluginitemdelegate.cxx.o CMakeFiles/qgis_app.dir/moc_qgsnewspatialitelayerdialog.cxx.o CMakeFiles/qgis_app.dir/moc_qgssettingstree.cxx.o CMakeFiles/qgis_app.dir/moc_qgsvariantdelegate.cxx.o -L/opt/local/var/macports/build/_opt_local_var_macports_sources_rsync.macports.org_release_tarballs_ports_gis_qgis/qgis/work/qgis-2.14.2/build/src/core -L/opt/local/var/macports/build/_opt_local_var_macports_sources_rsync.macports.org_release_tarballs_ports_gis_qgis/qgis/work/qgis-2.14.2/build/src/gui /opt/local/libexec/qt4/lib/libqwt.dylib /opt/local/libexec/qt4/lib/libQtSql.dylib /opt/local/libexec/qt4/lib/libQtUiTools.dylib /opt/local/libexec/qt4/lib/libQtWebKit.dylib /opt/local/lib/libgdal.dylib ../../output/lib/qgis_gui.framework/Versions/2.14/qgis_gui ../../output/lib/qgis_analysis.framework/Versions/2.14/qgis_analysis -framework ApplicationServices /opt/local/libexec/qt4/lib/libqwt.dylib /opt/local/libexec/qt4/lib/libQtUiTools.dylib /opt/local/libexec/qt4/lib/libqscintilla2.dylib ../../output/lib/qgis_core.framework/Versions/2.14/qgis_core -framework CoreFoundation -framework IOKit /opt/local/libexec/qt4/lib/libQtXml.dylib /opt/local/libexec/qt4/lib/libQtCore.dylib /opt/local/libexec/qt4/lib/libQtGui.dylib /opt/local/libexec/qt4/lib/libQtNetwork.dylib /opt/local/libexec/qt4/lib/libQtSvg.dylib /opt/local/libexec/qt4/lib/libQtSql.dylib /opt/local/libexec/qt4/lib/libQtWebKit.dylib /opt/local/lib/libqca.dylib /opt/local/lib/libproj.dylib /opt/local/lib/libgeos_c.dylib /opt/local/lib/libgdal.dylib /opt/local/lib/libspatialindex.dylib /opt/local/lib/libexpat.dylib /opt/local/lib/libsqlite3.dylib /opt/local/lib/libspatialite.dylib -Wl,-rpath,/opt/local/lib :info:build cd /opt/local/var/macports/build/_opt_local_var_macports_sources_rsync.macports.org_release_tarballs_ports_gis_qgis/qgis/work/qgis-2.14.2/build/src/app && /opt/local/bin/cmake -E cmake_symlink_library ../../output/lib/libqgis_app.2.14.2.dylib ../../output/lib/libqgis_app.2.14.2.dylib ../../output/lib/libqgis_app.dylib :info:build make[2]: Leaving directory `/opt/local/var/macports/build/_opt_local_var_macports_sources_rsync.macports.org_release_tarballs_ports_gis_qgis/qgis/work/qgis-2.14.2/build' :info:build [ 96%] Built target qgis_app :info:build make[1]: Leaving directory `/opt/local/var/macports/build/_opt_local_var_macports_sources_rsync.macports.org_release_tarballs_ports_gis_qgis/qgis/work/qgis-2.14.2/build' :info:build make: * [all] Error 2 :info:build make: Leaving directory `/opt/local/var/macports/build/_opt_local_var_macports_sources_rsync.macports.org_release_tarballs_ports_gis_qgis/qgis/work/qgis-2.14.2/build' :info:build Command failed: cd "/opt/local/var/macports/build/_opt_local_var_macports_sources_rsync.macports.org_release_tarballs_ports_gis_qgis/qgis/work/qgis-2.14.2/build" && /usr/bin/make -j4 -w all VERBOSE=ON :info:build Exit code: 2 :error:build org.macports.build for port qgis returned: command execution failed :debug:build Error code: CHILDSTATUS 70425 2 :debug:build Backtrace: command execution failed

while executing

"system -nice 0 $fullcmdstring"

("eval" body line 1) invoked from within

"eval system $notty $nice \$fullcmdstring"

invoked from within

"command_exec build"

(procedure "portbuild::build_main" line 8) invoked from within

"portbuild::build_main org.macports.build"

("eval" body line 1) invoked from within

"eval $procedure $targetname" :info:build Warning: targets not executed for qgis: org.macports.activate org.macports.build org.macports.destroot org.macports.install :notice:build Please see the log file for port qgis for details:

/opt/local/var/macports/logs/_opt_local_var_macports_sources_rsync.macports.org_release_tarballs_ports_gis_qgis/qgis/main.log

comment:12 in reply to:  10 Changed 3 years ago by aaschwanden (Andy Aschwanden)

Replying to vince@…:

I updated to 2.14.2 Is this bug fixed?

Works for me.

A.

comment:13 Changed 3 years ago by news24lor

I tried to re-install QGIS after updating the other packages. I have Mac OS X 10.11.5 and I have a new error. The build comes to 98%.

Thanks again.

:info:build [ 98%] Generating ../output/i18n/qgis_zh-Hans.qm :info:build cd /opt/local/var/macports/build/_opt_local_var_macports_sources_rsync.macports.org_release_tarballs_ports_gis_qgis/qgis/work/qgis-2.14.2/build/i18n && /opt/local/libexec/qt4/bin/lrelease -verbose /opt/local/var/macports/build/_opt_local_var_macports_sources_rsync.macports.org_release_tarballs_ports_gis_qgis/qgis/work/qgis-2.14.2/i18n/qgis_zh-Hans.ts -qm /opt/local/var/macports/build/_opt_local_var_macports_sources_rsync.macports.org_release_tarballs_ports_gis_qgis/qgis/work/qgis-2.14.2/build/output/i18n/qgis_zh-Hans.qm :info:build Updating '/opt/local/var/macports/build/_opt_local_var_macports_sources_rsync.macports.org_release_tarballs_ports_gis_qgis/qgis/work/qgis-2.14.2/build/output/i18n/qgis_vi.qm'... :info:build Generated 10716 translation(s) (10631 finished and 85 unfinished) :info:build Ignored 6704 untranslated source text(s) :info:build [ 98%] Generating ../output/i18n/qgis_zh-Hant.qm :info:build cd /opt/local/var/macports/build/_opt_local_var_macports_sources_rsync.macports.org_release_tarballs_ports_gis_qgis/qgis/work/qgis-2.14.2/build/i18n && /opt/local/libexec/qt4/bin/lrelease -verbose /opt/local/var/macports/build/_opt_local_var_macports_sources_rsync.macports.org_release_tarballs_ports_gis_qgis/qgis/work/qgis-2.14.2/i18n/qgis_zh-Hant.ts -qm /opt/local/var/macports/build/_opt_local_var_macports_sources_rsync.macports.org_release_tarballs_ports_gis_qgis/qgis/work/qgis-2.14.2/build/output/i18n/qgis_zh-Hant.qm :info:build Generated 17420 translation(s) (17420 finished and 0 unfinished) :info:build Updating '/opt/local/var/macports/build/_opt_local_var_macports_sources_rsync.macports.org_release_tarballs_ports_gis_qgis/qgis/work/qgis-2.14.2/build/output/i18n/qgis_zh-Hans.qm'... :info:build Generated 16889 translation(s) (16884 finished and 5 unfinished) :info:build Ignored 531 untranslated source text(s) :info:build Updating '/opt/local/var/macports/build/_opt_local_var_macports_sources_rsync.macports.org_release_tarballs_ports_gis_qgis/qgis/work/qgis-2.14.2/build/output/i18n/qgis_zh-Hant.qm'... :info:build Generated 15271 translation(s) (15256 finished and 15 unfinished) :info:build Ignored 2149 untranslated source text(s) :info:build Generated 14402 translation(s) (14331 finished and 71 unfinished) :info:build Ignored 3018 untranslated source text(s) :info:build make[2]: Leaving directory `/opt/local/var/macports/build/_opt_local_var_macports_sources_rsync.macports.org_release_tarballs_ports_gis_qgis/qgis/work/qgis-2.14.2/build' :info:build [ 98%] Built target translations :info:build make[1]: Leaving directory `/opt/local/var/macports/build/_opt_local_var_macports_sources_rsync.macports.org_release_tarballs_ports_gis_qgis/qgis/work/qgis-2.14.2/build' :info:build make: * [all] Error 2 :info:build make: Leaving directory `/opt/local/var/macports/build/_opt_local_var_macports_sources_rsync.macports.org_release_tarballs_ports_gis_qgis/qgis/work/qgis-2.14.2/build' :info:build Command failed: cd "/opt/local/var/macports/build/_opt_local_var_macports_sources_rsync.macports.org_release_tarballs_ports_gis_qgis/qgis/work/qgis-2.14.2/build" && /usr/bin/make -j4 -w all VERBOSE=ON :info:build Exit code: 2 :error:build org.macports.build for port qgis returned: command execution failed :debug:build Error code: CHILDSTATUS 35474 2 :debug:build Backtrace: command execution failed

while executing

"system -nice 0 $fullcmdstring"

("eval" body line 1) invoked from within

"eval system $notty $nice \$fullcmdstring"

invoked from within

"command_exec build"

(procedure "portbuild::build_main" line 8) invoked from within

"portbuild::build_main org.macports.build"

("eval" body line 1) invoked from within

"eval $procedure $targetname" :info:build Warning: targets not executed for qgis: org.macports.activate org.macports.build org.macports.destroot org.macports.install :notice:build Please see the log file for port qgis for details:

/opt/local/var/macports/logs/_opt_local_var_macports_sources_rsync.macports.org_release_tarballs_ports_gis_qgis/qgis/main.log

comment:14 in reply to:  10 Changed 3 years ago by BuddyVolly

Replying to vince@…:

I updated to 2.14.2 Is this bug fixed?

For me it is not working. Almost the problem as Lorenzo. Last version that worked was 2.12

:info:build cd /opt/local/var/macports/build/_opt_local_var_macports_sources_rsync.macports.org_release_tarballs_ports_gis_qgis/qgis/work/qgis-2.14.2/build/src/app && /opt/local/bin/cmake -E cmake_symlink_library ../../output/lib/libqgis_app.2.14.2.dylib ../../output/lib/libqgis_app.2.14.2.dylib ../../output/lib/libqgis_app.dylib :info:build make[2]: Leaving directory `/opt/local/var/macports/build/_opt_local_var_macports_sources_rsync.macports.org_release_tarballs_ports_gis_qgis/qgis/work/qgis-2.14.2/build' :info:build [ 96%] Built target qgis_app :info:build make[1]: Leaving directory `/opt/local/var/macports/build/_opt_local_var_macports_sources_rsync.macports.org_release_tarballs_ports_gis_qgis/qgis/work/qgis-2.14.2/build' :info:build make: * [all] Error 2 :info:build make: Leaving directory `/opt/local/var/macports/build/_opt_local_var_macports_sources_rsync.macports.org_release_tarballs_ports_gis_qgis/qgis/work/qgis-2.14.2/build' :info:build Command failed: cd "/opt/local/var/macports/build/_opt_local_var_macports_sources_rsync.macports.org_release_tarballs_ports_gis_qgis/qgis/work/qgis-2.14.2/build" && /usr/bin/make -j8 -w all VERBOSE=ON :info:build Exit code: 2 :error:build org.macports.build for port qgis returned: command execution failed :debug:build Error code: CHILDSTATUS 7470 2 :debug:build Backtrace: command execution failed

while executing

"system -nice 0 $fullcmdstring"

("eval" body line 1) invoked from within

"eval system $notty $nice \$fullcmdstring"

invoked from within

"command_exec build"

(procedure "portbuild::build_main" line 8) invoked from within

"portbuild::build_main org.macports.build"

("eval" body line 1) invoked from within

"eval $procedure $targetname" :info:build Warning: targets not executed for qgis: org.macports.activate org.macports.build org.macports.destroot org.macports.install :notice:build Please see the log file for port qgis for details:

/opt/local/var/macports/logs/_opt_local_var_macports_sources_rsync.macports.org_release_tarballs_ports_gis_qgis/qgis/main.log

comment:15 Changed 3 years ago by chris@…

Cc: chris@… added

Cc Me!

comment:16 in reply to:  3 Changed 3 years ago by chris@…

Replying to vince@…:

Not working for me either (OSX 10.10.5, qgis 2.14.2, py27-sip 4.18_0). Same symptoms as Andreas (comment 14 above).

Might be a python interface problem still - lots of warnings in the log file about deprecated materials?

E.g.

:info:build sip: Deprecation warning: /opt/local/share/py27-sip/PyQt4/QtGui/qmessagebox.sip:181: /DocValue/ is deprecated :info:build :info:build sip: Deprecation warning: /opt/local/share/py27-sip/PyQt4/QtGui/qmessagebox.sip:181: /DocValue/ is deprecated :info:build :info:build sip: Deprecation warning: /opt/local/share/py27-sip/PyQt4/QtGui/qmessagebox.sip:184: /DocValue/ is deprecated :info:build :info:build sip: Deprecation warning: /opt/local/share/py27-sip/PyQt4/QtGui/qmessagebox.sip:268: SIP_RXOBJ_CON is deprecated :info:build :info:build sip: Deprecation warning: /opt/local/share/py27-sip/PyQt4/QtGui/qmessagebox.sip:268: SIP_SLOT_CON is deprecated :info:build :info:build sip: Deprecation warning: /opt/local/share/py27-sip/PyQt4/QtGui/qpagesetupdialog.sip:109: SIP_RXOBJ_CON is deprecated :info:build :info:build sip: Deprecation warning: /opt/local/share/py27-sip/PyQt4/QtGui/qpagesetupdialog.sip:109: SIP_SLOT_CON is deprecated :info:build :info:build sip: Deprecation warning: /opt/local/share/py27-sip/PyQt4/QtGui/qpagesetupdialog.sip:167: SIP_RXOBJ_CON is deprecated :info:build :info:build sip: Deprecation warning: /opt/local/share/py27-sip/PyQt4/QtGui/qpagesetupdialog.sip:167: SIP_SLOT_CON is deprecated :info:build :info:build sip: Deprecation warning: /opt/local/share/py27-sip/PyQt4/QtGui/qpainter.sip:675: /DocType/ is deprecated :info:build :info:build sip: Deprecation warning: /opt/local/share/py27-sip/PyQt4/QtGui/qpainter.sip:701: /DocType/ is deprecated :info:build :info:build sip: Deprecation warning: /opt/local/share/py27-sip/PyQt4/QtGui/qpainter.sip:701: /DocType/ is deprecated

comment:17 Changed 3 years ago by news24lor

There is an error in a httplib2 python module. QGIS did not built this module....

make[2]: Entering directory `/opt/local/var/macports/build/_opt_local_var_macports_sources_rsync.macports.org_release_tarballs_ports_gis_qgis/qgis/work/qgis-2.14.3/build' cd /opt/local/var/macports/build/_opt_local_var_macports_sources_rsync.macports.org_release_tarballs_ports_gis_qgis/qgis/work/qgis-2.14.3/build && /opt/local/bin/cmake -E cmake_depends "Unix Makefiles" /opt/local/var/macports/build/_opt_local_var_macports_sources_rsync.macports.org_release_tarballs_ports_gis_qgis/qgis/work/qgis-2.14.3 /opt/local/var/macports/build/_opt_local_var_macports_sources_rsync.macports.org_release_tarballs_ports_gis_qgis/qgis/work/qgis-2.14.3/python/ext-libs /opt/local/var/macports/build/_opt_local_var_macports_sources_rsync.macports.org_release_tarballs_ports_gis_qgis/qgis/work/qgis-2.14.3/build /opt/local/var/macports/build/_opt_local_var_macports_sources_rsync.macports.org_release_tarballs_ports_gis_qgis/qgis/work/qgis-2.14.3/build/python/ext-libs /opt/local/var/macports/build/_opt_local_var_macports_sources_rsync.macports.org_release_tarballs_ports_gis_qgis/qgis/work/qgis-2.14.3/build/python/ext-libs/CMakeFiles/pyhttplib2.dir/DependInfo.cmake --color= Error copying file "init.py" to "/opt/local/var/macports/build/_opt_local_var_macports_sources_rsync.macports.org_release_tarballs_ports_gis_qgis/qgis/work/qgis-2.14.3/build/output/python/qgis". make[2]: Leaving directory `/opt/local/var/macports/build/_opt_local_var_macports_sources_rsync.macports.org_release_tarballs_ports_gis_qgis/qgis/work/qgis-2.14.3/build' make[2]: * [pyutils] Error 1 make[2]: Leaving directory `/opt/local/var/macports/build/_opt_local_var_macports_sources_rsync.macports.org_release_tarballs_ports_gis_qgis/qgis/work/qgis-2.14.3/build' make[1]: * [python/CMakeFiles/pyutils.dir/all] Error 2 make[1]: * Waiting for unfinished jobs.... /Applications/Xcode.app/Contents/Developer/usr/bin/make -f CMakeFiles/version.dir/build.make CMakeFiles/version.dir/build make[2]: Entering directory `/opt/local/var/macports/build/_opt_local_var_macports_sources_rsync.macports.org_release_tarballs_ports_gis_qgis/qgis/work/qgis-2.14.3/build' make[2]: Nothing to be done for `CMakeFiles/version.dir/build'. make[2]: Leaving directory `/opt/local/var/macports/build/_opt_local_var_macports_sources_rsync.macports.org_release_tarballs_ports_gis_qgis/qgis/work/qgis-2.14.3/build' make[2]: Entering directory `/opt/local/var/macports/build/_opt_local_var_macports_sources_rsync.macports.org_release_tarballs_ports_gis_qgis/qgis/work/qgis-2.14.3/build' cd /opt/local/var/macports/build/_opt_local_var_macports_sources_rsync.macports.org_release_tarballs_ports_gis_qgis/qgis/work/qgis-2.14.3/build && /opt/local/bin/cmake -E cmake_depends "Unix Makefiles" /opt/local/var/macports/build/_opt_local_var_macports_sources_rsync.macports.org_release_tarballs_ports_gis_qgis/qgis/work/qgis-2.14.3 /opt/local/var/macports/build/_opt_local_var_macports_sources_rsync.macports.org_release_tarballs_ports_gis_qgis/qgis/work/qgis-2.14.3/src/ui /opt/local/var/macports/build/_opt_local_var_macports_sources_rsync.macports.org_release_tarballs_ports_gis_qgis/qgis/work/qgis-2.14.3/build /opt/local/var/macports/build/_opt_local_var_macports_sources_rsync.macports.org_release_tarballs_ports_gis_qgis/qgis/work/qgis-2.14.3/build/src/ui /opt/local/var/macports/build/_opt_local_var_macports_sources_rsync.macports.org_release_tarballs_ports_gis_qgis/qgis/work/qgis-2.14.3/build/src/ui/CMakeFiles/ui.dir/DependInfo.cmake --color= make[2]: Leaving directory `/opt/local/var/macports/build/_opt_local_var_macports_sources_rsync.macports.org_release_tarballs_ports_gis_qgis/qgis/work/qgis-2.14.3/build' /Applications/Xcode.app/Contents/Developer/usr/bin/make -f python/ext-libs/CMakeFiles/pyhttplib2.dir/build.make python/ext-libs/CMakeFiles/pyhttplib2.dir/build [ 95%] Built target version make[2]: Entering directory `/opt/local/var/macports/build/_opt_local_var_macports_sources_rsync.macports.org_release_tarballs_ports_gis_qgis/qgis/work/qgis-2.14.3/build' cd /opt/local/var/macports/build/_opt_local_var_macports_sources_rsync.macports.org_release_tarballs_ports_gis_qgis/qgis/work/qgis-2.14.3/python/ext-libs && /opt/local/bin/cmake -E copy_directory httplib2 /opt/local/var/macports/build/_opt_local_var_macports_sources_rsync.macports.org_release_tarballs_ports_gis_qgis/qgis/work/qgis-2.14.3/build/output/python/httplib2 make[2]: Leaving directory `/opt/local/var/macports/build/_opt_local_var_macports_sources_rsync.macports.org_release_tarballs_ports_gis_qgis/qgis/work/qgis-2.14.3/build' /Applications/Xcode.app/Contents/Developer/usr/bin/make -f src/ui/CMakeFiles/ui.dir/build.make src/ui/CMakeFiles/ui.dir/build Error copying directory from "httplib2" to "/opt/local/var/macports/build/_opt_local_var_macports_sources_rsync.macports.org_release_tarballs_ports_gis_qgis/qgis/work/qgis-2.14.3/build/output/python/httplib2". make[2]: * [pyhttplib2] Error 1 make[2]: Leaving directory `/opt/local/var/macports/build/_opt_local_var_macports_sources_rsync.macports.org_release_tarballs_ports_gis_qgis/qgis/work/qgis-2.14.3/build' make[1]: * [python/ext-libs/CMakeFiles/pyhttplib2.dir/all] Error 2 make[2]: Entering directory `/opt/local/var/macports/build/_opt_local_var_macports_sources_rsync.macports.org_release_tarballs_ports_gis_qgis/qgis/work/qgis-2.14.3/build' make[2]: Nothing to be done for `src/ui/CMakeFiles/ui.dir/build'. make[2]: Leaving directory `/opt/local/var/macports/build/_opt_local_var_macports_sources_rsync.macports.org_release_tarballs_ports_gis_qgis/qgis/work/qgis-2.14.3/build' [ 95%] Built target ui make[1]: Leaving directory `/opt/local/var/macports/build/_opt_local_var_macports_sources_rsync.macports.org_release_tarballs_ports_gis_qgis/qgis/work/qgis-2.14.3/build' make: * [all] Error 2 make: Leaving directory `/opt/local/var/macports/build/_opt_local_var_macports_sources_rsync.macports.org_release_tarballs_ports_gis_qgis/qgis/work/qgis-2.14.3/build' fismet-bruni:build ben$

comment:18 Changed 3 years ago by Veence (Vincent)

Resolution: invalid
Status: newclosed

Please retry with the new 2.16 version, reopen a bug if necessary. Thanks!

comment:19 in reply to:  18 Changed 3 years ago by news24lor

Replying to vince@…:

Please retry with the new 2.16 version, reopen a bug if necessary. Thanks!

Resolved!! QGIS run now !!

Thank you very much!

comment:20 Changed 3 years ago by Veence (Vincent)

Perfetto! Buon divertimento a disegnare mappe! :)

Note: See TracTickets for help on using tickets.