wiki:SierraProblems

macOS Sierra Problems

General Issues

First of all, please read Migration.

Updating MacPorts Base

MacPorts must be re-installed in a version configured for macOS 10.12 Sierra.

Ensure you have Xcode 8.0 or greater installed and selected (e.g. sudo xcode-select -s /Applications/Xcode.app/Contents/Developer), and that you have the command line tools installed (xcode-select --install). You also have to agree to the license by running sudo xcodebuild -license.

Tickets for Broken Ports

#52245
cups-pdf mainly broken on El Capitan OS X 10.11
#53095
gnuplot @5.0.5@ on macOS 10.12.1 doesn't show a wxt terminal persistently
#55247
py27-pyqt4-4.12.1_0+phonon: fatal error: 'abstractaudiooutput.h' file not found
#56996
libgcc45, gcc47, gcc48: error: non-local symbol required in directive
#64327
clang-9.0 @9.0.1_4+analyzer+libstdcxx+universal Failed to build on macOS Sierra 10.12.6 (16G2136) with Xcode 9.2 (9C40b)
#64475
rb30-nokogiri, rb31-nokogiri: ERROR: Failed to build gem native extension
#65807
flyctl @0.0.388: package net/netip is not in GOROOT
#66905
alex @3.2.7.1: ld: file not found: /usr/lib/system/libsystem_darwin.dylib
#67510
symengine @0.9.0: Undefined symbols: "_futimens"
#68438
draco @1.5.6: error: no member named 'utimensat' in the global namespace
#69122
smtube fails to display video previews if built with Qt4: SSL issue?
#69268
mpv-legacy: no audio during playback, [vo/gpu] opengl cocoa backend is deprecated, use vo=libmpv instead
#69347
rocksdb: clang builds fail on < 10.13: error: aligned allocation function of type 'void *(std::size_t, std::align_val_t)' is only available on macOS 10.13 or newer
#69410
rb*-unf_ext tries to link against libstdc++ on 10.7–10.12 with clang

#52323
aquaterm fails to build on 10.12 sierra
#52559
py27-numpy fresh installation on Sierra fails test
#52661
Gedit error in mac sierra
#53168
python27: Python Frameworks not codesigned in MacOS Sierra
#53305
arm-elf-gcc3 @3.4.6_2: fails on Sierra - - undefined symbols
#53573
arm-elf-gcc build failed on Sierra 10.12.2
#53702
arm-none-linux-gnueabi-gcc @2005q3-2: fails on Sierra - Undefined symbols for architecture x86_64
#57067
SIerra: issue with assembler "as" in conjunction with gfortran
#57676
sshfs 2.x unable to create mount points (Sierra/High Sierra and later)
#59780
cmake fails to build on Leopard 10.5: error: 'shared_mutex' is unavailable: introduced in macOS 10.12
#63004
emacs-app-devel @20210430_1+nativecomp+rsvg does not work on mac OS High Sierra, 10.13.6
#63785
rspamd @3.1: builds failing for macOS 10.12 and earlier
#64155
bazel: builds failing for macOS 10.12 through 10.15
#64612
nomad: builds failing for 10.12 and earlier: 'hclfmt' consistently crashes with SIGSEGV
#64805
libprelude: python bindings fail to build on OSX 10.12 and earlier, due to lack of 'fmemopen'
#65456
Build msp430-gcc-devel failed on High Sierra
#65778
libfilezilla @0.32.0: link fails for 10.7 thru 10.12: undefined symbols for std::bad_variant_access
#66039
lzma not building on macOS 12 when targeting 10.12
#66050
p7zip does not install when building for 10.12 SDK due to missing Corefoundation.h
#66267
MySQL 8.0.31 failed to be built with macports-clang-15 on macOS <= 10.12 Sierra
#66671
llvm-15 @15.0.6 Failure to install on High Sierra
#66953
cmake @3.24.3: Does not compile with SDK 10.12
#67069
openjdk17 @17.0.6_0 install failed on Mac OS 10.12.6
#67112
openjdk17: Build failure on High Sierra and earlier
#67411
cpp-peglib fails on 10.7–10.12: Undefined symbols for architecture x86_64: "typeinfo for std::bad_any_cast"
#67641
libopenmpt fail on 10.6–10.12 x86_64: Undefined symbols for architecture x86_64: "typeinfo for std::bad_variant_access"
#67964
R-arrow fails on 10.14, 10.12 and earlier: Symbol not found: __ZNSt3__16__itoa8__u32toaEjPc (10.14), __ZNSt19bad_optional_accessD1Ev (10.12)
#68350
gcc12@12.3.0_3 - Fails to Upgrade and Build on High Sierra

Last modified 6 years ago Last modified on Sep 27, 2017, 4:38:03 PM