wiki:larryv

Lawrence Velázquez

"I'm larryv and I approve this pull request." —jmr

Tickets for things that are not ports

Reported by me

#40035
base aborts if current directory does not exist, even when given a port name
#44786
list of dependencies to be installed can be inaccurate
#48051
Installing a port +universal needlessly reinstalls recursive dependencies +universal

Assigned to me

#15712
Add versions to platforms
#36950
Local Port Repo Instructions Should Address Permissions Issue
#37583
base: Update m4/tcl.m4 to check for tcl8.6
#40035
base aborts if current directory does not exist, even when given a port name
#52092
mp-buildbot: use tools curl instead of macOS curl
#52763
Git: pre-commit-hook should check whether mentioned PR IDs do exist
#52810
Enhance buildbot email to include links to failing builds instead of just all builds

CC’d to me

#12048
RFE: Document all the code in the MacPorts base
#12247
BUG: Makefiles require GNU make
#15059
ENH: Add vulnerability (update) notification / detection
#16336
Allow multiple ports to satisfy a single dependency
#18952
Stray .TMP files on distfiles mirrors
#25970
Variant names should be treated case-insensitively
#29172
remove dependency on Xcode
#32261
Allow building on a RAM disk or other secondary disk
#34841
Each MacPorts install adds a $PATH variable even if it already exists; Also, puts it after rvm $PATH variable
#36957
Guide: Document the "subport" command
#37853
RFE: "port provides" should return a different message when used on files provided by base
#38095
RFE: Automatically check tickets for common mistakes before allowing users to submit them
#38265
selfupdate should fetch tarball over HTTP
#39659
configure script does not expand "~" for applications_dir and frameworks_dir
#40656
Use -isystem instead of -I in default configure.cppflags
#41722
livecheck and distfiles overwrite main.log
#44067
use "configure.includes {path1 path2}" instead of "configure.cppflags -I{path1} -I{path2}"
#44413
Use a compiler wrapper script
#45010
RFE: stop "port test" immediately if no test phase defined
#45274
Run portbuild::build_main once for each build.target
#45851
port should scan for DYLIB missing the TWOLEVEL flag
#46956
base should keep track of explicitly requested variants on install and only preserve those on upgrade
#47442
port: new action_environment and/or environment mode
#49759
fetch.type {git,bzr} hits buildbot timeout after 20 minutes without output
#51995
buildbot improvements
#52000
Add xz to "base" to allow changing the default compression format to .tar.xz in the future
#52161
mp-buildbot: incorrect error message when a port cannot be installed due to arch mismatch
#52327
Buildbot fails incorrectly if calculated dependency tree becomes invalid during installation
#52455
Buildbot: use GitHub authentication
#52575
Report Xcode version and other useful information in main.log
#52742
buildbot: add support for building ports with variants
#52921
buildbot: don't say "failed to calculate dependencies" when dependencies are in fact missing

Tickets for ports

Reported by me

#38219
squirrel @3.0.4: add +universal variant
#39182
MacVim @7.3.snapshot66_3: should use vim's vimfiles directory
#46461
p5.16-macosx-file @0.710.0_4: tests fail
#47203
jnethack @3.4.3-0.11_0: patch-sys_unix_Makefile.doc.diff fails to apply
#47205
nefu @1.4.0_1: build fails with "No rule to make target `libtest/libtest.a' "

Assigned to me

#18140
squeak @3.9: version 4.3 available
#19397
py-scipy: not completely universal
#28291
mzscheme: PLT Scheme upgrade and name change to Racket
#29752
*_select: add man pages
#36667
HandBrakeCLI @0.10.0_0: cannot link to libiconv
#37616
New port request: Sherpa
#38151
Submission: rzip64 - a large-file compression program
#38219
squirrel @3.0.4: add +universal variant
#38907
Resolving libjpeg-turbo + jpeg Port conflicts
#39197
New port: RStudio
#40478
gcc-4.8 (and likely earlier) build incorrectly +universal
#41366
gcc48: asan (address sanitizer) is broken
#41972
latex2man @1.23: imprecise dependency on texlive
#41973
Add "enable-ec_nistp_64_gcc_128" variant to openssl?
#42702
libtool drops dylibs at link time
#43662
indent: gnuindent -kr crashes
#44667
gcc49 @4.9.3: build fails on Leopard
#45681
libgcc @4.9.2: build fails with 10 parallel jobs
#45811
gcc49: thread sanitizer is broken
#45885
lang/bcpl ?
#46216
gcc49: add patch 0049-Enable-SPE-AltiVec-generation
#46331
libtool contains references to ccache when it was built with ccache
#46431
llvm does not have manpage
#46461
p5.16-macosx-file @0.710.0_4: tests fail
#46568
`port select --set <group>` does not symlink the correct Python utilities
#46909
py-doit @0.27.0
#47579
cmake portgroup: an option to specify non-default location of CMakeLists.txt
#47642
HandBrakeCLI: fatal error: 'libavutil/samplefmt.h' file not found
#48620
HandBrakeCLI @0.10.0: error: unexpected token in argument list
#49129
HandBrakeCLI @0.10.0: configure.py: error: invalid xcconfig: osx1011.x86_64
#49219
HandBrakeCLI @0.10.0: m4: error: unable to find utility "m4", not a developer tool or in PATH
#51815
librsvg @2.40.16 does not build on PPC Mac OS X 10.5.8, Leopard, because of "./libtool: eval: line 1085: syntax error near unexpected token `|' "
#53155
HandBrake @0.10.0: update to 1.2.2
#55652
Cannot destroot libtool 2.4.6_4
#57203
pcreposix segfault in regfree with trivial program
#57291
tmux-pasteboard: update to 2.7
#58209
isl-devel @0.15-20150513: Please update or delete
#58612
mpvim @109868: moved to GitHub
#59924
openssl won't install when used in trace mode
#60018
libjpeg-turbo @2.0.3+universal: Undefined symbols for architecture x86_64

CC’d to me

#19405
git: move docs to new port
#22066
gcc44, gcc45, gcc46, gcc48, gcc49, gcc5: error trying to exec 'ecj1': execvp: No such file or directory
#25598
GNAT GPL 2010 now available, update portfile to use it?
#29763
*_select framework does not apply to Perl: fix provided
#32799
request for ffmbc port
#34130
subversion: mod_dav_svn subport
#35474
RFE: Have curl-ca-bundle install individual .pem files in ${prefix}/etc/openssl/certs
#36366
xine-ui build fails with load.c:64:15: error: incomplete definition of type 'struct png_info_def'
#38513
maloc @1.5: make documentation into a variant
#38551
gcc48: "ar" does not work (complains about missing 'liblto_plugin.so')
#38878
gettext: Use macports libtool and thus support compilation against libc++
#39339
R-app @1.61: build failure on 10.6.8
#40548
libgcc: configure: error: GNU Fortran is not working; please report a bug
#40892
Add variant to default to using SSH
#41343
python extension module builds missing -I/opt/local/include
#42777
gcc47/gcc48 - problem with linking some C++ python extensions (std::ostringstream)
#42957
Replace GitX port with GitX-dev
#43869
libgcc @4.8.2_1: error: '_Unwind_Ptr' does not name a type
#43903
LaTeXiT: update to 2.6.1, cannot rebuild current version
#44274
gcc47 Issue?
#45506
nspr does not build archs consistently
#45619
gcc43, gcc44, gcc45, gcc47, gcc48, gcc49, gcc5: move libgcj pkgconfig file to default path
#45836
nlopt: Please add nlopt port
#46168
gcc49: ../../scripts/check_jni_methods.sh: line 14: /tmp/check-jni-methods.75098.1: Permission denied
#46366
namebench @1.3.1: can't open file 'setup.py': [Errno 2] No such file or directory
#46469
libgcc-devel @5-20150104: ld: absolute addressing (perhaps -mdynamic-no-pic) used in _byte_common_op_match_null_string_p from ../libiberty/pic/libiberty.a(regex.o) not allowed in slidable image
#46642
apple-gcc42 @5666.3_14 +bootstrap on Tiger PPC fails to build
#46724
Update libxslt for Python 3
#47049
gfortran backtrace issue
#47255
making port:xz optionally independent of other ports
#47288
sbcl @1.2.9 fails building on a 10.5.8 PPC
#47332
gcc46 @4.6.4_7 gfortran internal compiler error related to procedure pointers
#47392
MP4Joiner: add dependency on cctools and pkgconfig, revbump
#47491
port lang/nim
#47776
ld64 @2 Add wrapper script to select compatible linker
#47929
llvm-gcc42 @2336.11_2 fails building on 10.6.8
#47974
arm-none-linux-gnueabi-gcc: stdio.h: No such file or directory
#48004
Internal compiler error (gcc-5.1.0) when using math.h on Yosemite
#48647
`port select gcc` sets default C++ compiler
#49039
go @1.4.2: fails to build with tracemode
#49640
Failed to configure libtool
#50000
perl5: improve / reimplement packaging
#50821
python24, python25, python26, python27, python31, python32, python33, python34, python35: Fix building for strange architecture combinations
#51123
request: port:libclang-XY
#51535
perl5 portgroup: revise version numbering
#51736
python35 @3.5.2_0 fails to build with macosx_deployment_target 10.7
#52290
perl5: cannot be built as ppc/i386 universal on x86_64
#53201
cmake: doesn't recognize macports-clang (No known features for CXX compiler)
#53230
preparing port:qt5-kde step 2 : the qt5 PortGroup(s)
#54131
llvm-3.7 @3.7.1_4: Faulty LLVMConfig.cmake
#54972
clang-devel @devel-r365158+analyzer+assertions+libstdcxx: patch warning
#56223
clang-6.0 unused regex?
#56644
HandBrakeCLI, AtomicParsley, p5-encode-detect are using libstdc++ (this installation is configured to use libc++)
#57498
lldb-7.0: error: use of undeclared identifier 'vm_kernel_page_size'
#58042
port request: lld
#58437
pcre, pcre2 jit libraries hang calling functions, resulting in segmentation faults
#58712
clang-7.0 and clang-8.0 are missing atomic builtins on i386
#58917
llvm-8.0 fails to build on older sytems (darwin 13 and less) when go is installed, as it tries to build the go bindings but go needs special attention to work on these systems
#59342
llvm-config uses incorrect SDK taken from xcode rather than command-line tools
#59785
llvm ports opportunistically build ocaml binding even when +ocaml variant is not selected; leads to conflicts between them
#60173
clang-9.0@9.0.1 +debug Failed to destroot clang-9.0: reinplace sed(1) failed
#60388
OpenSSL fails to build - common symbols not allowed with MH_DYLIB output format

Last modified 4 years ago Last modified on Nov 4, 2016, 5:10:55 PM