wiki:nicos

Nicolas Pavillon

Reported Tickets

No results

Assigned Tickets

No results

Followed Ports

No results

My Ports

Qt

Qtiplot

#66937
qtiplot: Issue about size of buttons

Java

Jabref

No results

Djview

Djvulibre, Djview, Pdf2djvu, Djvu2pdf

#47443
Reducing the dependencies of ImageMagick (djvulibre)
#64643
djview fails for ppc+ppc64: fatal error: lipo: can't open input file: /opt/local/var/macports/build/_opt_local_var_macports_sources_rsync.macports.org_macports_release_tarballs_ports_aqua_djview/djview/work/.tmp/ccqJPUZL.out (No such file or directory)
#66683
djview color mismatch on Ventura M1 Pro
#68386
djvulibre: build fails for 'divuextract', due to numerous undefined symbols; possible xcode 15 issue

Math

OpenBlas

#48834
add variants openblas, superlu, and tbb to armadillo
#57479
gmt5: seems to link opportunistically to OpenBLAS
#57994
OpenBLAS compilation fails on MacBook Pro MacOS 10.14
#58635
scalapack @2.02+gcc9+openmpi+openblas: error: expected expression before '_Static_assert'
#63072
py39-numpy @1.20.3_0+gcc11+openblas fails to build on aarch64
#63582
openblas @0.3.18_0+gcc11+lapack [+native] : (Intel) does not build because MAX_CPU_NUMBER is undefined
#63630
OpenBLAS @0.3.18_0+gcc7+lapack+native: Builds ppc7400 on a G3
#65236
OpenBLAS @0.3.20_0+gcc11+lapack+native build failure on intel mac 11.6.5: gcc is putting out x86-pad-for-align=false but assembler is not accepting it
#65521
py-numpy should default to Accelerate rather than OpenBlas on macOS 11.3+
#66948
OpenBLAS @0.3.25 does not build universal arm64/x86_64
#67698
petsc @3.15.0+gcc12+fftw+hdf5+openblas+netcdf+openmpi Error on configure due to zlib
#68296
scalapack-2.2.0_1+gfortran+mpich+openblas configure fails arm64
#68359
py27-numpy @1.16.6_3+gfortran+openblas: ld: duplicate LC_RPATH '/opt/local/lib/libgcc' in '/opt/local/lib/libopenblas-r1.dylib'
#68402
OpenBLAS @0.3.24: failed to destroot
#68507
OpenBLAS: some recent change in Macports broken finding OpenBLAS with Clang builds for some ports
#68783
OpenBLAS @0.3.25_2: installs /opt/local/include/openblas/openblas/lapacke_mangling.h
#68868
OpenBLAS, OpenBLAS-devel now broken on PowerPC [FIXED]
#69143
OpenBLAS @0.3.25: Update to 0.3.26
#69308
elmerfem @2023.12.13_0+gcc13+openblas: This file was generated using the moc from 5.15.12. It cannot be used with the include files from this version of Qt.
#69326
py-numpy @1.26.2 +openblas: Fails to configure with OpenBLAS, defaults to Accelerate

KDE ports

KDE Base

Kdelibs4, Kactivities, Nepomuk-core, Nepomuk-widgets, Kdepimlibs4, Oxygen-icons, Kde4-runtime, Kde4-baseapps

#36749
kdelibs4 doesn't respect startupitem
#37087
kdelibs4 mobile profile
#41177
kdepimlibs4 fails to build on 10.6.8.1 / 2.2.1
#42673
kde4-baseapps build failure on OS X 10.6.8
#44398
kdelibs4 configure failure
#44882
[developer] kdelibs4 4.14/git/master portfile and directory
#49296
kdelibs4::FindMySQL.cmake
#53733
Multiple problems with kdelibs4 port
#56426
kdelibs4 @4.14.3_10 won't build on High Sierra
#57554
kdelibs4 : address alignment issues in the native Aqua style
#62105
kdelibs4 @ 4.14.3_15: build failure on Catalina
#62880
smokekde @4.14.3_5 +debug+docs: Undefined symbols for architecture x86_64 with kdelibs4+osxkeychain
#67881
kdelibs4 does not find some installed ports which it needs
#68452
kdelibs4 @4.14.3_110 +debug+docs+osxkeychain: onto2vocabularyclass segfaults during build

KDE Auxiliary

Analitza, Kde-wallpapers, Kate, Konsole, Kdeartwork, Kdetoys4, Kdewebdev

#32007
Port Request: Perl Syntax::Highlight::Engine::Kate
#33387
kbuildsycoca4 error 88500 after installing kdewebdev
#40729
kate @4.11.2_0 unexpected behavior with dynamic word wrap
#49307
kate @4.14.3_0: screen refreshing problem
#50008
submission: kf5-kate
#50148
sudo port install kate goes to sleep on El Capitan 10.11.2
#59708
Kate @4.14.3_5 build failure: Failed to generate ICNS

KDE Misc

Kde4-kile, Kdevplatform, Kdevelop

#39153
Kdevelop will not launch after successful installation
#48675
kde4-kile: Associating with .tex files for opening a file by double-clicking
#58027
kde4-kile: not opening on Mojave
#62471
kde4-kile @2.1.3_6: "replace" command not working

Kdegraphics

Gwenview, Kamera, Kcolorchooser, Kdegraphics-strigi-analyzer, Kdegraphics-thumbnailers, Kolourpaint, Kruler, Ksaneplugin, Libkdcraw, Libkexiv2, Libkipi, Libksane, Mobipocket, Okular, Svgpart

#37297
libkdcraw: LLVM ERROR: Cannot yet select: 0x100cb5b10: f32 = ConstantFP<0.000000e+00> [ORD=625] [ID=4]
#45910
okular @0.6.4 makes broken screen when scrolling
#47628
okular @4.14.3_1 reloads djvu files repeatedly
#48796
okular and kspaceduel both crash after successful build/install
#56889
libkdcraw does not build against libraw-0.19.0
#66407
Okular installation not working in Ventura13.0.1(arm64)

Kdeutils

Ark, Kde4-filelight, Kcalc, Kcharselect, Kdiskfree, Kgpg, Ktimer, Kwallet, Sweeper, Kfloppy

#26293
Wireshark ChmodBPF
#26294
wireshark in applications_dir
#36137
Option to mark a port for installation when the port is fixed
#38005
wireshark doesn't build without libpng
#39538
wireshark @1.10.0_1: Install ws_symbol_export.h
#48835
wireshark @1.12.7: Build fails with lua 5.3
#49730
wireshark will not start on PowerPC OS X 10.5.8
#50143
new port: kf5-kwalletmanager
#50343
wireshark build fails: 'QtGui/QAction' file not found
#51837
wireshark2 @2.0.4: This application failed to start because it could not find or load the Qt platform plugin "cocoa" in "".
#53249
wireshark2 +qt5: fails to compile without c++11
#55508
autorequested (mark some unrequested leaves as requested)
#58705
glark: Update to 1.10.5
#59218
QLMarkdown and QLColorcode fail on Catalina 10.15
#61395
apache-spark @[2.4,3.0] [2.4.7,3.0.1]: new port submission
#63441
wireshark3@3.4.7 +lua Permission deined - build failure
#65302
darktable/inkscape/gimp: unable to access user files, when run via app bundle on big sur or monterey
#66086
QLMarkdown fails to build on MacOS Monterey
#66918
MacOSX10.7.sdk and MacOSX10.9.sdk: Marked as broken by rev-upgrade
#67061
kcalc @4.14.3_3: Assertion failure in -[NSNib initWithContentsOfURL:], NSNib.m:65, Terminating app due to uncaught exception 'NSInternalInconsistencyException', reason: 'Deprecated in 10.8.'
#67187
cmark: library install name contains full version number
#67703
gd license should not be marked as conflicting with GPL
#67763
celt: mark obsolete, since merged into libopus
#67823
R-commonmark Macports page duplicates test deps as lib deps
#69035
darktable, darktable-devel: error: too many arguments to function call

Kdeedu

Libkdeedu, Blinken, Cantor, Kalgebra, Kalzium, Kanagram, Kbruch, Kgeography, Khangman, Kig, Kiten, Klettres, Kmplot, Kstars, Ktouch, Kturtle, Kwordquiz, Marble, Parley, Rocs, Step

#16384
gnustep portgroup reinplace didn't change anything in ...
#16425
gnustep-back: build failure on Leopard: Segmentation fault
#20245
freetype variant for GNUstep
#20775
gnustep-base: gnustep-config: command not found
#28063
gnustep-base configure fails on 10.6, "I don't seem to be able to use your Objective-C compiler to produce working binaries"
#28273
gnustep-gui fails to install
#30788
gnustep-make-cocoa: installs files containing -arch flags
#53230
preparing port:qt5-kde step 2 : the qt5 PortGroup(s)
#53977
buildbot: add a checkbox to add an additional step that runs the test suite
#63548
gnustep-gui gnustep-base building
#66517
kiten @4.14.3_3 +debug+docs: error: ordered comparison between pointer and zero
#66519
rocs @4.14.3_6 +debug+docs: fatal error: too many errors emitted, stopping now [-ferror-limit=] (c++11-related?)
#66897
teleport @11.3.2: build step errors fetching packages
#69081
step-cli @0.25.1: checksum mismatch

Kdebindings

Kross-interpreters, Smokegen, Smokeqt, Smokekde, Qyoto, Kimono, Qtruby, Korundum, Perlqt, Perlkde

#40500
smokeqt configure fails
#49621
qyoto @ 4.14.3: fails to build on Yosemite
#62880
smokekde @4.14.3_5 +debug+docs: Undefined symbols for architecture x86_64 with kdelibs4+osxkeychain

Kdemultimedia

Dragon, Ffmpegthumbs, Juk, Kmix, Kscd, Libkcompactdisc, Libkcddb, Mplayerthumbs

No results

Kdeadmin

Kcron, Ksystemlog, kuser

No results

Kdesdk

Cervisia, Dolphin-plugins, Kapptemplate, Kcachegrind4, Kdesdk-strigi-analyzers, Kdesdk-kioslaves, Kdesdk-thumbnailers, Kde-dev-scripts, Kde-dev-utils, Kompare, Lokalize, Okteta, Poxml, Umbrello

#40522
kcachegrind4: Allow use of unixODBC
#49135
port:kdesdk-kioslaves : make build against subversion 1.9+
#50094
new ports: kf5-{libkomparediff2,kompare}
#53731
umbrello: Use qt5 instead of qt4
#64703
umbrello: display flickers and using code import wizard results in null pointer read attempt
#66706
Umbrello crashes at launch

Kdenetwork

Kdenetwork-filesharing, Kdenetwork-strigi-analyzers, Kdnssd, Kget, Kopete, Krdc

#47769
libgcrypt abort/crash when using krdc to connect to an OS X host

Kdegames

Bomber, Bovo, Granatier, Kapman, Katomic, Kblackbox, Kblocks, Kbounce, Kbreakout, Kdiamond, Kfourinline, Kgoldrunner, Kigo, Killbots, Kiriki, Kjumpingcube, Klickety, Klines, Kmahjongg, Kmines, Knavalbattle, Knetwalk, Kolf, Kollision, Konquest, Kpat, Kreversi, Kshisen, Ksirk, Ksnakeduel, Kspaceduel, Ksquares, Ksudoku, Ktuberling, Kubrick, Lskat, Palapeli, Picmi

#48796
okular and kspaceduel both crash after successful build/install
#50246
CMake PortGroup : generate a file in ${workpath} containing the complete cmake invocation
#66681
jack @1.9.21: error: static_assert failed "fCounter must be aligned within JackAtomicState"

KDE language packages

kde-l10n-*

No results

Misc

Libxls

#69141
libxls @1.6.2_0: configure.ac:76: error: possibly undefined macro: AM_ICONV

Last modified 9 years ago Last modified on Nov 18, 2014, 11:15:29 AM